maven-notifications mailing list archives

Site index · List index
Message view « Date » · « Thread »
Top « Date » · « Thread »
From Apache Jenkins Server <jenk...@builds.apache.org>
Subject Build unstable in Jenkins: Maven TLP » maven-dependency-analyzer » MSHARED-674_Detect_Java_8_type_annotations #5
Date Wed, 18 Jul 2018 19:05:38 GMT
See https://builds.apache.org/job/maven-box/job/maven-dependency-analyzer/job/MSHARED-674_Detect_Java_8_type_annotations/5/

Changes:

* Add jenkinsEnv#nodeSelection to globally finetune node selection
* Try another expression
* INFRA-16749, INFRA-16768  - Trying to keep workspace clean
* INFRA-16749, INFRA-16768  - Followup
* INFRA-16749, INFRA-16768  - Followup temporarily failFast = false.
* Used the wrong comment style.
* Exclude ubuntu-eu2 due to lack of disk space
* Apply jenkinsEnv.nodeSelection

20 tests failed.
FAILED:  org.apache.maven.shared.dependency.analyzer.DefaultProjectDependencyAnalyzerTest.testJarWithXmlTransitiveDependency

Error Message:
null

Stack Trace:
java.lang.NullPointerException: null
	at org.apache.commons.lang3.SystemUtils.isJavaVersionAtLeast(SystemUtils.java:1626)
	at org.apache.maven.shared.dependency.analyzer.DefaultProjectDependencyAnalyzerTest.compileProject(DefaultProjectDependencyAnalyzerTest.java:342)
	at org.apache.maven.shared.dependency.analyzer.DefaultProjectDependencyAnalyzerTest.compileProject(DefaultProjectDependencyAnalyzerTest.java:337)
	at org.apache.maven.shared.dependency.analyzer.DefaultProjectDependencyAnalyzerTest.testJarWithXmlTransitiveDependency(DefaultProjectDependencyAnalyzerTest.java:262)


FAILED:  org.apache.maven.shared.dependency.analyzer.DefaultProjectDependencyAnalyzerTest.testJarWithNoDependencies

Error Message:
null

Stack Trace:
java.lang.NullPointerException: null
	at org.apache.commons.lang3.SystemUtils.isJavaVersionAtLeast(SystemUtils.java:1626)
	at org.apache.maven.shared.dependency.analyzer.DefaultProjectDependencyAnalyzerTest.compileProject(DefaultProjectDependencyAnalyzerTest.java:342)
	at org.apache.maven.shared.dependency.analyzer.DefaultProjectDependencyAnalyzerTest.compileProject(DefaultProjectDependencyAnalyzerTest.java:337)
	at org.apache.maven.shared.dependency.analyzer.DefaultProjectDependencyAnalyzerTest.testJarWithNoDependencies(DefaultProjectDependencyAnalyzerTest.java:111)


FAILED:  org.apache.maven.shared.dependency.analyzer.DefaultProjectDependencyAnalyzerTest.testPom

Error Message:
null

Stack Trace:
java.lang.NullPointerException: null
	at org.apache.commons.lang3.SystemUtils.isJavaVersionAtLeast(SystemUtils.java:1626)
	at org.apache.maven.shared.dependency.analyzer.DefaultProjectDependencyAnalyzerTest.compileProject(DefaultProjectDependencyAnalyzerTest.java:342)
	at org.apache.maven.shared.dependency.analyzer.DefaultProjectDependencyAnalyzerTest.compileProject(DefaultProjectDependencyAnalyzerTest.java:337)
	at org.apache.maven.shared.dependency.analyzer.DefaultProjectDependencyAnalyzerTest.testPom(DefaultProjectDependencyAnalyzerTest.java:97)


FAILED:  org.apache.maven.shared.dependency.analyzer.DefaultProjectDependencyAnalyzerTest.testForceDeclaredDependenciesUsage

Error Message:
null

Stack Trace:
java.lang.NullPointerException: null
	at org.apache.commons.lang3.SystemUtils.isJavaVersionAtLeast(SystemUtils.java:1626)
	at org.apache.maven.shared.dependency.analyzer.DefaultProjectDependencyAnalyzerTest.compileProject(DefaultProjectDependencyAnalyzerTest.java:342)
	at org.apache.maven.shared.dependency.analyzer.DefaultProjectDependencyAnalyzerTest.compileProject(DefaultProjectDependencyAnalyzerTest.java:337)
	at org.apache.maven.shared.dependency.analyzer.DefaultProjectDependencyAnalyzerTest.testForceDeclaredDependenciesUsage(DefaultProjectDependencyAnalyzerTest.java:198)


FAILED:  org.apache.maven.shared.dependency.analyzer.DefaultProjectDependencyAnalyzerTest.testJarWithTestDependency

Error Message:
null

Stack Trace:
java.lang.NullPointerException: null
	at org.apache.commons.lang3.SystemUtils.isJavaVersionAtLeast(SystemUtils.java:1626)
	at org.apache.maven.shared.dependency.analyzer.DefaultProjectDependencyAnalyzerTest.compileProject(DefaultProjectDependencyAnalyzerTest.java:342)
	at org.apache.maven.shared.dependency.analyzer.DefaultProjectDependencyAnalyzerTest.compileProject(DefaultProjectDependencyAnalyzerTest.java:337)
	at org.apache.maven.shared.dependency.analyzer.DefaultProjectDependencyAnalyzerTest.testJarWithTestDependency(DefaultProjectDependencyAnalyzerTest.java:232)


FAILED:  org.apache.maven.shared.dependency.analyzer.DefaultProjectDependencyAnalyzerTest.testJarWithCompileDependency

Error Message:
null

Stack Trace:
java.lang.NullPointerException: null
	at org.apache.commons.lang3.SystemUtils.isJavaVersionAtLeast(SystemUtils.java:1626)
	at org.apache.maven.shared.dependency.analyzer.DefaultProjectDependencyAnalyzerTest.compileProject(DefaultProjectDependencyAnalyzerTest.java:342)
	at org.apache.maven.shared.dependency.analyzer.DefaultProjectDependencyAnalyzerTest.compileProject(DefaultProjectDependencyAnalyzerTest.java:337)
	at org.apache.maven.shared.dependency.analyzer.DefaultProjectDependencyAnalyzerTest.testJarWithCompileDependency(DefaultProjectDependencyAnalyzerTest.java:174)


FAILED:  org.apache.maven.shared.dependency.analyzer.DefaultProjectDependencyAnalyzerTest.testJava8methodRefs

Error Message:
null

Stack Trace:
java.lang.NullPointerException: null
	at org.apache.commons.lang3.SystemUtils.isJavaVersionAtLeast(SystemUtils.java:1626)
	at org.apache.maven.shared.dependency.analyzer.DefaultProjectDependencyAnalyzerTest.testJava8methodRefs(DefaultProjectDependencyAnalyzerTest.java:125)


FAILED:  org.apache.maven.shared.dependency.analyzer.DefaultProjectDependencyAnalyzerTest.testInlinedStaticReference

Error Message:
null

Stack Trace:
java.lang.NullPointerException: null
	at org.apache.commons.lang3.SystemUtils.isJavaVersionAtLeast(SystemUtils.java:1626)
	at org.apache.maven.shared.dependency.analyzer.DefaultProjectDependencyAnalyzerTest.testInlinedStaticReference(DefaultProjectDependencyAnalyzerTest.java:150)


FAILED:  org.apache.maven.shared.dependency.analyzer.DefaultProjectDependencyAnalyzerTest.testTypeUseAnnotationDependency

Error Message:
null

Stack Trace:
java.lang.NullPointerException: null
	at org.apache.commons.lang3.SystemUtils.isJavaVersionAtLeast(SystemUtils.java:1626)
	at org.apache.maven.shared.dependency.analyzer.DefaultProjectDependencyAnalyzerTest.testTypeUseAnnotationDependency(DefaultProjectDependencyAnalyzerTest.java:310)


FAILED:  org.apache.maven.shared.dependency.analyzer.DefaultProjectDependencyAnalyzerTest.testMultimoduleProject

Error Message:
null

Stack Trace:
java.lang.NullPointerException: null
	at org.apache.commons.lang3.SystemUtils.isJavaVersionAtLeast(SystemUtils.java:1626)
	at org.apache.maven.shared.dependency.analyzer.DefaultProjectDependencyAnalyzerTest.compileProject(DefaultProjectDependencyAnalyzerTest.java:342)
	at org.apache.maven.shared.dependency.analyzer.DefaultProjectDependencyAnalyzerTest.compileProject(DefaultProjectDependencyAnalyzerTest.java:337)
	at org.apache.maven.shared.dependency.analyzer.DefaultProjectDependencyAnalyzerTest.testMultimoduleProject(DefaultProjectDependencyAnalyzerTest.java:280)


FAILED:  org.apache.maven.shared.dependency.analyzer.DefaultProjectDependencyAnalyzerTest.testJarWithXmlTransitiveDependency

Error Message:
null

Stack Trace:
java.lang.NullPointerException: null
	at org.apache.commons.lang3.SystemUtils.isJavaVersionAtLeast(SystemUtils.java:1626)
	at org.apache.maven.shared.dependency.analyzer.DefaultProjectDependencyAnalyzerTest.compileProject(DefaultProjectDependencyAnalyzerTest.java:342)
	at org.apache.maven.shared.dependency.analyzer.DefaultProjectDependencyAnalyzerTest.compileProject(DefaultProjectDependencyAnalyzerTest.java:337)
	at org.apache.maven.shared.dependency.analyzer.DefaultProjectDependencyAnalyzerTest.testJarWithXmlTransitiveDependency(DefaultProjectDependencyAnalyzerTest.java:262)


FAILED:  org.apache.maven.shared.dependency.analyzer.DefaultProjectDependencyAnalyzerTest.testJarWithNoDependencies

Error Message:
null

Stack Trace:
java.lang.NullPointerException: null
	at org.apache.commons.lang3.SystemUtils.isJavaVersionAtLeast(SystemUtils.java:1626)
	at org.apache.maven.shared.dependency.analyzer.DefaultProjectDependencyAnalyzerTest.compileProject(DefaultProjectDependencyAnalyzerTest.java:342)
	at org.apache.maven.shared.dependency.analyzer.DefaultProjectDependencyAnalyzerTest.compileProject(DefaultProjectDependencyAnalyzerTest.java:337)
	at org.apache.maven.shared.dependency.analyzer.DefaultProjectDependencyAnalyzerTest.testJarWithNoDependencies(DefaultProjectDependencyAnalyzerTest.java:111)


FAILED:  org.apache.maven.shared.dependency.analyzer.DefaultProjectDependencyAnalyzerTest.testPom

Error Message:
null

Stack Trace:
java.lang.NullPointerException: null
	at org.apache.commons.lang3.SystemUtils.isJavaVersionAtLeast(SystemUtils.java:1626)
	at org.apache.maven.shared.dependency.analyzer.DefaultProjectDependencyAnalyzerTest.compileProject(DefaultProjectDependencyAnalyzerTest.java:342)
	at org.apache.maven.shared.dependency.analyzer.DefaultProjectDependencyAnalyzerTest.compileProject(DefaultProjectDependencyAnalyzerTest.java:337)
	at org.apache.maven.shared.dependency.analyzer.DefaultProjectDependencyAnalyzerTest.testPom(DefaultProjectDependencyAnalyzerTest.java:97)


FAILED:  org.apache.maven.shared.dependency.analyzer.DefaultProjectDependencyAnalyzerTest.testForceDeclaredDependenciesUsage

Error Message:
null

Stack Trace:
java.lang.NullPointerException: null
	at org.apache.commons.lang3.SystemUtils.isJavaVersionAtLeast(SystemUtils.java:1626)
	at org.apache.maven.shared.dependency.analyzer.DefaultProjectDependencyAnalyzerTest.compileProject(DefaultProjectDependencyAnalyzerTest.java:342)
	at org.apache.maven.shared.dependency.analyzer.DefaultProjectDependencyAnalyzerTest.compileProject(DefaultProjectDependencyAnalyzerTest.java:337)
	at org.apache.maven.shared.dependency.analyzer.DefaultProjectDependencyAnalyzerTest.testForceDeclaredDependenciesUsage(DefaultProjectDependencyAnalyzerTest.java:198)


FAILED:  org.apache.maven.shared.dependency.analyzer.DefaultProjectDependencyAnalyzerTest.testJarWithTestDependency

Error Message:
null

Stack Trace:
java.lang.NullPointerException: null
	at org.apache.commons.lang3.SystemUtils.isJavaVersionAtLeast(SystemUtils.java:1626)
	at org.apache.maven.shared.dependency.analyzer.DefaultProjectDependencyAnalyzerTest.compileProject(DefaultProjectDependencyAnalyzerTest.java:342)
	at org.apache.maven.shared.dependency.analyzer.DefaultProjectDependencyAnalyzerTest.compileProject(DefaultProjectDependencyAnalyzerTest.java:337)
	at org.apache.maven.shared.dependency.analyzer.DefaultProjectDependencyAnalyzerTest.testJarWithTestDependency(DefaultProjectDependencyAnalyzerTest.java:232)


FAILED:  org.apache.maven.shared.dependency.analyzer.DefaultProjectDependencyAnalyzerTest.testJarWithCompileDependency

Error Message:
null

Stack Trace:
java.lang.NullPointerException: null
	at org.apache.commons.lang3.SystemUtils.isJavaVersionAtLeast(SystemUtils.java:1626)
	at org.apache.maven.shared.dependency.analyzer.DefaultProjectDependencyAnalyzerTest.compileProject(DefaultProjectDependencyAnalyzerTest.java:342)
	at org.apache.maven.shared.dependency.analyzer.DefaultProjectDependencyAnalyzerTest.compileProject(DefaultProjectDependencyAnalyzerTest.java:337)
	at org.apache.maven.shared.dependency.analyzer.DefaultProjectDependencyAnalyzerTest.testJarWithCompileDependency(DefaultProjectDependencyAnalyzerTest.java:174)


FAILED:  org.apache.maven.shared.dependency.analyzer.DefaultProjectDependencyAnalyzerTest.testJava8methodRefs

Error Message:
null

Stack Trace:
java.lang.NullPointerException: null
	at org.apache.commons.lang3.SystemUtils.isJavaVersionAtLeast(SystemUtils.java:1626)
	at org.apache.maven.shared.dependency.analyzer.DefaultProjectDependencyAnalyzerTest.testJava8methodRefs(DefaultProjectDependencyAnalyzerTest.java:125)


FAILED:  org.apache.maven.shared.dependency.analyzer.DefaultProjectDependencyAnalyzerTest.testInlinedStaticReference

Error Message:
null

Stack Trace:
java.lang.NullPointerException: null
	at org.apache.commons.lang3.SystemUtils.isJavaVersionAtLeast(SystemUtils.java:1626)
	at org.apache.maven.shared.dependency.analyzer.DefaultProjectDependencyAnalyzerTest.testInlinedStaticReference(DefaultProjectDependencyAnalyzerTest.java:150)


FAILED:  org.apache.maven.shared.dependency.analyzer.DefaultProjectDependencyAnalyzerTest.testTypeUseAnnotationDependency

Error Message:
null

Stack Trace:
java.lang.NullPointerException: null
	at org.apache.commons.lang3.SystemUtils.isJavaVersionAtLeast(SystemUtils.java:1626)
	at org.apache.maven.shared.dependency.analyzer.DefaultProjectDependencyAnalyzerTest.testTypeUseAnnotationDependency(DefaultProjectDependencyAnalyzerTest.java:310)


FAILED:  org.apache.maven.shared.dependency.analyzer.DefaultProjectDependencyAnalyzerTest.testMultimoduleProject

Error Message:
null

Stack Trace:
java.lang.NullPointerException: null
	at org.apache.commons.lang3.SystemUtils.isJavaVersionAtLeast(SystemUtils.java:1626)
	at org.apache.maven.shared.dependency.analyzer.DefaultProjectDependencyAnalyzerTest.compileProject(DefaultProjectDependencyAnalyzerTest.java:342)
	at org.apache.maven.shared.dependency.analyzer.DefaultProjectDependencyAnalyzerTest.compileProject(DefaultProjectDependencyAnalyzerTest.java:337)
	at org.apache.maven.shared.dependency.analyzer.DefaultProjectDependencyAnalyzerTest.testMultimoduleProject(DefaultProjectDependencyAnalyzerTest.java:280)




Build log:
[...truncated 1.08 MB...]
[linux-jdk8] [INFO] Downloading from central: https://repo.maven.apache.org/maven2/org/apache/maven/doxia/doxia-site-renderer/1.4/doxia-site-renderer-1.4.jar
[linux-jdk8] [INFO] Downloaded from central: https://repo.maven.apache.org/maven2/org/apache/maven/doxia/doxia-sink-api/1.4/doxia-sink-api-1.4.jar
(11 kB at 373 kB/s)
[linux-jdk8] [INFO] Downloading from central: https://repo.maven.apache.org/maven2/org/apache/maven/doxia/doxia-module-xhtml/1.4/doxia-module-xhtml-1.4.jar
[linux-jdk8] [INFO] Downloaded from central: https://repo.maven.apache.org/maven2/org/apache/maven/doxia/doxia-logging-api/1.4/doxia-logging-api-1.4.jar
(11 kB at 377 kB/s)
[linux-jdk8] [INFO] Downloading from central: https://repo.maven.apache.org/maven2/org/apache/maven/doxia/doxia-module-fml/1.4/doxia-module-fml-1.4.jar
[linux-jdk8] [INFO] Downloaded from central: https://repo.maven.apache.org/maven2/org/apache/maven/doxia/doxia-decoration-model/1.4/doxia-decoration-model-1.4.jar
(61 kB at 1.7 MB/s)
[linux-jdk8] [INFO] Downloading from central: https://repo.maven.apache.org/maven2/org/apache/maven/doxia/doxia-integration-tools/1.6/doxia-integration-tools-1.6.jar
[linux-jdk8] [INFO] Downloaded from central: https://repo.maven.apache.org/maven2/org/apache/maven/doxia/doxia-module-xhtml/1.4/doxia-module-xhtml-1.4.jar
(15 kB at 375 kB/s)
[linux-jdk8] [INFO] Downloading from central: https://repo.maven.apache.org/maven2/org/codehaus/plexus/plexus-resources/1.0.1/plexus-resources-1.0.1.jar
[linux-jdk8] [INFO] Downloaded from central: https://repo.maven.apache.org/maven2/org/apache/maven/doxia/doxia-site-renderer/1.4/doxia-site-renderer-1.4.jar
(53 kB at 1.3 MB/s)
[linux-jdk8] [INFO] Downloading from central: https://repo.maven.apache.org/maven2/org/codehaus/plexus/plexus-interpolation/1.21/plexus-interpolation-1.21.jar
[linux-jdk8] [INFO] Downloaded from central: https://repo.maven.apache.org/maven2/org/apache/maven/doxia/doxia-module-fml/1.4/doxia-module-fml-1.4.jar
(38 kB at 901 kB/s)
[linux-jdk8] [INFO] Downloading from central: https://repo.maven.apache.org/maven2/org/codehaus/plexus/plexus-velocity/1.1.8/plexus-velocity-1.1.8.jar
[linux-jdk8] [INFO] Downloaded from central: https://repo.maven.apache.org/maven2/org/apache/maven/doxia/doxia-integration-tools/1.6/doxia-integration-tools-1.6.jar
(45 kB at 858 kB/s)
[linux-jdk8] [INFO] Downloading from central: https://repo.maven.apache.org/maven2/com/puppycrawl/tools/checkstyle/6.1.1/checkstyle-6.1.1.jar
[linux-jdk8] [INFO] Downloaded from central: https://repo.maven.apache.org/maven2/org/codehaus/plexus/plexus-resources/1.0.1/plexus-resources-1.0.1.jar
(22 kB at 413 kB/s)
[linux-jdk8] [INFO] Downloading from central: https://repo.maven.apache.org/maven2/antlr/antlr/2.7.7/antlr-2.7.7.jar
[linux-jdk8] [INFO] Downloaded from central: https://repo.maven.apache.org/maven2/org/codehaus/plexus/plexus-velocity/1.1.8/plexus-velocity-1.1.8.jar
(7.9 kB at 149 kB/s)
[linux-jdk8] [INFO] Downloading from central: https://repo.maven.apache.org/maven2/org/antlr/antlr4-runtime/4.3/antlr4-runtime-4.3.jar
[linux-jdk8] [INFO] Downloaded from central: https://repo.maven.apache.org/maven2/org/codehaus/plexus/plexus-interpolation/1.21/plexus-interpolation-1.21.jar
(62 kB at 1.1 MB/s)
[linux-jdk8] [INFO] Downloading from central: https://repo.maven.apache.org/maven2/org/abego/treelayout/org.abego.treelayout.core/1.0.1/org.abego.treelayout.core-1.0.1.jar
[linux-jdk8] [INFO] Downloaded from central: https://repo.maven.apache.org/maven2/org/abego/treelayout/org.abego.treelayout.core/1.0.1/org.abego.treelayout.core-1.0.1.jar
(26 kB at 370 kB/s)
[linux-jdk8] [INFO] Downloading from central: https://repo.maven.apache.org/maven2/org/antlr/antlr4-annotations/4.3/antlr4-annotations-4.3.jar
[linux-jdk8] [INFO] Downloaded from central: https://repo.maven.apache.org/maven2/xerces/xercesImpl/2.9.1/xercesImpl-2.9.1.jar
(1.2 MB at 15 MB/s)
[linux-jdk8] [INFO] Downloading from central: https://repo.maven.apache.org/maven2/commons-beanutils/commons-beanutils-core/1.8.3/commons-beanutils-core-1.8.3.jar
[linux-jdk8] [INFO] Downloaded from central: https://repo.maven.apache.org/maven2/org/antlr/antlr4-annotations/4.3/antlr4-annotations-4.3.jar
(10 kB at 126 kB/s)
[linux-jdk8] [INFO] Downloading from central: https://repo.maven.apache.org/maven2/com/google/guava/guava/18.0/guava-18.0.jar
[linux-jdk8] [INFO] Downloaded from central: https://repo.maven.apache.org/maven2/antlr/antlr/2.7.7/antlr-2.7.7.jar
(445 kB at 5.4 MB/s)
[linux-jdk8] [INFO] Downloaded from central: https://repo.maven.apache.org/maven2/org/antlr/antlr4-runtime/4.3/antlr4-runtime-4.3.jar
(345 kB at 3.9 MB/s)
[linux-jdk8] [INFO] Downloaded from central: https://repo.maven.apache.org/maven2/commons-beanutils/commons-beanutils-core/1.8.3/commons-beanutils-core-1.8.3.jar
(207 kB at 2.1 MB/s)
[linux-jdk8] [INFO] Downloaded from central: https://repo.maven.apache.org/maven2/com/puppycrawl/tools/checkstyle/6.1.1/checkstyle-6.1.1.jar
(1.0 MB at 7.5 MB/s)
[linux-jdk8] [INFO] Downloaded from central: https://repo.maven.apache.org/maven2/com/google/guava/guava/18.0/guava-18.0.jar
(2.3 MB at 12 MB/s)
[linux-jdk8] [INFO] ------------------------------------------------------------------------
[linux-jdk8] [INFO] BUILD SUCCESS
[linux-jdk8] [INFO] ------------------------------------------------------------------------
[linux-jdk8] [INFO] Total time: 01:00 min
[linux-jdk8] [INFO] Finished at: 2018-07-18T19:04:20Z
[linux-jdk8] [INFO] Final Memory: 46M/1850M
[linux-jdk8] [INFO] ------------------------------------------------------------------------
[linux-jdk8] [WARNING] The requested profile "run-its" could not be activated because it does
not exist.
[linux-jdk8] [INFO] [jenkins-event-spy] Generated /home/jenkins/jenkins-slave/workspace/ect_Java_8_type_annotations-6YYONV5DHF2W5ZWSYDAVULES2GVBCB4HSDLCM5SIO3LMNDK77BNQ@tmp/withMaven3b5a54c1/maven-spy-20180718-190318-952549899219451580865.log
[Pipeline] [linux-jdk8] }
[Pipeline] [linux-jdk8] // dir
[Pipeline] [linux-jdk8] }
[linux-jdk8] [withMaven] junitPublisher - Archive test results for Maven artifact org.apache.maven.shared:maven-dependency-analyzer:1.8-SNAPSHOT
generated by maven-surefire-plugin:test (default-test): m/target/surefire-reports/*.xml
[linux-jdk8] Recording test results
[linux-jdk8] [withMaven] junitPublisher - Archive test results for Maven artifact org.apache.maven.shared.dependency-analyzer.tests:jarWithXercesDependencies:1.0
generated by maven-surefire-plugin:test (default-test): m/target/test-classes/jarWithXmlTransitiveDependency/target/surefire-reports/*.xml
[linux-jdk8] Recording test results
[linux-jdk8] None of the test reports contained any result
[linux-jdk8] [withMaven] junitPublisher - Archive test results for Maven artifact org.apache.maven.shared.dependency-analyzer.tests:jarWithNoDependencies:1.0
generated by maven-surefire-plugin:test (default-test): m/target/test-classes/jarWithNoDependencies/target/surefire-reports/*.xml
[linux-jdk8] Recording test results
[linux-jdk8] None of the test reports contained any result
[linux-jdk8] [withMaven] junitPublisher - Archive test results for Maven artifact org.apache.maven.shared.dependency-analyzer.tests:jarWithTestDependency1:1.0
generated by maven-surefire-plugin:test (default-test): m/target/test-classes/jarWithTestDependency/project1/target/surefire-reports/*.xml
[linux-jdk8] Recording test results
[linux-jdk8] None of the test reports contained any result
[linux-jdk8] [withMaven] junitPublisher - Archive test results for Maven artifact org.apache.maven.shared.dependency-analyzer.tests:jarWithTestDependency2:1.0
generated by maven-surefire-plugin:test (default-test): m/target/test-classes/jarWithTestDependency/project2/target/surefire-reports/*.xml
[linux-jdk8] Recording test results
[linux-jdk8] None of the test reports contained any result
[linux-jdk8] [withMaven] junitPublisher - Archive test results for Maven artifact org.apache.maven.shared.dependency-analyzer.tests:jarWithTestDependency1:1.0
generated by maven-surefire-plugin:test (default-test): m/target/test-classes/jarWithTestDependency/project1/target/surefire-reports/*.xml
[linux-jdk8] Recording test results
[linux-jdk8] None of the test reports contained any result
[linux-jdk8] [withMaven] junitPublisher - Archive test results for Maven artifact org.apache.maven.shared.dependency-analyzer.tests:jarWithTestDependency2:1.0
generated by maven-surefire-plugin:test (default-test): m/target/test-classes/jarWithTestDependency/project2/target/surefire-reports/*.xml
[linux-jdk8] Recording test results
[linux-jdk8] None of the test reports contained any result
[linux-jdk8] [withMaven] junitPublisher - Archive test results for Maven artifact org.apache.maven.shared.dependency-analyzer.tests:jarWithCompileDependency1:1.0
generated by maven-surefire-plugin:test (default-test): m/target/test-classes/jarWithCompileDependency/project1/target/surefire-reports/*.xml
[linux-jdk8] Recording test results
[linux-jdk8] None of the test reports contained any result
[linux-jdk8] [withMaven] junitPublisher - Archive test results for Maven artifact org.apache.maven.shared.dependency-analyzer.tests:jarWithCompileDependency2:1.0
generated by maven-surefire-plugin:test (default-test): m/target/test-classes/jarWithCompileDependency/project2/target/surefire-reports/*.xml
[linux-jdk8] Recording test results
[linux-jdk8] None of the test reports contained any result
[linux-jdk8] [withMaven] junitPublisher - Archive test results for Maven artifact org.apache.maven.shared.dependency-analyzer.tests:java8methodreferences:1.0
generated by maven-surefire-plugin:test (default-test): m/target/test-classes/java8methodRefs/target/surefire-reports/*.xml
[linux-jdk8] Recording test results
[linux-jdk8] None of the test reports contained any result
[linux-jdk8] [withMaven] junitPublisher - Archive test results for Maven artifact org.apache.maven.shared.dependency-analyzer.tests:inlinedStaticReference:1.0
generated by maven-surefire-plugin:test (default-test): m/target/test-classes/inlinedStaticReference/target/surefire-reports/*.xml
[linux-jdk8] Recording test results
[linux-jdk8] None of the test reports contained any result
[linux-jdk8] [withMaven] junitPublisher - Archive test results for Maven artifact org.apache.maven.shared.dependency-analyzer.tests:typeUseAnnotationDependencyAnnotation:1.0
generated by maven-surefire-plugin:test (default-test): m/target/test-classes/typeUseAnnotationDependency/annotation/target/surefire-reports/*.xml
[linux-jdk8] Recording test results
[linux-jdk8] None of the test reports contained any result
[linux-jdk8] [withMaven] junitPublisher - Archive test results for Maven artifact org.apache.maven.shared.dependency-analyzer.tests:typeUseAnnotationDependencyUsage:1.0
generated by maven-surefire-plugin:test (default-test): m/target/test-classes/typeUseAnnotationDependency/usage/target/surefire-reports/*.xml
[linux-jdk8] Recording test results
[linux-jdk8] None of the test reports contained any result
[linux-jdk8] [withMaven] junitPublisher - Archive test results for Maven artifact org.apache.maven.its.dependency:test-module1:1.0
generated by maven-surefire-plugin:test (default-test): m/target/test-classes/multimoduleProject/module1/target/surefire-reports/*.xml
[linux-jdk8] Recording test results
[linux-jdk8] None of the test reports contained any result
[linux-jdk8] [withMaven] junitPublisher - Archive test results for Maven artifact org.apache.maven.its.dependency:test-module2:1.0
generated by maven-surefire-plugin:test (default-test): m/target/test-classes/multimoduleProject/module2/target/surefire-reports/*.xml
[linux-jdk8] Recording test results
[linux-jdk8] None of the test reports contained any result
[Pipeline] [linux-jdk8] // withMaven
[Pipeline] [linux-jdk8] }
[Pipeline] [linux-jdk8] // stage
[Pipeline] [linux-jdk8] }
[Pipeline] [linux-jdk8] // node
[Pipeline] [linux-jdk8] }
[linux-jdk7] Tests run: 10, Failures: 0, Errors: 0, Skipped: 0, Time elapsed: 32.934 sec -
in org.apache.maven.shared.dependency.analyzer.DefaultProjectDependencyAnalyzerTest
[linux-jdk7] Running org.apache.maven.shared.dependency.analyzer.ProjectDependencyAnalyzerExceptionTest
[linux-jdk7] Tests run: 2, Failures: 0, Errors: 0, Skipped: 0, Time elapsed: 0.001 sec - in
org.apache.maven.shared.dependency.analyzer.ProjectDependencyAnalyzerExceptionTest
[linux-jdk7] Running org.apache.maven.shared.dependency.analyzer.ClassFileVisitorUtilsTest
[linux-jdk7] Tests run: 6, Failures: 0, Errors: 0, Skipped: 0, Time elapsed: 0.038 sec - in
org.apache.maven.shared.dependency.analyzer.ClassFileVisitorUtilsTest
[linux-jdk7] Running org.apache.maven.shared.dependency.analyzer.DefaultClassAnalyzerTest
[linux-jdk7] Tests run: 2, Failures: 0, Errors: 0, Skipped: 0, Time elapsed: 0.013 sec - in
org.apache.maven.shared.dependency.analyzer.DefaultClassAnalyzerTest
[linux-jdk7] Running org.apache.maven.shared.dependency.analyzer.CollectorClassFileVisitorTest
[linux-jdk7] Tests run: 1, Failures: 0, Errors: 0, Skipped: 0, Time elapsed: 0 sec - in org.apache.maven.shared.dependency.analyzer.CollectorClassFileVisitorTest
[linux-jdk7] Running org.apache.maven.shared.dependency.analyzer.ProjectDependencyAnalysisTest
[linux-jdk7] Tests run: 1, Failures: 0, Errors: 0, Skipped: 0, Time elapsed: 0.001 sec - in
org.apache.maven.shared.dependency.analyzer.ProjectDependencyAnalysisTest
[linux-jdk7] Running org.apache.maven.shared.dependency.analyzer.asm.DependencyVisitorTest
[linux-jdk7] Tests run: 73, Failures: 0, Errors: 0, Skipped: 0, Time elapsed: 0.023 sec -
in org.apache.maven.shared.dependency.analyzer.asm.DependencyVisitorTest
[linux-jdk7] Running org.apache.maven.shared.dependency.analyzer.asm.ASMDependencyAnalyzerTest
[linux-jdk7] Tests run: 1, Failures: 0, Errors: 0, Skipped: 0, Time elapsed: 0.08 sec - in
org.apache.maven.shared.dependency.analyzer.asm.ASMDependencyAnalyzerTest
[linux-jdk7] 
[linux-jdk7] Results :
[linux-jdk7] 
[linux-jdk7] Tests run: 96, Failures: 0, Errors: 0, Skipped: 0
[linux-jdk7] 
[linux-jdk7] [INFO] 
[linux-jdk7] [INFO] --- maven-jar-plugin:3.0.0:jar (default-jar) @ maven-dependency-analyzer
---
[linux-jdk7] [INFO] Building jar: /home/jenkins/jenkins-slave/workspace/ect_Java_8_type_annotations-6YYONV5DHF2W5ZWSYDAVULES2GVBCB4HSDLCM5SIO3LMNDK77BNQ/m/target/maven-dependency-analyzer-1.8-SNAPSHOT.jar
[linux-jdk7] [INFO] 
[linux-jdk7] [INFO] --- maven-site-plugin:3.5.1:attach-descriptor (attach-descriptor) @ maven-dependency-analyzer
---
[linux-jdk7] [INFO] 
[linux-jdk7] [INFO] --- maven-checkstyle-plugin:2.15:check (checkstyle-check) @ maven-dependency-analyzer
---
[linux-jdk7] [INFO] ------------------------------------------------------------------------
[linux-jdk7] [INFO] BUILD SUCCESS
[linux-jdk7] [INFO] ------------------------------------------------------------------------
[linux-jdk7] [INFO] Total time: 41.782 s
[linux-jdk7] [INFO] Finished at: 2018-07-18T19:04:52Z
[linux-jdk7] [INFO] Final Memory: 36M/1447M
[linux-jdk7] [INFO] ------------------------------------------------------------------------
[linux-jdk7] [WARNING] The requested profile "run-its" could not be activated because it does
not exist.
[linux-jdk7] [INFO] [jenkins-event-spy] Generated /home/jenkins/jenkins-slave/workspace/ect_Java_8_type_annotations-6YYONV5DHF2W5ZWSYDAVULES2GVBCB4HSDLCM5SIO3LMNDK77BNQ@tmp/withMavenc022890f/maven-spy-20180718-190410-5605297215393261346078.log
[Pipeline] [linux-jdk7] }
[Pipeline] [linux-jdk7] // dir
[Pipeline] [linux-jdk7] }
[linux-jdk7] [withMaven] artifactsPublisher - Archive artifact m/pom.xml under org/apache/maven/shared/maven-dependency-analyzer/1.8-SNAPSHOT/maven-dependency-analyzer-1.8-SNAPSHOT.pom
[linux-jdk7] [withMaven] artifactsPublisher - Archive artifact m/target/maven-dependency-analyzer-1.8-SNAPSHOT.jar
under org/apache/maven/shared/maven-dependency-analyzer/1.8-SNAPSHOT/maven-dependency-analyzer-1.8-SNAPSHOT.jar
[linux-jdk7] [withMaven] junitPublisher - Archive test results for Maven artifact org.apache.maven.shared:maven-dependency-analyzer:1.8-SNAPSHOT
generated by maven-surefire-plugin:test (default-test): m/target/surefire-reports/*.xml
[linux-jdk7] Recording test results
[linux-jdk7] [withMaven] openTasksPublisher - Scan Tasks for Maven artifact org.apache.maven.shared:maven-dependency-analyzer:1.8-SNAPSHOT
in source directory m/src/main/java
[linux-jdk7] [TASKS] Scanning folder '/home/jenkins/jenkins-slave/workspace/ect_Java_8_type_annotations-6YYONV5DHF2W5ZWSYDAVULES2GVBCB4HSDLCM5SIO3LMNDK77BNQ'
for files matching the pattern 'm/src/main/java/**/*' - excludes: null
[linux-jdk7] [TASKS] Found 19 files to scan for tasks
[linux-jdk7] [TASKS] Found 0 open tasks.
[linux-jdk7] Skipping warnings blame since pipelines do not have an SCM link.%n
[linux-jdk7] [TASKS] Computing warning deltas based on reference build #3
[linux-jdk7] [withMaven] artifactsPublisher - Archive artifact m/target/test-classes/jarWithXmlTransitiveDependency/pom.xml
under org/apache/maven/shared/dependency-analyzer/tests/jarWithXercesDependencies/1.0/jarWithXercesDependencies-1.0.pom
[linux-jdk7] [withMaven] artifactsPublisher - Archive artifact m/target/test-classes/jarWithXmlTransitiveDependency/target/jarWithXercesDependencies-1.0.jar
under org/apache/maven/shared/dependency-analyzer/tests/jarWithXercesDependencies/1.0/jarWithXercesDependencies-1.0.jar
[linux-jdk7] [withMaven] junitPublisher - Archive test results for Maven artifact org.apache.maven.shared.dependency-analyzer.tests:jarWithXercesDependencies:1.0
generated by maven-surefire-plugin:test (default-test): m/target/test-classes/jarWithXmlTransitiveDependency/target/surefire-reports/*.xml
[linux-jdk7] Recording test results
[linux-jdk7] None of the test reports contained any result
[linux-jdk7] [withMaven] openTasksPublisher - Scan Tasks for Maven artifact org.apache.maven.shared.dependency-analyzer.tests:jarWithXercesDependencies:1.0
in source directory m/target/test-classes/jarWithXmlTransitiveDependency/src/main/java
[linux-jdk7] [TASKS] Scanning folder '/home/jenkins/jenkins-slave/workspace/ect_Java_8_type_annotations-6YYONV5DHF2W5ZWSYDAVULES2GVBCB4HSDLCM5SIO3LMNDK77BNQ'
for files matching the pattern 'm/target/test-classes/jarWithXmlTransitiveDependency/src/main/java/**/*'
- excludes: null
[linux-jdk7] [TASKS] Found 1 files to scan for tasks
[linux-jdk7] [TASKS] Found 0 open tasks.
[linux-jdk7] Skipping warnings blame since pipelines do not have an SCM link.%n
[linux-jdk7] [TASKS] Computing warning deltas based on reference build #3
[linux-jdk7] [withMaven] artifactsPublisher - Archive artifact m/target/test-classes/jarWithNoDependencies/pom.xml
under org/apache/maven/shared/dependency-analyzer/tests/jarWithNoDependencies/1.0/jarWithNoDependencies-1.0.pom
[linux-jdk7] [withMaven] artifactsPublisher - Archive artifact m/target/test-classes/jarWithNoDependencies/target/jarWithNoDependencies-1.0.jar
under org/apache/maven/shared/dependency-analyzer/tests/jarWithNoDependencies/1.0/jarWithNoDependencies-1.0.jar
[linux-jdk7] [withMaven] junitPublisher - Archive test results for Maven artifact org.apache.maven.shared.dependency-analyzer.tests:jarWithNoDependencies:1.0
generated by maven-surefire-plugin:test (default-test): m/target/test-classes/jarWithNoDependencies/target/surefire-reports/*.xml
[linux-jdk7] Recording test results
[linux-jdk7] None of the test reports contained any result
[linux-jdk7] [withMaven] openTasksPublisher - Scan Tasks for Maven artifact org.apache.maven.shared.dependency-analyzer.tests:jarWithNoDependencies:1.0
in source directory m/target/test-classes/jarWithNoDependencies/src/main/java
[linux-jdk7] [TASKS] Scanning folder '/home/jenkins/jenkins-slave/workspace/ect_Java_8_type_annotations-6YYONV5DHF2W5ZWSYDAVULES2GVBCB4HSDLCM5SIO3LMNDK77BNQ'
for files matching the pattern 'm/target/test-classes/jarWithNoDependencies/src/main/java/**/*'
- excludes: null
[linux-jdk7] [TASKS] Found 1 files to scan for tasks
[linux-jdk7] [TASKS] Found 0 open tasks.
[linux-jdk7] Skipping warnings blame since pipelines do not have an SCM link.%n
[linux-jdk7] [TASKS] Computing warning deltas based on reference build #3
[linux-jdk7] [withMaven] artifactsPublisher - Archive artifact m/target/test-classes/pom/pom.xml
under org/apache/maven/shared/dependency-analyzer/tests/pom/1.0/pom-1.0.pom
[linux-jdk7] [withMaven] artifactsPublisher - Archive artifact m/target/test-classes/jarWithTestDependency/project1/pom.xml
under org/apache/maven/shared/dependency-analyzer/tests/jarWithTestDependency1/1.0/jarWithTestDependency1-1.0.pom
[linux-jdk7] [withMaven] artifactsPublisher - Archive artifact m/target/test-classes/jarWithTestDependency/project1/target/jarWithTestDependency1-1.0.jar
under org/apache/maven/shared/dependency-analyzer/tests/jarWithTestDependency1/1.0/jarWithTestDependency1-1.0.jar
[linux-jdk7] [withMaven] artifactsPublisher - Archive artifact m/target/test-classes/jarWithTestDependency/project2/pom.xml
under org/apache/maven/shared/dependency-analyzer/tests/jarWithTestDependency2/1.0/jarWithTestDependency2-1.0.pom
[linux-jdk7] [withMaven] artifactsPublisher - Archive artifact m/target/test-classes/jarWithTestDependency/project2/target/jarWithTestDependency2-1.0.jar
under org/apache/maven/shared/dependency-analyzer/tests/jarWithTestDependency2/1.0/jarWithTestDependency2-1.0.jar
[linux-jdk7] [withMaven] artifactsPublisher - Archive artifact m/target/test-classes/jarWithTestDependency/pom.xml
under org/apache/maven/shared/dependency-analyzer/tests/jarWithTestDependency/1.0/jarWithTestDependency-1.0.pom
[linux-jdk7] [withMaven] junitPublisher - Archive test results for Maven artifact org.apache.maven.shared.dependency-analyzer.tests:jarWithTestDependency1:1.0
generated by maven-surefire-plugin:test (default-test): m/target/test-classes/jarWithTestDependency/project1/target/surefire-reports/*.xml
[linux-jdk7] Recording test results
[linux-jdk7] None of the test reports contained any result
[linux-jdk7] [withMaven] junitPublisher - Archive test results for Maven artifact org.apache.maven.shared.dependency-analyzer.tests:jarWithTestDependency2:1.0
generated by maven-surefire-plugin:test (default-test): m/target/test-classes/jarWithTestDependency/project2/target/surefire-reports/*.xml
[linux-jdk7] Recording test results
[linux-jdk7] None of the test reports contained any result
[linux-jdk7] [withMaven] openTasksPublisher - Scan Tasks for Maven artifact org.apache.maven.shared.dependency-analyzer.tests:jarWithTestDependency1:1.0
in source directory m/target/test-classes/jarWithTestDependency/project1/src/main/java
[linux-jdk7] [TASKS] Scanning folder '/home/jenkins/jenkins-slave/workspace/ect_Java_8_type_annotations-6YYONV5DHF2W5ZWSYDAVULES2GVBCB4HSDLCM5SIO3LMNDK77BNQ'
for files matching the pattern 'm/target/test-classes/jarWithTestDependency/project1/src/main/java/**/*'
- excludes: null
[linux-jdk7] [TASKS] Found 1 files to scan for tasks
[linux-jdk7] [TASKS] Found 0 open tasks.
[linux-jdk7] Skipping warnings blame since pipelines do not have an SCM link.%n
[linux-jdk7] [TASKS] Computing warning deltas based on reference build #3
[linux-jdk7] [withMaven] artifactsPublisher - Archive artifact m/target/test-classes/jarWithTestDependency/project1/pom.xml
under org/apache/maven/shared/dependency-analyzer/tests/jarWithTestDependency1/1.0/jarWithTestDependency1-1.0.pom
[linux-jdk7] [withMaven] artifactsPublisher - Archive artifact m/target/test-classes/jarWithTestDependency/project1/target/jarWithTestDependency1-1.0.jar
under org/apache/maven/shared/dependency-analyzer/tests/jarWithTestDependency1/1.0/jarWithTestDependency1-1.0.jar
[linux-jdk7] [withMaven] artifactsPublisher - Archive artifact m/target/test-classes/jarWithTestDependency/project2/pom.xml
under org/apache/maven/shared/dependency-analyzer/tests/jarWithTestDependency2/1.0/jarWithTestDependency2-1.0.pom
[linux-jdk7] [withMaven] artifactsPublisher - Archive artifact m/target/test-classes/jarWithTestDependency/project2/target/jarWithTestDependency2-1.0.jar
under org/apache/maven/shared/dependency-analyzer/tests/jarWithTestDependency2/1.0/jarWithTestDependency2-1.0.jar
[linux-jdk7] [withMaven] artifactsPublisher - Archive artifact m/target/test-classes/jarWithTestDependency/pom.xml
under org/apache/maven/shared/dependency-analyzer/tests/jarWithTestDependency/1.0/jarWithTestDependency-1.0.pom
[linux-jdk7] [withMaven] junitPublisher - Archive test results for Maven artifact org.apache.maven.shared.dependency-analyzer.tests:jarWithTestDependency1:1.0
generated by maven-surefire-plugin:test (default-test): m/target/test-classes/jarWithTestDependency/project1/target/surefire-reports/*.xml
[linux-jdk7] Recording test results
[linux-jdk7] None of the test reports contained any result
[linux-jdk7] [withMaven] junitPublisher - Archive test results for Maven artifact org.apache.maven.shared.dependency-analyzer.tests:jarWithTestDependency2:1.0
generated by maven-surefire-plugin:test (default-test): m/target/test-classes/jarWithTestDependency/project2/target/surefire-reports/*.xml
[linux-jdk7] Recording test results
[linux-jdk7] None of the test reports contained any result
[linux-jdk7] [withMaven] openTasksPublisher - Scan Tasks for Maven artifact org.apache.maven.shared.dependency-analyzer.tests:jarWithTestDependency1:1.0
in source directory m/target/test-classes/jarWithTestDependency/project1/src/main/java
[linux-jdk7] [TASKS] Scanning folder '/home/jenkins/jenkins-slave/workspace/ect_Java_8_type_annotations-6YYONV5DHF2W5ZWSYDAVULES2GVBCB4HSDLCM5SIO3LMNDK77BNQ'
for files matching the pattern 'm/target/test-classes/jarWithTestDependency/project1/src/main/java/**/*'
- excludes: null
[linux-jdk7] [TASKS] Found 1 files to scan for tasks
[linux-jdk7] [TASKS] Found 0 open tasks.
[linux-jdk7] Skipping warnings blame since pipelines do not have an SCM link.%n
[linux-jdk7] [TASKS] Computing warning deltas based on reference build #3
[linux-jdk7] [withMaven] artifactsPublisher - Archive artifact m/target/test-classes/jarWithCompileDependency/project1/pom.xml
under org/apache/maven/shared/dependency-analyzer/tests/jarWithCompileDependency1/1.0/jarWithCompileDependency1-1.0.pom
[linux-jdk7] [withMaven] artifactsPublisher - Archive artifact m/target/test-classes/jarWithCompileDependency/project1/target/jarWithCompileDependency1-1.0.jar
under org/apache/maven/shared/dependency-analyzer/tests/jarWithCompileDependency1/1.0/jarWithCompileDependency1-1.0.jar
[linux-jdk7] [withMaven] artifactsPublisher - Archive artifact m/target/test-classes/jarWithCompileDependency/project2/pom.xml
under org/apache/maven/shared/dependency-analyzer/tests/jarWithCompileDependency2/1.0/jarWithCompileDependency2-1.0.pom
[linux-jdk7] [withMaven] artifactsPublisher - Archive artifact m/target/test-classes/jarWithCompileDependency/project2/target/jarWithCompileDependency2-1.0.jar
under org/apache/maven/shared/dependency-analyzer/tests/jarWithCompileDependency2/1.0/jarWithCompileDependency2-1.0.jar
[linux-jdk7] [withMaven] artifactsPublisher - Archive artifact m/target/test-classes/jarWithCompileDependency/pom.xml
under org/apache/maven/shared/dependency-analyzer/tests/jarWithCompileDependency/1.0/jarWithCompileDependency-1.0.pom
[linux-jdk7] [withMaven] junitPublisher - Archive test results for Maven artifact org.apache.maven.shared.dependency-analyzer.tests:jarWithCompileDependency1:1.0
generated by maven-surefire-plugin:test (default-test): m/target/test-classes/jarWithCompileDependency/project1/target/surefire-reports/*.xml
[linux-jdk7] Recording test results
[linux-jdk7] None of the test reports contained any result
[linux-jdk7] [withMaven] junitPublisher - Archive test results for Maven artifact org.apache.maven.shared.dependency-analyzer.tests:jarWithCompileDependency2:1.0
generated by maven-surefire-plugin:test (default-test): m/target/test-classes/jarWithCompileDependency/project2/target/surefire-reports/*.xml
[linux-jdk7] Recording test results
[linux-jdk7] None of the test reports contained any result
[linux-jdk7] [withMaven] openTasksPublisher - Scan Tasks for Maven artifact org.apache.maven.shared.dependency-analyzer.tests:jarWithCompileDependency1:1.0
in source directory m/target/test-classes/jarWithCompileDependency/project1/src/main/java
[linux-jdk7] [withMaven] openTasksPublisher - Scan Tasks for Maven artifact org.apache.maven.shared.dependency-analyzer.tests:jarWithCompileDependency2:1.0
in source directory m/target/test-classes/jarWithCompileDependency/project2/src/main/java
[linux-jdk7] [TASKS] Scanning folder '/home/jenkins/jenkins-slave/workspace/ect_Java_8_type_annotations-6YYONV5DHF2W5ZWSYDAVULES2GVBCB4HSDLCM5SIO3LMNDK77BNQ'
for files matching the pattern 'm/target/test-classes/jarWithCompileDependency/project1/src/main/java/**/*,m/target/test-classes/jarWithCompileDependency/project2/src/main/java/**/*'
- excludes: null
[linux-jdk7] [TASKS] Found 2 files to scan for tasks
[linux-jdk7] [TASKS] Found 0 open tasks.
[linux-jdk7] Skipping warnings blame since pipelines do not have an SCM link.%n
[linux-jdk7] [TASKS] Computing warning deltas based on reference build #3
[linux-jdk7] [withMaven] artifactsPublisher - Archive artifact m/target/test-classes/multimoduleProject/pom.xml
under org/apache/maven/its/dependency/test-parent/1.0/test-parent-1.0.pom
[linux-jdk7] [withMaven] artifactsPublisher - Archive artifact m/target/test-classes/multimoduleProject/module1/pom.xml
under org/apache/maven/its/dependency/test-module1/1.0/test-module1-1.0.pom
[linux-jdk7] [withMaven] artifactsPublisher - Archive artifact m/target/test-classes/multimoduleProject/module1/target/test-module1-1.0.jar
under org/apache/maven/its/dependency/test-module1/1.0/test-module1-1.0.jar
[linux-jdk7] [withMaven] artifactsPublisher - Archive artifact m/target/test-classes/multimoduleProject/module2/pom.xml
under org/apache/maven/its/dependency/test-module2/1.0/test-module2-1.0.pom
[linux-jdk7] [withMaven] artifactsPublisher - Archive artifact m/target/test-classes/multimoduleProject/module2/target/test-module2-1.0.jar
under org/apache/maven/its/dependency/test-module2/1.0/test-module2-1.0.jar
[linux-jdk7] [withMaven] junitPublisher - Archive test results for Maven artifact org.apache.maven.its.dependency:test-module1:1.0
generated by maven-surefire-plugin:test (default-test): m/target/test-classes/multimoduleProject/module1/target/surefire-reports/*.xml
[linux-jdk7] Recording test results
[linux-jdk7] None of the test reports contained any result
[linux-jdk7] [withMaven] junitPublisher - Archive test results for Maven artifact org.apache.maven.its.dependency:test-module2:1.0
generated by maven-surefire-plugin:test (default-test): m/target/test-classes/multimoduleProject/module2/target/surefire-reports/*.xml
[linux-jdk7] Recording test results
[linux-jdk7] None of the test reports contained any result
[linux-jdk7] [withMaven] openTasksPublisher - Scan Tasks for Maven artifact org.apache.maven.its.dependency:test-module1:1.0
in source directory m/target/test-classes/multimoduleProject/module1/src/main/java
[linux-jdk7] [withMaven] openTasksPublisher - Scan Tasks for Maven artifact org.apache.maven.its.dependency:test-module2:1.0
in source directory m/target/test-classes/multimoduleProject/module2/src/main/java
[linux-jdk7] [TASKS] Scanning folder '/home/jenkins/jenkins-slave/workspace/ect_Java_8_type_annotations-6YYONV5DHF2W5ZWSYDAVULES2GVBCB4HSDLCM5SIO3LMNDK77BNQ'
for files matching the pattern 'm/target/test-classes/multimoduleProject/module1/src/main/java/**/*,m/target/test-classes/multimoduleProject/module2/src/main/java/**/*'
- excludes: null
[linux-jdk7] [TASKS] Found 2 files to scan for tasks
[linux-jdk7] [TASKS] Found 0 open tasks.
[linux-jdk7] Skipping warnings blame since pipelines do not have an SCM link.%n
[linux-jdk7] [TASKS] Computing warning deltas based on reference build #3
[Pipeline] [linux-jdk7] // withMaven
[Pipeline] [linux-jdk7] }
[Pipeline] [linux-jdk7] // stage
[Pipeline] [linux-jdk7] }
[Pipeline] [linux-jdk7] // node
[Pipeline] [linux-jdk7] }
[Pipeline] // parallel
[Pipeline] stage
[Pipeline] { (Notifications)
[Pipeline] echo
Build result: UNSTABLE
[Pipeline] jiraIssueSelector
[Pipeline] emailext
Mime
  • Unnamed multipart/mixed (inline, None, 0 bytes)
View raw message