maven-notifications mailing list archives

Site index · List index
Message view « Date » · « Thread »
Top « Date » · « Thread »
From Apache Jenkins Server <jenk...@builds.apache.org>
Subject Build unstable in Jenkins: Maven TLP » maven » MNG-6401-2 #6
Date Mon, 30 Jul 2018 20:28:45 GMT
See https://builds.apache.org/job/maven-box/job/maven/job/MNG-6401-2/6/

Changes:

* Get back ubuntu-eu2 and replaced it with windows-2016-1 which currently

6 tests failed.
FAILED:  org.apache.maven.it.MavenIT0051ReleaseProfileTest.testit0051

Error Message:
Exit code was non-zero: 1; command line and log = 
/home/jenkins/jenkins-slave/workspace/maven-box_maven_MNG-6401-2-QAKD6LP7DME27AZUVKJIWTKGBF727EM6Q2FBIKLRPCLIRL2QCB7A/test/core-it-suite/target/apache-maven/bin/mvn --global-settings /home/jenkins/jenkins-slave/workspace/maven-box_maven_MNG-6401-2-QAKD6LP7DME27AZUVKJIWTKGBF727EM6Q2FBIKLRPCLIRL2QCB7A/test/core-it-suite/target/test-classes/settings.xml -DperformRelease=true -e --batch-mode -Dmaven.repo.local=/home/jenkins/jenkins-slave/workspace/maven-box_maven_MNG-6401-2-QAKD6LP7DME27AZUVKJIWTKGBF727EM6Q2FBIKLRPCLIRL2QCB7A/test/it-local-repo package
[INFO] [jenkins-event-spy] Jenkins Maven Event Spy is disabled
[INFO] Error stacktraces are turned on.
[INFO] Scanning for projects...
[WARNING] 
[WARNING] Some problems were encountered while building the effective model for org.apache.maven.its.it0051:maven-it-it0051:jar:1.0
[WARNING] 'build.plugins.plugin.version' for org.apache.maven.plugins:maven-deploy-plugin is missing.
[WARNING] 
[WARNING] It is highly recommended to fix these problems because they threaten the stability of your build.
[WARNING] 
[WARNING] For this reason, future Maven versions might no longer support building such malformed projects.
[WARNING] 
[INFO] 
[INFO] ------------< org.apache.maven.its.it0051:maven-it-it0051 >-------------
[INFO] Building Maven Integration Test :: it0051 1.0
[INFO] --------------------------------[ jar ]---------------------------------
[INFO] ------------------------------------------------------------------------
[INFO] BUILD FAILURE
[INFO] ------------------------------------------------------------------------
[INFO] Total time: 0.012 s
[INFO] Finished at: 2018-07-30T20:12:18Z
[INFO] ------------------------------------------------------------------------
[ERROR] Could not find goal 'jar-no-fork' in plugin org.apache.maven.plugins:maven-source-plugin:0.1-stub-SNAPSHOT among available goals jar -> [Help 1]
org.apache.maven.plugin.MojoNotFoundException: Could not find goal 'jar-no-fork' in plugin org.apache.maven.plugins:maven-source-plugin:0.1-stub-SNAPSHOT among available goals jar
    at org.apache.maven.plugin.internal.DefaultMavenPluginManager.getMojoDescriptor (DefaultMavenPluginManager.java:292)
    at org.apache.maven.plugin.DefaultBuildPluginManager.getMojoDescriptor (DefaultBuildPluginManager.java:244)
    at org.apache.maven.lifecycle.internal.DefaultLifecycleMappingDelegate.calculateLifecycleMappings (DefaultLifecycleMappingDelegate.java:116)
    at org.apache.maven.lifecycle.internal.DefaultLifecycleExecutionPlanCalculator.calculateLifecycleMappings (DefaultLifecycleExecutionPlanCalculator.java:265)
    at org.apache.maven.lifecycle.internal.DefaultLifecycleExecutionPlanCalculator.calculateMojoExecutions (DefaultLifecycleExecutionPlanCalculator.java:217)
    at org.apache.maven.lifecycle.internal.DefaultLifecycleExecutionPlanCalculator.calculateExecutionPlan (DefaultLifecycleExecutionPlanCalculator.java:126)
    at org.apache.maven.lifecycle.internal.DefaultLifecycleExecutionPlanCalculator.calculateExecutionPlan (DefaultLifecycleExecutionPlanCalculator.java:144)
    at org.apache.maven.lifecycle.internal.builder.BuilderCommon.resolveBuildPlan (BuilderCommon.java:97)
    at org.apache.maven.lifecycle.internal.LifecycleModuleBuilder.buildProject (LifecycleModuleBuilder.java:111)
    at org.apache.maven.lifecycle.internal.LifecycleModuleBuilder.buildProject (LifecycleModuleBuilder.java:81)
    at org.apache.maven.lifecycle.internal.builder.singlethreaded.SingleThreadedBuilder.build (SingleThreadedBuilder.java:56)
    at org.apache.maven.lifecycle.internal.LifecycleStarter.execute (LifecycleStarter.java:128)
    at org.apache.maven.DefaultMaven.doExecute (DefaultMaven.java:305)
    at org.apache.maven.DefaultMaven.doExecute (DefaultMaven.java:192)
    at org.apache.maven.DefaultMaven.execute (DefaultMaven.java:105)
    at org.apache.maven.cli.MavenCli.execute (MavenCli.java:954)
    at org.apache.maven.cli.MavenCli.doMain (MavenCli.java:288)
    at org.apache.maven.cli.MavenCli.doMain (MavenCli.java:243)
    at sun.reflect.GeneratedMethodAccessor57.invoke (Unknown Source)
    at sun.reflect.DelegatingMethodAccessorImpl.invoke (DelegatingMethodAccessorImpl.java:43)
    at java.lang.reflect.Method.invoke (Method.java:498)
    at org.apache.maven.it.Embedded3xLauncher.run (Embedded3xLauncher.java:247)
    at org.apache.maven.it.Verifier.executeGoals (Verifier.java:1354)
    at org.apache.maven.it.Verifier.executeGoal (Verifier.java:1254)
    at org.apache.maven.it.Verifier.executeGoal (Verifier.java:1248)
    at org.apache.maven.it.MavenIT0051ReleaseProfileTest.testit0051 (MavenIT0051ReleaseProfileTest.java:48)
    at sun.reflect.NativeMethodAccessorImpl.invoke0 (Native Method)
    at sun.reflect.NativeMethodAccessorImpl.invoke (NativeMethodAccessorImpl.java:62)
    at sun.reflect.DelegatingMethodAccessorImpl.invoke (DelegatingMethodAccessorImpl.java:43)
    at java.lang.reflect.Method.invoke (Method.java:498)
    at junit.framework.TestCase.runTest (TestCase.java:176)
    at org.apache.maven.it.AbstractMavenIntegrationTestCase.runTest (AbstractMavenIntegrationTestCase.java:222)
    at junit.framework.TestCase.runBare (TestCase.java:141)
    at junit.framework.TestResult$1.protect (TestResult.java:122)
    at junit.framework.TestResult.runProtected (TestResult.java:142)
    at junit.framework.TestResult.run (TestResult.java:125)
    at junit.framework.TestCase.run (TestCase.java:129)
    at junit.framework.TestSuite.runTest (TestSuite.java:252)
    at junit.framework.TestSuite.run (TestSuite.java:247)
    at junit.framework.TestSuite.runTest (TestSuite.java:252)
    at junit.framework.TestSuite.run (TestSuite.java:247)
    at org.junit.internal.runners.JUnit38ClassRunner.run (JUnit38ClassRunner.java:86)
    at org.apache.maven.surefire.junit4.JUnit4Provider.execute (JUnit4Provider.java:369)
    at org.apache.maven.surefire.junit4.JUnit4Provider.executeWithRerun (JUnit4Provider.java:275)
    at org.apache.maven.surefire.junit4.JUnit4Provider.executeTestSet (JUnit4Provider.java:239)
    at org.apache.maven.surefire.junit4.JUnit4Provider.invoke (JUnit4Provider.java:160)
    at org.apache.maven.surefire.booter.ForkedBooter.invokeProviderInSameClassLoader (ForkedBooter.java:373)
    at org.apache.maven.surefire.booter.ForkedBooter.runSuitesInProcess (ForkedBooter.java:334)
    at org.apache.maven.surefire.booter.ForkedBooter.execute (ForkedBooter.java:119)
    at org.apache.maven.surefire.booter.ForkedBooter.main (ForkedBooter.java:407)
[ERROR] 
[ERROR] Re-run Maven using the -X switch to enable full debug logging.
[ERROR] 
[ERROR] For more information about the errors and possible solutions, please read the following articles:
[ERROR] [Help 1] http://cwiki.apache.org/confluence/display/MAVEN/MojoNotFoundException


Stack Trace:
org.apache.maven.it.VerificationException: 
Exit code was non-zero: 1; command line and log = 
/home/jenkins/jenkins-slave/workspace/maven-box_maven_MNG-6401-2-QAKD6LP7DME27AZUVKJIWTKGBF727EM6Q2FBIKLRPCLIRL2QCB7A/test/core-it-suite/target/apache-maven/bin/mvn --global-settings /home/jenkins/jenkins-slave/workspace/maven-box_maven_MNG-6401-2-QAKD6LP7DME27AZUVKJIWTKGBF727EM6Q2FBIKLRPCLIRL2QCB7A/test/core-it-suite/target/test-classes/settings.xml -DperformRelease=true -e --batch-mode -Dmaven.repo.local=/home/jenkins/jenkins-slave/workspace/maven-box_maven_MNG-6401-2-QAKD6LP7DME27AZUVKJIWTKGBF727EM6Q2FBIKLRPCLIRL2QCB7A/test/it-local-repo package
[INFO] [jenkins-event-spy] Jenkins Maven Event Spy is disabled
[INFO] Error stacktraces are turned on.
[INFO] Scanning for projects...
[WARNING] 
[WARNING] Some problems were encountered while building the effective model for org.apache.maven.its.it0051:maven-it-it0051:jar:1.0
[WARNING] 'build.plugins.plugin.version' for org.apache.maven.plugins:maven-deploy-plugin is missing.
[WARNING] 
[WARNING] It is highly recommended to fix these problems because they threaten the stability of your build.
[WARNING] 
[WARNING] For this reason, future Maven versions might no longer support building such malformed projects.
[WARNING] 
[INFO] 
[INFO] ------------< org.apache.maven.its.it0051:maven-it-it0051 >-------------
[INFO] Building Maven Integration Test :: it0051 1.0
[INFO] --------------------------------[ jar ]---------------------------------
[INFO] ------------------------------------------------------------------------
[INFO] BUILD FAILURE
[INFO] ------------------------------------------------------------------------
[INFO] Total time: 0.012 s
[INFO] Finished at: 2018-07-30T20:12:18Z
[INFO] ------------------------------------------------------------------------
[ERROR] Could not find goal 'jar-no-fork' in plugin org.apache.maven.plugins:maven-source-plugin:0.1-stub-SNAPSHOT among available goals jar -> [Help 1]
org.apache.maven.plugin.MojoNotFoundException: Could not find goal 'jar-no-fork' in plugin org.apache.maven.plugins:maven-source-plugin:0.1-stub-SNAPSHOT among available goals jar
    at org.apache.maven.plugin.internal.DefaultMavenPluginManager.getMojoDescriptor (DefaultMavenPluginManager.java:292)
    at org.apache.maven.plugin.DefaultBuildPluginManager.getMojoDescriptor (DefaultBuildPluginManager.java:244)
    at org.apache.maven.lifecycle.internal.DefaultLifecycleMappingDelegate.calculateLifecycleMappings (DefaultLifecycleMappingDelegate.java:116)
    at org.apache.maven.lifecycle.internal.DefaultLifecycleExecutionPlanCalculator.calculateLifecycleMappings (DefaultLifecycleExecutionPlanCalculator.java:265)
    at org.apache.maven.lifecycle.internal.DefaultLifecycleExecutionPlanCalculator.calculateMojoExecutions (DefaultLifecycleExecutionPlanCalculator.java:217)
    at org.apache.maven.lifecycle.internal.DefaultLifecycleExecutionPlanCalculator.calculateExecutionPlan (DefaultLifecycleExecutionPlanCalculator.java:126)
    at org.apache.maven.lifecycle.internal.DefaultLifecycleExecutionPlanCalculator.calculateExecutionPlan (DefaultLifecycleExecutionPlanCalculator.java:144)
    at org.apache.maven.lifecycle.internal.builder.BuilderCommon.resolveBuildPlan (BuilderCommon.java:97)
    at org.apache.maven.lifecycle.internal.LifecycleModuleBuilder.buildProject (LifecycleModuleBuilder.java:111)
    at org.apache.maven.lifecycle.internal.LifecycleModuleBuilder.buildProject (LifecycleModuleBuilder.java:81)
    at org.apache.maven.lifecycle.internal.builder.singlethreaded.SingleThreadedBuilder.build (SingleThreadedBuilder.java:56)
    at org.apache.maven.lifecycle.internal.LifecycleStarter.execute (LifecycleStarter.java:128)
    at org.apache.maven.DefaultMaven.doExecute (DefaultMaven.java:305)
    at org.apache.maven.DefaultMaven.doExecute (DefaultMaven.java:192)
    at org.apache.maven.DefaultMaven.execute (DefaultMaven.java:105)
    at org.apache.maven.cli.MavenCli.execute (MavenCli.java:954)
    at org.apache.maven.cli.MavenCli.doMain (MavenCli.java:288)
    at org.apache.maven.cli.MavenCli.doMain (MavenCli.java:243)
    at sun.reflect.GeneratedMethodAccessor57.invoke (Unknown Source)
    at sun.reflect.DelegatingMethodAccessorImpl.invoke (DelegatingMethodAccessorImpl.java:43)
    at java.lang.reflect.Method.invoke (Method.java:498)
    at org.apache.maven.it.Embedded3xLauncher.run (Embedded3xLauncher.java:247)
    at org.apache.maven.it.Verifier.executeGoals (Verifier.java:1354)
    at org.apache.maven.it.Verifier.executeGoal (Verifier.java:1254)
    at org.apache.maven.it.Verifier.executeGoal (Verifier.java:1248)
    at org.apache.maven.it.MavenIT0051ReleaseProfileTest.testit0051 (MavenIT0051ReleaseProfileTest.java:48)
    at sun.reflect.NativeMethodAccessorImpl.invoke0 (Native Method)
    at sun.reflect.NativeMethodAccessorImpl.invoke (NativeMethodAccessorImpl.java:62)
    at sun.reflect.DelegatingMethodAccessorImpl.invoke (DelegatingMethodAccessorImpl.java:43)
    at java.lang.reflect.Method.invoke (Method.java:498)
    at junit.framework.TestCase.runTest (TestCase.java:176)
    at org.apache.maven.it.AbstractMavenIntegrationTestCase.runTest (AbstractMavenIntegrationTestCase.java:222)
    at junit.framework.TestCase.runBare (TestCase.java:141)
    at junit.framework.TestResult$1.protect (TestResult.java:122)
    at junit.framework.TestResult.runProtected (TestResult.java:142)
    at junit.framework.TestResult.run (TestResult.java:125)
    at junit.framework.TestCase.run (TestCase.java:129)
    at junit.framework.TestSuite.runTest (TestSuite.java:252)
    at junit.framework.TestSuite.run (TestSuite.java:247)
    at junit.framework.TestSuite.runTest (TestSuite.java:252)
    at junit.framework.TestSuite.run (TestSuite.java:247)
    at org.junit.internal.runners.JUnit38ClassRunner.run (JUnit38ClassRunner.java:86)
    at org.apache.maven.surefire.junit4.JUnit4Provider.execute (JUnit4Provider.java:369)
    at org.apache.maven.surefire.junit4.JUnit4Provider.executeWithRerun (JUnit4Provider.java:275)
    at org.apache.maven.surefire.junit4.JUnit4Provider.executeTestSet (JUnit4Provider.java:239)
    at org.apache.maven.surefire.junit4.JUnit4Provider.invoke (JUnit4Provider.java:160)
    at org.apache.maven.surefire.booter.ForkedBooter.invokeProviderInSameClassLoader (ForkedBooter.java:373)
    at org.apache.maven.surefire.booter.ForkedBooter.runSuitesInProcess (ForkedBooter.java:334)
    at org.apache.maven.surefire.booter.ForkedBooter.execute (ForkedBooter.java:119)
    at org.apache.maven.surefire.booter.ForkedBooter.main (ForkedBooter.java:407)
[ERROR] 
[ERROR] Re-run Maven using the -X switch to enable full debug logging.
[ERROR] 
[ERROR] For more information about the errors and possible solutions, please read the following articles:
[ERROR] [Help 1] http://cwiki.apache.org/confluence/display/MAVEN/MojoNotFoundException

	at org.apache.maven.it.MavenIT0051ReleaseProfileTest.testit0051(MavenIT0051ReleaseProfileTest.java:48)


FAILED:  org.apache.maven.it.MavenIT0051ReleaseProfileTest.testit0051

Error Message:
Exit code was non-zero: 1; command line and log = 
/home/jenkins/jenkins-slave/workspace/maven-box_maven_MNG-6401-2-QAKD6LP7DME27AZUVKJIWTKGBF727EM6Q2FBIKLRPCLIRL2QCB7A/test/core-it-suite/target/apache-maven/bin/mvn --global-settings /home/jenkins/jenkins-slave/workspace/maven-box_maven_MNG-6401-2-QAKD6LP7DME27AZUVKJIWTKGBF727EM6Q2FBIKLRPCLIRL2QCB7A/test/core-it-suite/target/test-classes/settings.xml -DperformRelease=true -e --batch-mode -Dmaven.repo.local=/home/jenkins/jenkins-slave/workspace/maven-box_maven_MNG-6401-2-QAKD6LP7DME27AZUVKJIWTKGBF727EM6Q2FBIKLRPCLIRL2QCB7A/test/it-local-repo package
[INFO] [jenkins-event-spy] Jenkins Maven Event Spy is disabled
[INFO] Error stacktraces are turned on.
[INFO] Scanning for projects...
[WARNING] 
[WARNING] Some problems were encountered while building the effective model for org.apache.maven.its.it0051:maven-it-it0051:jar:1.0
[WARNING] 'build.plugins.plugin.version' for org.apache.maven.plugins:maven-deploy-plugin is missing.
[WARNING] 
[WARNING] It is highly recommended to fix these problems because they threaten the stability of your build.
[WARNING] 
[WARNING] For this reason, future Maven versions might no longer support building such malformed projects.
[WARNING] 
[INFO] 
[INFO] ------------< org.apache.maven.its.it0051:maven-it-it0051 >-------------
[INFO] Building Maven Integration Test :: it0051 1.0
[INFO] --------------------------------[ jar ]---------------------------------
[INFO] ------------------------------------------------------------------------
[INFO] BUILD FAILURE
[INFO] ------------------------------------------------------------------------
[INFO] Total time: 0.016 s
[INFO] Finished at: 2018-07-30T20:13:34Z
[INFO] ------------------------------------------------------------------------
[ERROR] Could not find goal 'jar-no-fork' in plugin org.apache.maven.plugins:maven-source-plugin:0.1-stub-SNAPSHOT among available goals jar -> [Help 1]
org.apache.maven.plugin.MojoNotFoundException: Could not find goal 'jar-no-fork' in plugin org.apache.maven.plugins:maven-source-plugin:0.1-stub-SNAPSHOT among available goals jar
    at org.apache.maven.plugin.internal.DefaultMavenPluginManager.getMojoDescriptor (DefaultMavenPluginManager.java:292)
    at org.apache.maven.plugin.DefaultBuildPluginManager.getMojoDescriptor (DefaultBuildPluginManager.java:244)
    at org.apache.maven.lifecycle.internal.DefaultLifecycleMappingDelegate.calculateLifecycleMappings (DefaultLifecycleMappingDelegate.java:116)
    at org.apache.maven.lifecycle.internal.DefaultLifecycleExecutionPlanCalculator.calculateLifecycleMappings (DefaultLifecycleExecutionPlanCalculator.java:265)
    at org.apache.maven.lifecycle.internal.DefaultLifecycleExecutionPlanCalculator.calculateMojoExecutions (DefaultLifecycleExecutionPlanCalculator.java:217)
    at org.apache.maven.lifecycle.internal.DefaultLifecycleExecutionPlanCalculator.calculateExecutionPlan (DefaultLifecycleExecutionPlanCalculator.java:126)
    at org.apache.maven.lifecycle.internal.DefaultLifecycleExecutionPlanCalculator.calculateExecutionPlan (DefaultLifecycleExecutionPlanCalculator.java:144)
    at org.apache.maven.lifecycle.internal.builder.BuilderCommon.resolveBuildPlan (BuilderCommon.java:97)
    at org.apache.maven.lifecycle.internal.LifecycleModuleBuilder.buildProject (LifecycleModuleBuilder.java:111)
    at org.apache.maven.lifecycle.internal.LifecycleModuleBuilder.buildProject (LifecycleModuleBuilder.java:81)
    at org.apache.maven.lifecycle.internal.builder.singlethreaded.SingleThreadedBuilder.build (SingleThreadedBuilder.java:56)
    at org.apache.maven.lifecycle.internal.LifecycleStarter.execute (LifecycleStarter.java:128)
    at org.apache.maven.DefaultMaven.doExecute (DefaultMaven.java:305)
    at org.apache.maven.DefaultMaven.doExecute (DefaultMaven.java:192)
    at org.apache.maven.DefaultMaven.execute (DefaultMaven.java:105)
    at org.apache.maven.cli.MavenCli.execute (MavenCli.java:954)
    at org.apache.maven.cli.MavenCli.doMain (MavenCli.java:288)
    at org.apache.maven.cli.MavenCli.doMain (MavenCli.java:243)
    at sun.reflect.GeneratedMethodAccessor57.invoke (Unknown Source)
    at sun.reflect.DelegatingMethodAccessorImpl.invoke (DelegatingMethodAccessorImpl.java:43)
    at java.lang.reflect.Method.invoke (Method.java:606)
    at org.apache.maven.it.Embedded3xLauncher.run (Embedded3xLauncher.java:247)
    at org.apache.maven.it.Verifier.executeGoals (Verifier.java:1354)
    at org.apache.maven.it.Verifier.executeGoal (Verifier.java:1254)
    at org.apache.maven.it.Verifier.executeGoal (Verifier.java:1248)
    at org.apache.maven.it.MavenIT0051ReleaseProfileTest.testit0051 (MavenIT0051ReleaseProfileTest.java:48)
    at sun.reflect.NativeMethodAccessorImpl.invoke0 (Native Method)
    at sun.reflect.NativeMethodAccessorImpl.invoke (NativeMethodAccessorImpl.java:57)
    at sun.reflect.DelegatingMethodAccessorImpl.invoke (DelegatingMethodAccessorImpl.java:43)
    at java.lang.reflect.Method.invoke (Method.java:606)
    at junit.framework.TestCase.runTest (TestCase.java:176)
    at org.apache.maven.it.AbstractMavenIntegrationTestCase.runTest (AbstractMavenIntegrationTestCase.java:222)
    at junit.framework.TestCase.runBare (TestCase.java:141)
    at junit.framework.TestResult$1.protect (TestResult.java:122)
    at junit.framework.TestResult.runProtected (TestResult.java:142)
    at junit.framework.TestResult.run (TestResult.java:125)
    at junit.framework.TestCase.run (TestCase.java:129)
    at junit.framework.TestSuite.runTest (TestSuite.java:252)
    at junit.framework.TestSuite.run (TestSuite.java:247)
    at junit.framework.TestSuite.runTest (TestSuite.java:252)
    at junit.framework.TestSuite.run (TestSuite.java:247)
    at org.junit.internal.runners.JUnit38ClassRunner.run (JUnit38ClassRunner.java:86)
    at org.apache.maven.surefire.junit4.JUnit4Provider.execute (JUnit4Provider.java:369)
    at org.apache.maven.surefire.junit4.JUnit4Provider.executeWithRerun (JUnit4Provider.java:275)
    at org.apache.maven.surefire.junit4.JUnit4Provider.executeTestSet (JUnit4Provider.java:239)
    at org.apache.maven.surefire.junit4.JUnit4Provider.invoke (JUnit4Provider.java:160)
    at org.apache.maven.surefire.booter.ForkedBooter.invokeProviderInSameClassLoader (ForkedBooter.java:373)
    at org.apache.maven.surefire.booter.ForkedBooter.runSuitesInProcess (ForkedBooter.java:334)
    at org.apache.maven.surefire.booter.ForkedBooter.execute (ForkedBooter.java:119)
    at org.apache.maven.surefire.booter.ForkedBooter.main (ForkedBooter.java:407)
[ERROR] 
[ERROR] Re-run Maven using the -X switch to enable full debug logging.
[ERROR] 
[ERROR] For more information about the errors and possible solutions, please read the following articles:
[ERROR] [Help 1] http://cwiki.apache.org/confluence/display/MAVEN/MojoNotFoundException


Stack Trace:
org.apache.maven.it.VerificationException: 
Exit code was non-zero: 1; command line and log = 
/home/jenkins/jenkins-slave/workspace/maven-box_maven_MNG-6401-2-QAKD6LP7DME27AZUVKJIWTKGBF727EM6Q2FBIKLRPCLIRL2QCB7A/test/core-it-suite/target/apache-maven/bin/mvn --global-settings /home/jenkins/jenkins-slave/workspace/maven-box_maven_MNG-6401-2-QAKD6LP7DME27AZUVKJIWTKGBF727EM6Q2FBIKLRPCLIRL2QCB7A/test/core-it-suite/target/test-classes/settings.xml -DperformRelease=true -e --batch-mode -Dmaven.repo.local=/home/jenkins/jenkins-slave/workspace/maven-box_maven_MNG-6401-2-QAKD6LP7DME27AZUVKJIWTKGBF727EM6Q2FBIKLRPCLIRL2QCB7A/test/it-local-repo package
[INFO] [jenkins-event-spy] Jenkins Maven Event Spy is disabled
[INFO] Error stacktraces are turned on.
[INFO] Scanning for projects...
[WARNING] 
[WARNING] Some problems were encountered while building the effective model for org.apache.maven.its.it0051:maven-it-it0051:jar:1.0
[WARNING] 'build.plugins.plugin.version' for org.apache.maven.plugins:maven-deploy-plugin is missing.
[WARNING] 
[WARNING] It is highly recommended to fix these problems because they threaten the stability of your build.
[WARNING] 
[WARNING] For this reason, future Maven versions might no longer support building such malformed projects.
[WARNING] 
[INFO] 
[INFO] ------------< org.apache.maven.its.it0051:maven-it-it0051 >-------------
[INFO] Building Maven Integration Test :: it0051 1.0
[INFO] --------------------------------[ jar ]---------------------------------
[INFO] ------------------------------------------------------------------------
[INFO] BUILD FAILURE
[INFO] ------------------------------------------------------------------------
[INFO] Total time: 0.016 s
[INFO] Finished at: 2018-07-30T20:13:34Z
[INFO] ------------------------------------------------------------------------
[ERROR] Could not find goal 'jar-no-fork' in plugin org.apache.maven.plugins:maven-source-plugin:0.1-stub-SNAPSHOT among available goals jar -> [Help 1]
org.apache.maven.plugin.MojoNotFoundException: Could not find goal 'jar-no-fork' in plugin org.apache.maven.plugins:maven-source-plugin:0.1-stub-SNAPSHOT among available goals jar
    at org.apache.maven.plugin.internal.DefaultMavenPluginManager.getMojoDescriptor (DefaultMavenPluginManager.java:292)
    at org.apache.maven.plugin.DefaultBuildPluginManager.getMojoDescriptor (DefaultBuildPluginManager.java:244)
    at org.apache.maven.lifecycle.internal.DefaultLifecycleMappingDelegate.calculateLifecycleMappings (DefaultLifecycleMappingDelegate.java:116)
    at org.apache.maven.lifecycle.internal.DefaultLifecycleExecutionPlanCalculator.calculateLifecycleMappings (DefaultLifecycleExecutionPlanCalculator.java:265)
    at org.apache.maven.lifecycle.internal.DefaultLifecycleExecutionPlanCalculator.calculateMojoExecutions (DefaultLifecycleExecutionPlanCalculator.java:217)
    at org.apache.maven.lifecycle.internal.DefaultLifecycleExecutionPlanCalculator.calculateExecutionPlan (DefaultLifecycleExecutionPlanCalculator.java:126)
    at org.apache.maven.lifecycle.internal.DefaultLifecycleExecutionPlanCalculator.calculateExecutionPlan (DefaultLifecycleExecutionPlanCalculator.java:144)
    at org.apache.maven.lifecycle.internal.builder.BuilderCommon.resolveBuildPlan (BuilderCommon.java:97)
    at org.apache.maven.lifecycle.internal.LifecycleModuleBuilder.buildProject (LifecycleModuleBuilder.java:111)
    at org.apache.maven.lifecycle.internal.LifecycleModuleBuilder.buildProject (LifecycleModuleBuilder.java:81)
    at org.apache.maven.lifecycle.internal.builder.singlethreaded.SingleThreadedBuilder.build (SingleThreadedBuilder.java:56)
    at org.apache.maven.lifecycle.internal.LifecycleStarter.execute (LifecycleStarter.java:128)
    at org.apache.maven.DefaultMaven.doExecute (DefaultMaven.java:305)
    at org.apache.maven.DefaultMaven.doExecute (DefaultMaven.java:192)
    at org.apache.maven.DefaultMaven.execute (DefaultMaven.java:105)
    at org.apache.maven.cli.MavenCli.execute (MavenCli.java:954)
    at org.apache.maven.cli.MavenCli.doMain (MavenCli.java:288)
    at org.apache.maven.cli.MavenCli.doMain (MavenCli.java:243)
    at sun.reflect.GeneratedMethodAccessor57.invoke (Unknown Source)
    at sun.reflect.DelegatingMethodAccessorImpl.invoke (DelegatingMethodAccessorImpl.java:43)
    at java.lang.reflect.Method.invoke (Method.java:606)
    at org.apache.maven.it.Embedded3xLauncher.run (Embedded3xLauncher.java:247)
    at org.apache.maven.it.Verifier.executeGoals (Verifier.java:1354)
    at org.apache.maven.it.Verifier.executeGoal (Verifier.java:1254)
    at org.apache.maven.it.Verifier.executeGoal (Verifier.java:1248)
    at org.apache.maven.it.MavenIT0051ReleaseProfileTest.testit0051 (MavenIT0051ReleaseProfileTest.java:48)
    at sun.reflect.NativeMethodAccessorImpl.invoke0 (Native Method)
    at sun.reflect.NativeMethodAccessorImpl.invoke (NativeMethodAccessorImpl.java:57)
    at sun.reflect.DelegatingMethodAccessorImpl.invoke (DelegatingMethodAccessorImpl.java:43)
    at java.lang.reflect.Method.invoke (Method.java:606)
    at junit.framework.TestCase.runTest (TestCase.java:176)
    at org.apache.maven.it.AbstractMavenIntegrationTestCase.runTest (AbstractMavenIntegrationTestCase.java:222)
    at junit.framework.TestCase.runBare (TestCase.java:141)
    at junit.framework.TestResult$1.protect (TestResult.java:122)
    at junit.framework.TestResult.runProtected (TestResult.java:142)
    at junit.framework.TestResult.run (TestResult.java:125)
    at junit.framework.TestCase.run (TestCase.java:129)
    at junit.framework.TestSuite.runTest (TestSuite.java:252)
    at junit.framework.TestSuite.run (TestSuite.java:247)
    at junit.framework.TestSuite.runTest (TestSuite.java:252)
    at junit.framework.TestSuite.run (TestSuite.java:247)
    at org.junit.internal.runners.JUnit38ClassRunner.run (JUnit38ClassRunner.java:86)
    at org.apache.maven.surefire.junit4.JUnit4Provider.execute (JUnit4Provider.java:369)
    at org.apache.maven.surefire.junit4.JUnit4Provider.executeWithRerun (JUnit4Provider.java:275)
    at org.apache.maven.surefire.junit4.JUnit4Provider.executeTestSet (JUnit4Provider.java:239)
    at org.apache.maven.surefire.junit4.JUnit4Provider.invoke (JUnit4Provider.java:160)
    at org.apache.maven.surefire.booter.ForkedBooter.invokeProviderInSameClassLoader (ForkedBooter.java:373)
    at org.apache.maven.surefire.booter.ForkedBooter.runSuitesInProcess (ForkedBooter.java:334)
    at org.apache.maven.surefire.booter.ForkedBooter.execute (ForkedBooter.java:119)
    at org.apache.maven.surefire.booter.ForkedBooter.main (ForkedBooter.java:407)
[ERROR] 
[ERROR] Re-run Maven using the -X switch to enable full debug logging.
[ERROR] 
[ERROR] For more information about the errors and possible solutions, please read the following articles:
[ERROR] [Help 1] http://cwiki.apache.org/confluence/display/MAVEN/MojoNotFoundException

	at org.apache.maven.it.MavenIT0051ReleaseProfileTest.testit0051(MavenIT0051ReleaseProfileTest.java:48)


FAILED:  org.apache.maven.it.MavenITmng6127PluginExecutionConfigurationInterferenceTest.testCustomMojoExecutionConfigurator

Error Message:
Exit code was non-zero: 1; command line and log = 
/home/jenkins/jenkins-slave/workspace/maven-box_maven_MNG-6401-2-QAKD6LP7DME27AZUVKJIWTKGBF727EM6Q2FBIKLRPCLIRL2QCB7A@2/test/core-it-suite/target/apache-maven/bin/mvn --global-settings /home/jenkins/jenkins-slave/workspace/maven-box_maven_MNG-6401-2-QAKD6LP7DME27AZUVKJIWTKGBF727EM6Q2FBIKLRPCLIRL2QCB7A@2/test/core-it-suite/target/test-classes/settings-remote.xml -e --batch-mode -Dmaven.repo.local=/home/jenkins/jenkins-slave/workspace/maven-box_maven_MNG-6401-2-QAKD6LP7DME27AZUVKJIWTKGBF727EM6Q2FBIKLRPCLIRL2QCB7A@2/test/it-local-repo install
[INFO] [jenkins-event-spy] Jenkins Maven Event Spy is disabled
[INFO] Error stacktraces are turned on.
[INFO] Scanning for projects...
[INFO] 
[INFO] ----------------------< mng-6127:mng-6127-plugin >----------------------
[INFO] Building mng-6127-plugin 0.1
[INFO] ----------------------------[ maven-plugin ]----------------------------
[INFO] Downloading from central: http://repo1.maven.org/maven2/org/apache/maven/maven-plugin-api/3.3.1/maven-plugin-api-3.3.1.pom
[INFO] Downloaded from central: http://repo1.maven.org/maven2/org/apache/maven/maven-plugin-api/3.3.1/maven-plugin-api-3.3.1.pom (3.0 kB at 216 kB/s)
[INFO] Downloading from central: http://repo1.maven.org/maven2/org/apache/maven/maven/3.3.1/maven-3.3.1.pom
[INFO] Downloaded from central: http://repo1.maven.org/maven2/org/apache/maven/maven/3.3.1/maven-3.3.1.pom (23 kB at 1.9 MB/s)
[INFO] Downloading from central: http://repo1.maven.org/maven2/org/apache/maven/maven-model/3.3.1/maven-model-3.3.1.pom
[INFO] Downloaded from central: http://repo1.maven.org/maven2/org/apache/maven/maven-model/3.3.1/maven-model-3.3.1.pom (4.2 kB at 386 kB/s)
[INFO] Downloading from central: http://repo1.maven.org/maven2/org/apache/maven/maven-artifact/3.3.1/maven-artifact-3.3.1.pom
[INFO] Downloaded from central: http://repo1.maven.org/maven2/org/apache/maven/maven-artifact/3.3.1/maven-artifact-3.3.1.pom (2.3 kB at 213 kB/s)
[INFO] Downloading from central: http://repo1.maven.org/maven2/org/eclipse/sisu/org.eclipse.sisu.plexus/0.3.0/org.eclipse.sisu.plexus-0.3.0.pom
[INFO] Downloaded from central: http://repo1.maven.org/maven2/org/eclipse/sisu/org.eclipse.sisu.plexus/0.3.0/org.eclipse.sisu.plexus-0.3.0.pom (4.2 kB at 321 kB/s)
[INFO] Downloading from central: http://repo1.maven.org/maven2/org/eclipse/sisu/sisu-plexus/0.3.0/sisu-plexus-0.3.0.pom
[INFO] Downloaded from central: http://repo1.maven.org/maven2/org/eclipse/sisu/sisu-plexus/0.3.0/sisu-plexus-0.3.0.pom (14 kB at 1.1 MB/s)
[INFO] Downloading from central: http://repo1.maven.org/maven2/org/eclipse/sisu/org.eclipse.sisu.inject/0.3.0/org.eclipse.sisu.inject-0.3.0.pom
[INFO] Downloaded from central: http://repo1.maven.org/maven2/org/eclipse/sisu/org.eclipse.sisu.inject/0.3.0/org.eclipse.sisu.inject-0.3.0.pom (2.6 kB at 239 kB/s)
[INFO] Downloading from central: http://repo1.maven.org/maven2/org/eclipse/sisu/sisu-inject/0.3.0/sisu-inject-0.3.0.pom
[INFO] Downloaded from central: http://repo1.maven.org/maven2/org/eclipse/sisu/sisu-inject/0.3.0/sisu-inject-0.3.0.pom (14 kB at 1.3 MB/s)
[INFO] Downloading from central: http://repo1.maven.org/maven2/org/apache/maven/maven-core/3.3.1/maven-core-3.3.1.pom
[INFO] Downloaded from central: http://repo1.maven.org/maven2/org/apache/maven/maven-core/3.3.1/maven-core-3.3.1.pom (8.5 kB at 709 kB/s)
[INFO] Downloading from central: http://repo1.maven.org/maven2/org/apache/maven/maven-settings/3.3.1/maven-settings-3.3.1.pom
[INFO] Downloaded from central: http://repo1.maven.org/maven2/org/apache/maven/maven-settings/3.3.1/maven-settings-3.3.1.pom (2.2 kB at 181 kB/s)
[INFO] Downloading from central: http://repo1.maven.org/maven2/org/apache/maven/maven-settings-builder/3.3.1/maven-settings-builder-3.3.1.pom
[INFO] Downloaded from central: http://repo1.maven.org/maven2/org/apache/maven/maven-settings-builder/3.3.1/maven-settings-builder-3.3.1.pom (2.7 kB at 227 kB/s)
[INFO] Downloading from central: http://repo1.maven.org/maven2/org/apache/maven/maven-builder-support/3.3.1/maven-builder-support-3.3.1.pom
[INFO] Downloaded from central: http://repo1.maven.org/maven2/org/apache/maven/maven-builder-support/3.3.1/maven-builder-support-3.3.1.pom (1.9 kB at 155 kB/s)
[INFO] Downloading from central: http://repo1.maven.org/maven2/org/apache/maven/maven-repository-metadata/3.3.1/maven-repository-metadata-3.3.1.pom
[INFO] Downloaded from central: http://repo1.maven.org/maven2/org/apache/maven/maven-repository-metadata/3.3.1/maven-repository-metadata-3.3.1.pom (2.2 kB at 186 kB/s)
[INFO] Downloading from central: http://repo1.maven.org/maven2/org/apache/maven/maven-model-builder/3.3.1/maven-model-builder-3.3.1.pom
[INFO] Downloaded from central: http://repo1.maven.org/maven2/org/apache/maven/maven-model-builder/3.3.1/maven-model-builder-3.3.1.pom (3.2 kB at 294 kB/s)
[INFO] Downloading from central: http://repo1.maven.org/maven2/org/apache/maven/maven-aether-provider/3.3.1/maven-aether-provider-3.3.1.pom
[INFO] Downloaded from central: http://repo1.maven.org/maven2/org/apache/maven/maven-aether-provider/3.3.1/maven-aether-provider-3.3.1.pom (4.2 kB at 327 kB/s)
[INFO] Downloading from central: http://repo1.maven.org/maven2/org/sonatype/sisu/sisu-guice/3.2.5/sisu-guice-3.2.5.pom
[INFO] Downloaded from central: http://repo1.maven.org/maven2/org/sonatype/sisu/sisu-guice/3.2.5/sisu-guice-3.2.5.pom (11 kB at 841 kB/s)
[INFO] Downloading from central: http://repo1.maven.org/maven2/org/sonatype/sisu/inject/guice-parent/3.2.5/guice-parent-3.2.5.pom
[INFO] Downloaded from central: http://repo1.maven.org/maven2/org/sonatype/sisu/inject/guice-parent/3.2.5/guice-parent-3.2.5.pom (15 kB at 1.3 MB/s)
[INFO] Downloading from central: http://repo1.maven.org/maven2/org/sonatype/forge/forge-parent/38/forge-parent-38.pom
[INFO] Downloaded from central: http://repo1.maven.org/maven2/org/sonatype/forge/forge-parent/38/forge-parent-38.pom (19 kB at 1.4 MB/s)
[INFO] Downloading from central: http://repo1.maven.org/maven2/org/apache/maven/maven-plugin-api/3.3.1/maven-plugin-api-3.3.1.jar
[INFO] Downloading from central: http://repo1.maven.org/maven2/org/apache/maven/maven-artifact/3.3.1/maven-artifact-3.3.1.jar
[INFO] Downloading from central: http://repo1.maven.org/maven2/org/eclipse/sisu/org.eclipse.sisu.plexus/0.3.0/org.eclipse.sisu.plexus-0.3.0.jar
[INFO] Downloading from central: http://repo1.maven.org/maven2/org/eclipse/sisu/org.eclipse.sisu.inject/0.3.0/org.eclipse.sisu.inject-0.3.0.jar
[INFO] Downloading from central: http://repo1.maven.org/maven2/org/apache/maven/maven-model/3.3.1/maven-model-3.3.1.jar
[INFO] Downloaded from central: http://repo1.maven.org/maven2/org/apache/maven/maven-plugin-api/3.3.1/maven-plugin-api-3.3.1.jar (46 kB at 2.9 MB/s)
[INFO] Downloading from central: http://repo1.maven.org/maven2/org/apache/maven/maven-core/3.3.1/maven-core-3.3.1.jar
[INFO] Downloaded from central: http://repo1.maven.org/maven2/org/apache/maven/maven-artifact/3.3.1/maven-artifact-3.3.1.jar (55 kB at 2.5 MB/s)
[INFO] Downloading from central: http://repo1.maven.org/maven2/org/apache/maven/maven-settings/3.3.1/maven-settings-3.3.1.jar
[INFO] Downloaded from central: http://repo1.maven.org/maven2/org/apache/maven/maven-model/3.3.1/maven-model-3.3.1.jar (161 kB at 7.7 MB/s)
[INFO] Downloading from central: http://repo1.maven.org/maven2/org/apache/maven/maven-settings-builder/3.3.1/maven-settings-builder-3.3.1.jar
[INFO] Downloaded from central: http://repo1.maven.org/maven2/org/eclipse/sisu/org.eclipse.sisu.plexus/0.3.0/org.eclipse.sisu.plexus-0.3.0.jar (205 kB at 6.8 MB/s)
[INFO] Downloading from central: http://repo1.maven.org/maven2/org/apache/maven/maven-builder-support/3.3.1/maven-builder-support-3.3.1.jar
[INFO] Downloaded from central: http://repo1.maven.org/maven2/org/apache/maven/maven-settings/3.3.1/maven-settings-3.3.1.jar (43 kB at 1.6 MB/s)
[INFO] Downloading from central: http://repo1.maven.org/maven2/org/apache/maven/maven-repository-metadata/3.3.1/maven-repository-metadata-3.3.1.jar
[INFO] Downloaded from central: http://repo1.maven.org/maven2/org/eclipse/sisu/org.eclipse.sisu.inject/0.3.0/org.eclipse.sisu.inject-0.3.0.jar (375 kB at 12 MB/s)
[INFO] Downloading from central: http://repo1.maven.org/maven2/org/apache/maven/maven-model-builder/3.3.1/maven-model-builder-3.3.1.jar
[INFO] Downloaded from central: http://repo1.maven.org/maven2/org/apache/maven/maven-settings-builder/3.3.1/maven-settings-builder-3.3.1.jar (43 kB at 1.4 MB/s)
[INFO] Downloading from central: http://repo1.maven.org/maven2/org/apache/maven/maven-aether-provider/3.3.1/maven-aether-provider-3.3.1.jar
[INFO] Downloaded from central: http://repo1.maven.org/maven2/org/apache/maven/maven-core/3.3.1/maven-core-3.3.1.jar (632 kB at 19 MB/s)
[INFO] Downloading from central: http://repo1.maven.org/maven2/org/sonatype/sisu/sisu-guice/3.2.5/sisu-guice-3.2.5-no_aop.jar
[INFO] Downloaded from central: http://repo1.maven.org/maven2/org/apache/maven/maven-builder-support/3.3.1/maven-builder-support-3.3.1.jar (15 kB at 428 kB/s)
[INFO] Downloaded from central: http://repo1.maven.org/maven2/org/apache/maven/maven-repository-metadata/3.3.1/maven-repository-metadata-3.3.1.jar (26 kB at 666 kB/s)
[INFO] Downloaded from central: http://repo1.maven.org/maven2/org/apache/maven/maven-aether-provider/3.3.1/maven-aether-provider-3.3.1.jar (66 kB at 1.5 MB/s)
[INFO] Downloaded from central: http://repo1.maven.org/maven2/org/sonatype/sisu/sisu-guice/3.2.5/sisu-guice-3.2.5-no_aop.jar (400 kB at 7.1 MB/s)
[INFO] Downloaded from central: http://repo1.maven.org/maven2/org/apache/maven/maven-model-builder/3.3.1/maven-model-builder-3.3.1.jar (176 kB at 2.8 MB/s)
[INFO] 
[INFO] --- maven-resources-plugin:2.6:resources (default-resources) @ mng-6127-plugin ---
[WARNING] Using platform encoding (ISO-8859-1 actually) to copy filtered resources, i.e. build is platform dependent!
[INFO] Copying 1 resource
[INFO] 
[INFO] --- maven-compiler-plugin:3.1:compile (default-compile) @ mng-6127-plugin ---
[INFO] Changes detected - recompiling the module!
[WARNING] File encoding has not been set, using platform encoding ISO-8859-1, i.e. build is platform dependent!
[INFO] Compiling 1 source file to /home/jenkins/jenkins-slave/workspace/maven-box_maven_MNG-6401-2-QAKD6LP7DME27AZUVKJIWTKGBF727EM6Q2FBIKLRPCLIRL2QCB7A@2/test/core-it-suite/target/test-classes/mng-6127-plugin-execution-configuration-interference/plugin/target/classes
[INFO] -------------------------------------------------------------
[ERROR] COMPILATION ERROR : 
[INFO] -------------------------------------------------------------
[ERROR] /home/jenkins/jenkins-slave/workspace/maven-box_maven_MNG-6401-2-QAKD6LP7DME27AZUVKJIWTKGBF727EM6Q2FBIKLRPCLIRL2QCB7A@2/test/core-it-suite/target/test-classes/mng-6127-plugin-execution-configuration-interference/plugin/src/main/java/org/apache/maven/its/mng6127/plugin/TestMojo.java:[67,13] try-with-resources is not supported in -source 1.6
  (use -source 7 or higher to enable try-with-resources)
[INFO] 1 error
[INFO] -------------------------------------------------------------
[INFO] ------------------------------------------------------------------------
[INFO] BUILD FAILURE
[INFO] ------------------------------------------------------------------------
[INFO] Total time: 0.811 s
[INFO] Finished at: 2018-07-30T20:06:51Z
[INFO] ------------------------------------------------------------------------
[ERROR] Failed to execute goal org.apache.maven.plugins:maven-compiler-plugin:3.1:compile (default-compile) on project mng-6127-plugin: Compilation failure
[ERROR] /home/jenkins/jenkins-slave/workspace/maven-box_maven_MNG-6401-2-QAKD6LP7DME27AZUVKJIWTKGBF727EM6Q2FBIKLRPCLIRL2QCB7A@2/test/core-it-suite/target/test-classes/mng-6127-plugin-execution-configuration-interference/plugin/src/main/java/org/apache/maven/its/mng6127/plugin/TestMojo.java:[67,13] try-with-resources is not supported in -source 1.6
[ERROR]   (use -source 7 or higher to enable try-with-resources)
[ERROR] -> [Help 1]
org.apache.maven.lifecycle.LifecycleExecutionException: Failed to execute goal org.apache.maven.plugins:maven-compiler-plugin:3.1:compile (default-compile) on project mng-6127-plugin: Compilation failure
/home/jenkins/jenkins-slave/workspace/maven-box_maven_MNG-6401-2-QAKD6LP7DME27AZUVKJIWTKGBF727EM6Q2FBIKLRPCLIRL2QCB7A@2/test/core-it-suite/target/test-classes/mng-6127-plugin-execution-configuration-interference/plugin/src/main/java/org/apache/maven/its/mng6127/plugin/TestMojo.java:[67,13] try-with-resources is not supported in -source 1.6
  (use -source 7 or higher to enable try-with-resources)

    at org.apache.maven.lifecycle.internal.MojoExecutor.execute (MojoExecutor.java:213)
    at org.apache.maven.lifecycle.internal.MojoExecutor.execute (MojoExecutor.java:154)
    at org.apache.maven.lifecycle.internal.MojoExecutor.execute (MojoExecutor.java:146)
    at org.apache.maven.lifecycle.internal.LifecycleModuleBuilder.buildProject (LifecycleModuleBuilder.java:117)
    at org.apache.maven.lifecycle.internal.LifecycleModuleBuilder.buildProject (LifecycleModuleBuilder.java:81)
    at org.apache.maven.lifecycle.internal.builder.singlethreaded.SingleThreadedBuilder.build (SingleThreadedBuilder.java:56)
    at org.apache.maven.lifecycle.internal.LifecycleStarter.execute (LifecycleStarter.java:128)
    at org.apache.maven.DefaultMaven.doExecute (DefaultMaven.java:305)
    at org.apache.maven.DefaultMaven.doExecute (DefaultMaven.java:192)
    at org.apache.maven.DefaultMaven.execute (DefaultMaven.java:105)
    at org.apache.maven.cli.MavenCli.execute (MavenCli.java:954)
    at org.apache.maven.cli.MavenCli.doMain (MavenCli.java:288)
    at org.apache.maven.cli.MavenCli.doMain (MavenCli.java:243)
    at jdk.internal.reflect.NativeMethodAccessorImpl.invoke0 (Native Method)
    at jdk.internal.reflect.NativeMethodAccessorImpl.invoke (NativeMethodAccessorImpl.java:62)
    at jdk.internal.reflect.DelegatingMethodAccessorImpl.invoke (DelegatingMethodAccessorImpl.java:43)
    at java.lang.reflect.Method.invoke (Method.java:564)
    at org.apache.maven.it.Embedded3xLauncher.run (Embedded3xLauncher.java:247)
    at org.apache.maven.it.Verifier.executeGoals (Verifier.java:1354)
    at org.apache.maven.it.Verifier.executeGoal (Verifier.java:1254)
    at org.apache.maven.it.Verifier.executeGoal (Verifier.java:1248)
    at org.apache.maven.it.MavenITmng6127PluginExecutionConfigurationInterferenceTest.testCustomMojoExecutionConfigurator (MavenITmng6127PluginExecutionConfigurationInterferenceTest.java:52)
    at jdk.internal.reflect.NativeMethodAccessorImpl.invoke0 (Native Method)
    at jdk.internal.reflect.NativeMethodAccessorImpl.invoke (NativeMethodAccessorImpl.java:62)
    at jdk.internal.reflect.DelegatingMethodAccessorImpl.invoke (DelegatingMethodAccessorImpl.java:43)
    at java.lang.reflect.Method.invoke (Method.java:564)
    at junit.framework.TestCase.runTest (TestCase.java:176)
    at org.apache.maven.it.AbstractMavenIntegrationTestCase.runTest (AbstractMavenIntegrationTestCase.java:222)
    at junit.framework.TestCase.runBare (TestCase.java:141)
    at junit.framework.TestResult$1.protect (TestResult.java:122)
    at junit.framework.TestResult.runProtected (TestResult.java:142)
    at junit.framework.TestResult.run (TestResult.java:125)
    at junit.framework.TestCase.run (TestCase.java:129)
    at junit.framework.TestSuite.runTest (TestSuite.java:252)
    at junit.framework.TestSuite.run (TestSuite.java:247)
    at junit.framework.TestSuite.runTest (TestSuite.java:252)
    at junit.framework.TestSuite.run (TestSuite.java:247)
    at org.junit.internal.runners.JUnit38ClassRunner.run (JUnit38ClassRunner.java:86)
    at org.apache.maven.surefire.junit4.JUnit4Provider.execute (JUnit4Provider.java:369)
    at org.apache.maven.surefire.junit4.JUnit4Provider.executeWithRerun (JUnit4Provider.java:275)
    at org.apache.maven.surefire.junit4.JUnit4Provider.executeTestSet (JUnit4Provider.java:239)
    at org.apache.maven.surefire.junit4.JUnit4Provider.invoke (JUnit4Provider.java:160)
    at org.apache.maven.surefire.booter.ForkedBooter.invokeProviderInSameClassLoader (ForkedBooter.java:373)
    at org.apache.maven.surefire.booter.ForkedBooter.runSuitesInProcess (ForkedBooter.java:334)
    at org.apache.maven.surefire.booter.ForkedBooter.execute (ForkedBooter.java:119)
    at org.apache.maven.surefire.booter.ForkedBooter.main (ForkedBooter.java:407)
Caused by: org.apache.maven.plugin.compiler.CompilationFailureException: Compilation failure
/home/jenkins/jenkins-slave/workspace/maven-box_maven_MNG-6401-2-QAKD6LP7DME27AZUVKJIWTKGBF727EM6Q2FBIKLRPCLIRL2QCB7A@2/test/core-it-suite/target/test-classes/mng-6127-plugin-execution-configuration-interference/plugin/src/main/java/org/apache/maven/its/mng6127/plugin/TestMojo.java:[67,13] try-with-resources is not supported in -source 1.6
  (use -source 7 or higher to enable try-with-resources)

    at org.apache.maven.plugin.compiler.AbstractCompilerMojo.execute (AbstractCompilerMojo.java:858)
    at org.apache.maven.plugin.compiler.CompilerMojo.execute (CompilerMojo.java:129)
    at org.apache.maven.plugin.DefaultBuildPluginManager.executeMojo (DefaultBuildPluginManager.java:137)
    at org.apache.maven.lifecycle.internal.MojoExecutor.execute (MojoExecutor.java:208)
    at org.apache.maven.lifecycle.internal.MojoExecutor.execute (MojoExecutor.java:154)
    at org.apache.maven.lifecycle.internal.MojoExecutor.execute (MojoExecutor.java:146)
    at org.apache.maven.lifecycle.internal.LifecycleModuleBuilder.buildProject (LifecycleModuleBuilder.java:117)
    at org.apache.maven.lifecycle.internal.LifecycleModuleBuilder.buildProject (LifecycleModuleBuilder.java:81)
    at org.apache.maven.lifecycle.internal.builder.singlethreaded.SingleThreadedBuilder.build (SingleThreadedBuilder.java:56)
    at org.apache.maven.lifecycle.internal.LifecycleStarter.execute (LifecycleStarter.java:128)
    at org.apache.maven.DefaultMaven.doExecute (DefaultMaven.java:305)
    at org.apache.maven.DefaultMaven.doExecute (DefaultMaven.java:192)
    at org.apache.maven.DefaultMaven.execute (DefaultMaven.java:105)
    at org.apache.maven.cli.MavenCli.execute (MavenCli.java:954)
    at org.apache.maven.cli.MavenCli.doMain (MavenCli.java:288)
    at org.apache.maven.cli.MavenCli.doMain (MavenCli.java:243)
    at jdk.internal.reflect.NativeMethodAccessorImpl.invoke0 (Native Method)
    at jdk.internal.reflect.NativeMethodAccessorImpl.invoke (NativeMethodAccessorImpl.java:62)
    at jdk.internal.reflect.DelegatingMethodAccessorImpl.invoke (DelegatingMethodAccessorImpl.java:43)
    at java.lang.reflect.Method.invoke (Method.java:564)
    at org.apache.maven.it.Embedded3xLauncher.run (Embedded3xLauncher.java:247)
    at org.apache.maven.it.Verifier.executeGoals (Verifier.java:1354)
    at org.apache.maven.it.Verifier.executeGoal (Verifier.java:1254)
    at org.apache.maven.it.Verifier.executeGoal (Verifier.java:1248)
    at org.apache.maven.it.MavenITmng6127PluginExecutionConfigurationInterferenceTest.testCustomMojoExecutionConfigurator (MavenITmng6127PluginExecutionConfigurationInterferenceTest.java:52)
    at jdk.internal.reflect.NativeMethodAccessorImpl.invoke0 (Native Method)
    at jdk.internal.reflect.NativeMethodAccessorImpl.invoke (NativeMethodAccessorImpl.java:62)
    at jdk.internal.reflect.DelegatingMethodAccessorImpl.invoke (DelegatingMethodAccessorImpl.java:43)
    at java.lang.reflect.Method.invoke (Method.java:564)
    at junit.framework.TestCase.runTest (TestCase.java:176)
    at org.apache.maven.it.AbstractMavenIntegrationTestCase.runTest (AbstractMavenIntegrationTestCase.java:222)
    at junit.framework.TestCase.runBare (TestCase.java:141)
    at junit.framework.TestResult$1.protect (TestResult.java:122)
    at junit.framework.TestResult.runProtected (TestResult.java:142)
    at junit.framework.TestResult.run (TestResult.java:125)
    at junit.framework.TestCase.run (TestCase.java:129)
    at junit.framework.TestSuite.runTest (TestSuite.java:252)
    at junit.framework.TestSuite.run (TestSuite.java:247)
    at junit.framework.TestSuite.runTest (TestSuite.java:252)
    at junit.framework.TestSuite.run (TestSuite.java:247)
    at org.junit.internal.runners.JUnit38ClassRunner.run (JUnit38ClassRunner.java:86)
    at org.apache.maven.surefire.junit4.JUnit4Provider.execute (JUnit4Provider.java:369)
    at org.apache.maven.surefire.junit4.JUnit4Provider.executeWithRerun (JUnit4Provider.java:275)
    at org.apache.maven.surefire.junit4.JUnit4Provider.executeTestSet (JUnit4Provider.java:239)
    at org.apache.maven.surefire.junit4.JUnit4Provider.invoke (JUnit4Provider.java:160)
    at org.apache.maven.surefire.booter.ForkedBooter.invokeProviderInSameClassLoader (ForkedBooter.java:373)
    at org.apache.maven.surefire.booter.ForkedBooter.runSuitesInProcess (ForkedBooter.java:334)
    at org.apache.maven.surefire.booter.ForkedBooter.execute (ForkedBooter.java:119)
    at org.apache.maven.surefire.booter.ForkedBooter.main (ForkedBooter.java:407)
[ERROR] 
[ERROR] Re-run Maven using the -X switch to enable full debug logging.
[ERROR] 
[ERROR] For more information about the errors and possible solutions, please read the following articles:
[ERROR] [Help 1] http://cwiki.apache.org/confluence/display/MAVEN/MojoFailureException


Stack Trace:
org.apache.maven.it.VerificationException: 
Exit code was non-zero: 1; command line and log = 
/home/jenkins/jenkins-slave/workspace/maven-box_maven_MNG-6401-2-QAKD6LP7DME27AZUVKJIWTKGBF727EM6Q2FBIKLRPCLIRL2QCB7A@2/test/core-it-suite/target/apache-maven/bin/mvn --global-settings /home/jenkins/jenkins-slave/workspace/maven-box_maven_MNG-6401-2-QAKD6LP7DME27AZUVKJIWTKGBF727EM6Q2FBIKLRPCLIRL2QCB7A@2/test/core-it-suite/target/test-classes/settings-remote.xml -e --batch-mode -Dmaven.repo.local=/home/jenkins/jenkins-slave/workspace/maven-box_maven_MNG-6401-2-QAKD6LP7DME27AZUVKJIWTKGBF727EM6Q2FBIKLRPCLIRL2QCB7A@2/test/it-local-repo install
[INFO] [jenkins-event-spy] Jenkins Maven Event Spy is disabled
[INFO] Error stacktraces are turned on.
[INFO] Scanning for projects...
[INFO] 
[INFO] ----------------------< mng-6127:mng-6127-plugin >----------------------
[INFO] Building mng-6127-plugin 0.1
[INFO] ----------------------------[ maven-plugin ]----------------------------
[INFO] Downloading from central: http://repo1.maven.org/maven2/org/apache/maven/maven-plugin-api/3.3.1/maven-plugin-api-3.3.1.pom
[INFO] Downloaded from central: http://repo1.maven.org/maven2/org/apache/maven/maven-plugin-api/3.3.1/maven-plugin-api-3.3.1.pom (3.0 kB at 216 kB/s)
[INFO] Downloading from central: http://repo1.maven.org/maven2/org/apache/maven/maven/3.3.1/maven-3.3.1.pom
[INFO] Downloaded from central: http://repo1.maven.org/maven2/org/apache/maven/maven/3.3.1/maven-3.3.1.pom (23 kB at 1.9 MB/s)
[INFO] Downloading from central: http://repo1.maven.org/maven2/org/apache/maven/maven-model/3.3.1/maven-model-3.3.1.pom
[INFO] Downloaded from central: http://repo1.maven.org/maven2/org/apache/maven/maven-model/3.3.1/maven-model-3.3.1.pom (4.2 kB at 386 kB/s)
[INFO] Downloading from central: http://repo1.maven.org/maven2/org/apache/maven/maven-artifact/3.3.1/maven-artifact-3.3.1.pom
[INFO] Downloaded from central: http://repo1.maven.org/maven2/org/apache/maven/maven-artifact/3.3.1/maven-artifact-3.3.1.pom (2.3 kB at 213 kB/s)
[INFO] Downloading from central: http://repo1.maven.org/maven2/org/eclipse/sisu/org.eclipse.sisu.plexus/0.3.0/org.eclipse.sisu.plexus-0.3.0.pom
[INFO] Downloaded from central: http://repo1.maven.org/maven2/org/eclipse/sisu/org.eclipse.sisu.plexus/0.3.0/org.eclipse.sisu.plexus-0.3.0.pom (4.2 kB at 321 kB/s)
[INFO] Downloading from central: http://repo1.maven.org/maven2/org/eclipse/sisu/sisu-plexus/0.3.0/sisu-plexus-0.3.0.pom
[INFO] Downloaded from central: http://repo1.maven.org/maven2/org/eclipse/sisu/sisu-plexus/0.3.0/sisu-plexus-0.3.0.pom (14 kB at 1.1 MB/s)
[INFO] Downloading from central: http://repo1.maven.org/maven2/org/eclipse/sisu/org.eclipse.sisu.inject/0.3.0/org.eclipse.sisu.inject-0.3.0.pom
[INFO] Downloaded from central: http://repo1.maven.org/maven2/org/eclipse/sisu/org.eclipse.sisu.inject/0.3.0/org.eclipse.sisu.inject-0.3.0.pom (2.6 kB at 239 kB/s)
[INFO] Downloading from central: http://repo1.maven.org/maven2/org/eclipse/sisu/sisu-inject/0.3.0/sisu-inject-0.3.0.pom
[INFO] Downloaded from central: http://repo1.maven.org/maven2/org/eclipse/sisu/sisu-inject/0.3.0/sisu-inject-0.3.0.pom (14 kB at 1.3 MB/s)
[INFO] Downloading from central: http://repo1.maven.org/maven2/org/apache/maven/maven-core/3.3.1/maven-core-3.3.1.pom
[INFO] Downloaded from central: http://repo1.maven.org/maven2/org/apache/maven/maven-core/3.3.1/maven-core-3.3.1.pom (8.5 kB at 709 kB/s)
[INFO] Downloading from central: http://repo1.maven.org/maven2/org/apache/maven/maven-settings/3.3.1/maven-settings-3.3.1.pom
[INFO] Downloaded from central: http://repo1.maven.org/maven2/org/apache/maven/maven-settings/3.3.1/maven-settings-3.3.1.pom (2.2 kB at 181 kB/s)
[INFO] Downloading from central: http://repo1.maven.org/maven2/org/apache/maven/maven-settings-builder/3.3.1/maven-settings-builder-3.3.1.pom
[INFO] Downloaded from central: http://repo1.maven.org/maven2/org/apache/maven/maven-settings-builder/3.3.1/maven-settings-builder-3.3.1.pom (2.7 kB at 227 kB/s)
[INFO] Downloading from central: http://repo1.maven.org/maven2/org/apache/maven/maven-builder-support/3.3.1/maven-builder-support-3.3.1.pom
[INFO] Downloaded from central: http://repo1.maven.org/maven2/org/apache/maven/maven-builder-support/3.3.1/maven-builder-support-3.3.1.pom (1.9 kB at 155 kB/s)
[INFO] Downloading from central: http://repo1.maven.org/maven2/org/apache/maven/maven-repository-metadata/3.3.1/maven-repository-metadata-3.3.1.pom
[INFO] Downloaded from central: http://repo1.maven.org/maven2/org/apache/maven/maven-repository-metadata/3.3.1/maven-repository-metadata-3.3.1.pom (2.2 kB at 186 kB/s)
[INFO] Downloading from central: http://repo1.maven.org/maven2/org/apache/maven/maven-model-builder/3.3.1/maven-model-builder-3.3.1.pom
[INFO] Downloaded from central: http://repo1.maven.org/maven2/org/apache/maven/maven-model-builder/3.3.1/maven-model-builder-3.3.1.pom (3.2 kB at 294 kB/s)
[INFO] Downloading from central: http://repo1.maven.org/maven2/org/apache/maven/maven-aether-provider/3.3.1/maven-aether-provider-3.3.1.pom
[INFO] Downloaded from central: http://repo1.maven.org/maven2/org/apache/maven/maven-aether-provider/3.3.1/maven-aether-provider-3.3.1.pom (4.2 kB at 327 kB/s)
[INFO] Downloading from central: http://repo1.maven.org/maven2/org/sonatype/sisu/sisu-guice/3.2.5/sisu-guice-3.2.5.pom
[INFO] Downloaded from central: http://repo1.maven.org/maven2/org/sonatype/sisu/sisu-guice/3.2.5/sisu-guice-3.2.5.pom (11 kB at 841 kB/s)
[INFO] Downloading from central: http://repo1.maven.org/maven2/org/sonatype/sisu/inject/guice-parent/3.2.5/guice-parent-3.2.5.pom
[INFO] Downloaded from central: http://repo1.maven.org/maven2/org/sonatype/sisu/inject/guice-parent/3.2.5/guice-parent-3.2.5.pom (15 kB at 1.3 MB/s)
[INFO] Downloading from central: http://repo1.maven.org/maven2/org/sonatype/forge/forge-parent/38/forge-parent-38.pom
[INFO] Downloaded from central: http://repo1.maven.org/maven2/org/sonatype/forge/forge-parent/38/forge-parent-38.pom (19 kB at 1.4 MB/s)
[INFO] Downloading from central: http://repo1.maven.org/maven2/org/apache/maven/maven-plugin-api/3.3.1/maven-plugin-api-3.3.1.jar
[INFO] Downloading from central: http://repo1.maven.org/maven2/org/apache/maven/maven-artifact/3.3.1/maven-artifact-3.3.1.jar
[INFO] Downloading from central: http://repo1.maven.org/maven2/org/eclipse/sisu/org.eclipse.sisu.plexus/0.3.0/org.eclipse.sisu.plexus-0.3.0.jar
[INFO] Downloading from central: http://repo1.maven.org/maven2/org/eclipse/sisu/org.eclipse.sisu.inject/0.3.0/org.eclipse.sisu.inject-0.3.0.jar
[INFO] Downloading from central: http://repo1.maven.org/maven2/org/apache/maven/maven-model/3.3.1/maven-model-3.3.1.jar
[INFO] Downloaded from central: http://repo1.maven.org/maven2/org/apache/maven/maven-plugin-api/3.3.1/maven-plugin-api-3.3.1.jar (46 kB at 2.9 MB/s)
[INFO] Downloading from central: http://repo1.maven.org/maven2/org/apache/maven/maven-core/3.3.1/maven-core-3.3.1.jar
[INFO] Downloaded from central: http://repo1.maven.org/maven2/org/apache/maven/maven-artifact/3.3.1/maven-artifact-3.3.1.jar (55 kB at 2.5 MB/s)
[INFO] Downloading from central: http://repo1.maven.org/maven2/org/apache/maven/maven-settings/3.3.1/maven-settings-3.3.1.jar
[INFO] Downloaded from central: http://repo1.maven.org/maven2/org/apache/maven/maven-model/3.3.1/maven-model-3.3.1.jar (161 kB at 7.7 MB/s)
[INFO] Downloading from central: http://repo1.maven.org/maven2/org/apache/maven/maven-settings-builder/3.3.1/maven-settings-builder-3.3.1.jar
[INFO] Downloaded from central: http://repo1.maven.org/maven2/org/eclipse/sisu/org.eclipse.sisu.plexus/0.3.0/org.eclipse.sisu.plexus-0.3.0.jar (205 kB at 6.8 MB/s)
[INFO] Downloading from central: http://repo1.maven.org/maven2/org/apache/maven/maven-builder-support/3.3.1/maven-builder-support-3.3.1.jar
[INFO] Downloaded from central: http://repo1.maven.org/maven2/org/apache/maven/maven-settings/3.3.1/maven-settings-3.3.1.jar (43 kB at 1.6 MB/s)
[INFO] Downloading from central: http://repo1.maven.org/maven2/org/apache/maven/maven-repository-metadata/3.3.1/maven-repository-metadata-3.3.1.jar
[INFO] Downloaded from central: http://repo1.maven.org/maven2/org/eclipse/sisu/org.eclipse.sisu.inject/0.3.0/org.eclipse.sisu.inject-0.3.0.jar (375 kB at 12 MB/s)
[INFO] Downloading from central: http://repo1.maven.org/maven2/org/apache/maven/maven-model-builder/3.3.1/maven-model-builder-3.3.1.jar
[INFO] Downloaded from central: http://repo1.maven.org/maven2/org/apache/maven/maven-settings-builder/3.3.1/maven-settings-builder-3.3.1.jar (43 kB at 1.4 MB/s)
[INFO] Downloading from central: http://repo1.maven.org/maven2/org/apache/maven/maven-aether-provider/3.3.1/maven-aether-provider-3.3.1.jar
[INFO] Downloaded from central: http://repo1.maven.org/maven2/org/apache/maven/maven-core/3.3.1/maven-core-3.3.1.jar (632 kB at 19 MB/s)
[INFO] Downloading from central: http://repo1.maven.org/maven2/org/sonatype/sisu/sisu-guice/3.2.5/sisu-guice-3.2.5-no_aop.jar
[INFO] Downloaded from central: http://repo1.maven.org/maven2/org/apache/maven/maven-builder-support/3.3.1/maven-builder-support-3.3.1.jar (15 kB at 428 kB/s)
[INFO] Downloaded from central: http://repo1.maven.org/maven2/org/apache/maven/maven-repository-metadata/3.3.1/maven-repository-metadata-3.3.1.jar (26 kB at 666 kB/s)
[INFO] Downloaded from central: http://repo1.maven.org/maven2/org/apache/maven/maven-aether-provider/3.3.1/maven-aether-provider-3.3.1.jar (66 kB at 1.5 MB/s)
[INFO] Downloaded from central: http://repo1.maven.org/maven2/org/sonatype/sisu/sisu-guice/3.2.5/sisu-guice-3.2.5-no_aop.jar (400 kB at 7.1 MB/s)
[INFO] Downloaded from central: http://repo1.maven.org/maven2/org/apache/maven/maven-model-builder/3.3.1/maven-model-builder-3.3.1.jar (176 kB at 2.8 MB/s)
[INFO] 
[INFO] --- maven-resources-plugin:2.6:resources (default-resources) @ mng-6127-plugin ---
[WARNING] Using platform encoding (ISO-8859-1 actually) to copy filtered resources, i.e. build is platform dependent!
[INFO] Copying 1 resource
[INFO] 
[INFO] --- maven-compiler-plugin:3.1:compile (default-compile) @ mng-6127-plugin ---
[INFO] Changes detected - recompiling the module!
[WARNING] File encoding has not been set, using platform encoding ISO-8859-1, i.e. build is platform dependent!
[INFO] Compiling 1 source file to /home/jenkins/jenkins-slave/workspace/maven-box_maven_MNG-6401-2-QAKD6LP7DME27AZUVKJIWTKGBF727EM6Q2FBIKLRPCLIRL2QCB7A@2/test/core-it-suite/target/test-classes/mng-6127-plugin-execution-configuration-interference/plugin/target/classes
[INFO] -------------------------------------------------------------
[ERROR] COMPILATION ERROR : 
[INFO] -------------------------------------------------------------
[ERROR] /home/jenkins/jenkins-slave/workspace/maven-box_maven_MNG-6401-2-QAKD6LP7DME27AZUVKJIWTKGBF727EM6Q2FBIKLRPCLIRL2QCB7A@2/test/core-it-suite/target/test-classes/mng-6127-plugin-execution-configuration-interference/plugin/src/main/java/org/apache/maven/its/mng6127/plugin/TestMojo.java:[67,13] try-with-resources is not supported in -source 1.6
  (use -source 7 or higher to enable try-with-resources)
[INFO] 1 error
[INFO] -------------------------------------------------------------
[INFO] ------------------------------------------------------------------------
[INFO] BUILD FAILURE
[INFO] ------------------------------------------------------------------------
[INFO] Total time: 0.811 s
[INFO] Finished at: 2018-07-30T20:06:51Z
[INFO] ------------------------------------------------------------------------
[ERROR] Failed to execute goal org.apache.maven.plugins:maven-compiler-plugin:3.1:compile (default-compile) on project mng-6127-plugin: Compilation failure
[ERROR] /home/jenkins/jenkins-slave/workspace/maven-box_maven_MNG-6401-2-QAKD6LP7DME27AZUVKJIWTKGBF727EM6Q2FBIKLRPCLIRL2QCB7A@2/test/core-it-suite/target/test-classes/mng-6127-plugin-execution-configuration-interference/plugin/src/main/java/org/apache/maven/its/mng6127/plugin/TestMojo.java:[67,13] try-with-resources is not supported in -source 1.6
[ERROR]   (use -source 7 or higher to enable try-with-resources)
[ERROR] -> [Help 1]
org.apache.maven.lifecycle.LifecycleExecutionException: Failed to execute goal org.apache.maven.plugins:maven-compiler-plugin:3.1:compile (default-compile) on project mng-6127-plugin: Compilation failure
/home/jenkins/jenkins-slave/workspace/maven-box_maven_MNG-6401-2-QAKD6LP7DME27AZUVKJIWTKGBF727EM6Q2FBIKLRPCLIRL2QCB7A@2/test/core-it-suite/target/test-classes/mng-6127-plugin-execution-configuration-interference/plugin/src/main/java/org/apache/maven/its/mng6127/plugin/TestMojo.java:[67,13] try-with-resources is not supported in -source 1.6
  (use -source 7 or higher to enable try-with-resources)

    at org.apache.maven.lifecycle.internal.MojoExecutor.execute (MojoExecutor.java:213)
    at org.apache.maven.lifecycle.internal.MojoExecutor.execute (MojoExecutor.java:154)
    at org.apache.maven.lifecycle.internal.MojoExecutor.execute (MojoExecutor.java:146)
    at org.apache.maven.lifecycle.internal.LifecycleModuleBuilder.buildProject (LifecycleModuleBuilder.java:117)
    at org.apache.maven.lifecycle.internal.LifecycleModuleBuilder.buildProject (LifecycleModuleBuilder.java:81)
    at org.apache.maven.lifecycle.internal.builder.singlethreaded.SingleThreadedBuilder.build (SingleThreadedBuilder.java:56)
    at org.apache.maven.lifecycle.internal.LifecycleStarter.execute (LifecycleStarter.java:128)
    at org.apache.maven.DefaultMaven.doExecute (DefaultMaven.java:305)
    at org.apache.maven.DefaultMaven.doExecute (DefaultMaven.java:192)
    at org.apache.maven.DefaultMaven.execute (DefaultMaven.java:105)
    at org.apache.maven.cli.MavenCli.execute (MavenCli.java:954)
    at org.apache.maven.cli.MavenCli.doMain (MavenCli.java:288)
    at org.apache.maven.cli.MavenCli.doMain (MavenCli.java:243)
    at jdk.internal.reflect.NativeMethodAccessorImpl.invoke0 (Native Method)
    at jdk.internal.reflect.NativeMethodAccessorImpl.invoke (NativeMethodAccessorImpl.java:62)
    at jdk.internal.reflect.DelegatingMethodAccessorImpl.invoke (DelegatingMethodAccessorImpl.java:43)
    at java.lang.reflect.Method.invoke (Method.java:564)
    at org.apache.maven.it.Embedded3xLauncher.run (Embedded3xLauncher.java:247)
    at org.apache.maven.it.Verifier.executeGoals (Verifier.java:1354)
    at org.apache.maven.it.Verifier.executeGoal (Verifier.java:1254)
    at org.apache.maven.it.Verifier.executeGoal (Verifier.java:1248)
    at org.apache.maven.it.MavenITmng6127PluginExecutionConfigurationInterferenceTest.testCustomMojoExecutionConfigurator (MavenITmng6127PluginExecutionConfigurationInterferenceTest.java:52)
    at jdk.internal.reflect.NativeMethodAccessorImpl.invoke0 (Native Method)
    at jdk.internal.reflect.NativeMethodAccessorImpl.invoke (NativeMethodAccessorImpl.java:62)
    at jdk.internal.reflect.DelegatingMethodAccessorImpl.invoke (DelegatingMethodAccessorImpl.java:43)
    at java.lang.reflect.Method.invoke (Method.java:564)
    at junit.framework.TestCase.runTest (TestCase.java:176)
    at org.apache.maven.it.AbstractMavenIntegrationTestCase.runTest (AbstractMavenIntegrationTestCase.java:222)
    at junit.framework.TestCase.runBare (TestCase.java:141)
    at junit.framework.TestResult$1.protect (TestResult.java:122)
    at junit.framework.TestResult.runProtected (TestResult.java:142)
    at junit.framework.TestResult.run (TestResult.java:125)
    at junit.framework.TestCase.run (TestCase.java:129)
    at junit.framework.TestSuite.runTest (TestSuite.java:252)
    at junit.framework.TestSuite.run (TestSuite.java:247)
    at junit.framework.TestSuite.runTest (TestSuite.java:252)
    at junit.framework.TestSuite.run (TestSuite.java:247)
    at org.junit.internal.runners.JUnit38ClassRunner.run (JUnit38ClassRunner.java:86)
    at org.apache.maven.surefire.junit4.JUnit4Provider.execute (JUnit4Provider.java:369)
    at org.apache.maven.surefire.junit4.JUnit4Provider.executeWithRerun (JUnit4Provider.java:275)
    at org.apache.maven.surefire.junit4.JUnit4Provider.executeTestSet (JUnit4Provider.java:239)
    at org.apache.maven.surefire.junit4.JUnit4Provider.invoke (JUnit4Provider.java:160)
    at org.apache.maven.surefire.booter.ForkedBooter.invokeProviderInSameClassLoader (ForkedBooter.java:373)
    at org.apache.maven.surefire.booter.ForkedBooter.runSuitesInProcess (ForkedBooter.java:334)
    at org.apache.maven.surefire.booter.ForkedBooter.execute (ForkedBooter.java:119)
    at org.apache.maven.surefire.booter.ForkedBooter.main (ForkedBooter.java:407)
Caused by: org.apache.maven.plugin.compiler.CompilationFailureException: Compilation failure
/home/jenkins/jenkins-slave/workspace/maven-box_maven_MNG-6401-2-QAKD6LP7DME27AZUVKJIWTKGBF727EM6Q2FBIKLRPCLIRL2QCB7A@2/test/core-it-suite/target/test-classes/mng-6127-plugin-execution-configuration-interference/plugin/src/main/java/org/apache/maven/its/mng6127/plugin/TestMojo.java:[67,13] try-with-resources is not supported in -source 1.6
  (use -source 7 or higher to enable try-with-resources)

    at org.apache.maven.plugin.compiler.AbstractCompilerMojo.execute (AbstractCompilerMojo.java:858)
    at org.apache.maven.plugin.compiler.CompilerMojo.execute (CompilerMojo.java:129)
    at org.apache.maven.plugin.DefaultBuildPluginManager.executeMojo (DefaultBuildPluginManager.java:137)
    at org.apache.maven.lifecycle.internal.MojoExecutor.execute (MojoExecutor.java:208)
    at org.apache.maven.lifecycle.internal.MojoExecutor.execute (MojoExecutor.java:154)
    at org.apache.maven.lifecycle.internal.MojoExecutor.execute (MojoExecutor.java:146)
    at org.apache.maven.lifecycle.internal.LifecycleModuleBuilder.buildProject (LifecycleModuleBuilder.java:117)
    at org.apache.maven.lifecycle.internal.LifecycleModuleBuilder.buildProject (LifecycleModuleBuilder.java:81)
    at org.apache.maven.lifecycle.internal.builder.singlethreaded.SingleThreadedBuilder.build (SingleThreadedBuilder.java:56)
    at org.apache.maven.lifecycle.internal.LifecycleStarter.execute (LifecycleStarter.java:128)
    at org.apache.maven.DefaultMaven.doExecute (DefaultMaven.java:305)
    at org.apache.maven.DefaultMaven.doExecute (DefaultMaven.java:192)
    at org.apache.maven.DefaultMaven.execute (DefaultMaven.java:105)
    at org.apache.maven.cli.MavenCli.execute (MavenCli.java:954)
    at org.apache.maven.cli.MavenCli.doMain (MavenCli.java:288)
    at org.apache.maven.cli.MavenCli.doMain (MavenCli.java:243)
    at jdk.internal.reflect.NativeMethodAccessorImpl.invoke0 (Native Method)
    at jdk.internal.reflect.NativeMethodAccessorImpl.invoke (NativeMethodAccessorImpl.java:62)
    at jdk.internal.reflect.DelegatingMethodAccessorImpl.invoke (DelegatingMethodAccessorImpl.java:43)
    at java.lang.reflect.Method.invoke (Method.java:564)
    at org.apache.maven.it.Embedded3xLauncher.run (Embedded3xLauncher.java:247)
    at org.apache.maven.it.Verifier.executeGoals (Verifier.java:1354)
    at org.apache.maven.it.Verifier.executeGoal (Verifier.java:1254)
    at org.apache.maven.it.Verifier.executeGoal (Verifier.java:1248)
    at org.apache.maven.it.MavenITmng6127PluginExecutionConfigurationInterferenceTest.testCustomMojoExecutionConfigurator (MavenITmng6127PluginExecutionConfigurationInterferenceTest.java:52)
    at jdk.internal.reflect.NativeMethodAccessorImpl.invoke0 (Native Method)
    at jdk.internal.reflect.NativeMethodAccessorImpl.invoke (NativeMethodAccessorImpl.java:62)
    at jdk.internal.reflect.DelegatingMethodAccessorImpl.invoke (DelegatingMethodAccessorImpl.java:43)
    at java.lang.reflect.Method.invoke (Method.java:564)
    at junit.framework.TestCase.runTest (TestCase.java:176)
    at org.apache.maven.it.AbstractMavenIntegrationTestCase.runTest (AbstractMavenIntegrationTestCase.java:222)
    at junit.framework.TestCase.runBare (TestCase.java:141)
    at junit.framework.TestResult$1.protect (TestResult.java:122)
    at junit.framework.TestResult.runProtected (TestResult.java:142)
    at junit.framework.TestResult.run (TestResult.java:125)
    at junit.framework.TestCase.run (TestCase.java:129)
    at junit.framework.TestSuite.runTest (TestSuite.java:252)
    at junit.framework.TestSuite.run (TestSuite.java:247)
    at junit.framework.TestSuite.runTest (TestSuite.java:252)
    at junit.framework.TestSuite.run (TestSuite.java:247)
    at org.junit.internal.runners.JUnit38ClassRunner.run (JUnit38ClassRunner.java:86)
    at org.apache.maven.surefire.junit4.JUnit4Provider.execute (JUnit4Provider.java:369)
    at org.apache.maven.surefire.junit4.JUnit4Provider.executeWithRerun (JUnit4Provider.java:275)
    at org.apache.maven.surefire.junit4.JUnit4Provider.executeTestSet (JUnit4Provider.java:239)
    at org.apache.maven.surefire.junit4.JUnit4Provider.invoke (JUnit4Provider.java:160)
    at org.apache.maven.surefire.booter.ForkedBooter.invokeProviderInSameClassLoader (ForkedBooter.java:373)
    at org.apache.maven.surefire.booter.ForkedBooter.runSuitesInProcess (ForkedBooter.java:334)
    at org.apache.maven.surefire.booter.ForkedBooter.execute (ForkedBooter.java:119)
    at org.apache.maven.surefire.booter.ForkedBooter.main (ForkedBooter.java:407)
[ERROR] 
[ERROR] Re-run Maven using the -X switch to enable full debug logging.
[ERROR] 
[ERROR] For more information about the errors and possible solutions, please read the following articles:
[ERROR] [Help 1] http://cwiki.apache.org/confluence/display/MAVEN/MojoFailureException

	at org.apache.maven.it.MavenITmng6127PluginExecutionConfigurationInterferenceTest.testCustomMojoExecutionConfigurator(MavenITmng6127PluginExecutionConfigurationInterferenceTest.java:52)


FAILED:  org.apache.maven.it.MavenIT0051ReleaseProfileTest.testit0051

Error Message:
Exit code was non-zero: 1; command line and log = 
/home/jenkins/jenkins-slave/workspace/maven-box_maven_MNG-6401-2-QAKD6LP7DME27AZUVKJIWTKGBF727EM6Q2FBIKLRPCLIRL2QCB7A@2/test/core-it-suite/target/apache-maven/bin/mvn --global-settings /home/jenkins/jenkins-slave/workspace/maven-box_maven_MNG-6401-2-QAKD6LP7DME27AZUVKJIWTKGBF727EM6Q2FBIKLRPCLIRL2QCB7A@2/test/core-it-suite/target/test-classes/settings.xml -DperformRelease=true -e --batch-mode -Dmaven.repo.local=/home/jenkins/jenkins-slave/workspace/maven-box_maven_MNG-6401-2-QAKD6LP7DME27AZUVKJIWTKGBF727EM6Q2FBIKLRPCLIRL2QCB7A@2/test/it-local-repo package
[INFO] [jenkins-event-spy] Jenkins Maven Event Spy is disabled
[INFO] Error stacktraces are turned on.
[INFO] Scanning for projects...
[WARNING] 
[WARNING] Some problems were encountered while building the effective model for org.apache.maven.its.it0051:maven-it-it0051:jar:1.0
[WARNING] 'build.plugins.plugin.version' for org.apache.maven.plugins:maven-deploy-plugin is missing.
[WARNING] 
[WARNING] It is highly recommended to fix these problems because they threaten the stability of your build.
[WARNING] 
[WARNING] For this reason, future Maven versions might no longer support building such malformed projects.
[WARNING] 
[INFO] 
[INFO] ------------< org.apache.maven.its.it0051:maven-it-it0051 >-------------
[INFO] Building Maven Integration Test :: it0051 1.0
[INFO] --------------------------------[ jar ]---------------------------------
[INFO] ------------------------------------------------------------------------
[INFO] BUILD FAILURE
[INFO] ------------------------------------------------------------------------
[INFO] Total time: 0.023 s
[INFO] Finished at: 2018-07-30T20:12:28Z
[INFO] ------------------------------------------------------------------------
[ERROR] Could not find goal 'jar-no-fork' in plugin org.apache.maven.plugins:maven-source-plugin:0.1-stub-SNAPSHOT among available goals jar -> [Help 1]
org.apache.maven.plugin.MojoNotFoundException: Could not find goal 'jar-no-fork' in plugin org.apache.maven.plugins:maven-source-plugin:0.1-stub-SNAPSHOT among available goals jar
    at org.apache.maven.plugin.internal.DefaultMavenPluginManager.getMojoDescriptor (DefaultMavenPluginManager.java:292)
    at org.apache.maven.plugin.DefaultBuildPluginManager.getMojoDescriptor (DefaultBuildPluginManager.java:244)
    at org.apache.maven.lifecycle.internal.DefaultLifecycleMappingDelegate.calculateLifecycleMappings (DefaultLifecycleMappingDelegate.java:116)
    at org.apache.maven.lifecycle.internal.DefaultLifecycleExecutionPlanCalculator.calculateLifecycleMappings (DefaultLifecycleExecutionPlanCalculator.java:265)
    at org.apache.maven.lifecycle.internal.DefaultLifecycleExecutionPlanCalculator.calculateMojoExecutions (DefaultLifecycleExecutionPlanCalculator.java:217)
    at org.apache.maven.lifecycle.internal.DefaultLifecycleExecutionPlanCalculator.calculateExecutionPlan (DefaultLifecycleExecutionPlanCalculator.java:126)
    at org.apache.maven.lifecycle.internal.DefaultLifecycleExecutionPlanCalculator.calculateExecutionPlan (DefaultLifecycleExecutionPlanCalculator.java:144)
    at org.apache.maven.lifecycle.internal.builder.BuilderCommon.resolveBuildPlan (BuilderCommon.java:97)
    at org.apache.maven.lifecycle.internal.LifecycleModuleBuilder.buildProject (LifecycleModuleBuilder.java:111)
    at org.apache.maven.lifecycle.internal.LifecycleModuleBuilder.buildProject (LifecycleModuleBuilder.java:81)
    at org.apache.maven.lifecycle.internal.builder.singlethreaded.SingleThreadedBuilder.build (SingleThreadedBuilder.java:56)
    at org.apache.maven.lifecycle.internal.LifecycleStarter.execute (LifecycleStarter.java:128)
    at org.apache.maven.DefaultMaven.doExecute (DefaultMaven.java:305)
    at org.apache.maven.DefaultMaven.doExecute (DefaultMaven.java:192)
    at org.apache.maven.DefaultMaven.execute (DefaultMaven.java:105)
    at org.apache.maven.cli.MavenCli.execute (MavenCli.java:954)
    at org.apache.maven.cli.MavenCli.doMain (MavenCli.java:288)
    at org.apache.maven.cli.MavenCli.doMain (MavenCli.java:243)
    at jdk.internal.reflect.GeneratedMethodAccessor59.invoke (Unknown Source)
    at jdk.internal.reflect.DelegatingMethodAccessorImpl.invoke (DelegatingMethodAccessorImpl.java:43)
    at java.lang.reflect.Method.invoke (Method.java:564)
    at org.apache.maven.it.Embedded3xLauncher.run (Embedded3xLauncher.java:247)
    at org.apache.maven.it.Verifier.executeGoals (Verifier.java:1354)
    at org.apache.maven.it.Verifier.executeGoal (Verifier.java:1254)
    at org.apache.maven.it.Verifier.executeGoal (Verifier.java:1248)
    at org.apache.maven.it.MavenIT0051ReleaseProfileTest.testit0051 (MavenIT0051ReleaseProfileTest.java:48)
    at jdk.internal.reflect.NativeMethodAccessorImpl.invoke0 (Native Method)
    at jdk.internal.reflect.NativeMethodAccessorImpl.invoke (NativeMethodAccessorImpl.java:62)
    at jdk.internal.reflect.DelegatingMethodAccessorImpl.invoke (DelegatingMethodAccessorImpl.java:43)
    at java.lang.reflect.Method.invoke (Method.java:564)
    at junit.framework.TestCase.runTest (TestCase.java:176)
    at org.apache.maven.it.AbstractMavenIntegrationTestCase.runTest (AbstractMavenIntegrationTestCase.java:222)
    at junit.framework.TestCase.runBare (TestCase.java:141)
    at junit.framework.TestResult$1.protect (TestResult.java:122)
    at junit.framework.TestResult.runProtected (TestResult.java:142)
    at junit.framework.TestResult.run (TestResult.java:125)
    at junit.framework.TestCase.run (TestCase.java:129)
    at junit.framework.TestSuite.runTest (TestSuite.java:252)
    at junit.framework.TestSuite.run (TestSuite.java:247)
    at junit.framework.TestSuite.runTest (TestSuite.java:252)
    at junit.framework.TestSuite.run (TestSuite.java:247)
    at org.junit.internal.runners.JUnit38ClassRunner.run (JUnit38ClassRunner.java:86)
    at org.apache.maven.surefire.junit4.JUnit4Provider.execute (JUnit4Provider.java:369)
    at org.apache.maven.surefire.junit4.JUnit4Provider.executeWithRerun (JUnit4Provider.java:275)
    at org.apache.maven.surefire.junit4.JUnit4Provider.executeTestSet (JUnit4Provider.java:239)
    at org.apache.maven.surefire.junit4.JUnit4Provider.invoke (JUnit4Provider.java:160)
    at org.apache.maven.surefire.booter.ForkedBooter.invokeProviderInSameClassLoader (ForkedBooter.java:373)
    at org.apache.maven.surefire.booter.ForkedBooter.runSuitesInProcess (ForkedBooter.java:334)
    at org.apache.maven.surefire.booter.ForkedBooter.execute (ForkedBooter.java:119)
    at org.apache.maven.surefire.booter.ForkedBooter.main (ForkedBooter.java:407)
[ERROR] 
[ERROR] Re-run Maven using the -X switch to enable full debug logging.
[ERROR] 
[ERROR] For more information about the errors and possible solutions, please read the following articles:
[ERROR] [Help 1] http://cwiki.apache.org/confluence/display/MAVEN/MojoNotFoundException


Stack Trace:
org.apache.maven.it.VerificationException: 
Exit code was non-zero: 1; command line and log = 
/home/jenkins/jenkins-slave/workspace/maven-box_maven_MNG-6401-2-QAKD6LP7DME27AZUVKJIWTKGBF727EM6Q2FBIKLRPCLIRL2QCB7A@2/test/core-it-suite/target/apache-maven/bin/mvn --global-settings /home/jenkins/jenkins-slave/workspace/maven-box_maven_MNG-6401-2-QAKD6LP7DME27AZUVKJIWTKGBF727EM6Q2FBIKLRPCLIRL2QCB7A@2/test/core-it-suite/target/test-classes/settings.xml -DperformRelease=true -e --batch-mode -Dmaven.repo.local=/home/jenkins/jenkins-slave/workspace/maven-box_maven_MNG-6401-2-QAKD6LP7DME27AZUVKJIWTKGBF727EM6Q2FBIKLRPCLIRL2QCB7A@2/test/it-local-repo package
[INFO] [jenkins-event-spy] Jenkins Maven Event Spy is disabled
[INFO] Error stacktraces are turned on.
[INFO] Scanning for projects...
[WARNING] 
[WARNING] Some problems were encountered while building the effective model for org.apache.maven.its.it0051:maven-it-it0051:jar:1.0
[WARNING] 'build.plugins.plugin.version' for org.apache.maven.plugins:maven-deploy-plugin is missing.
[WARNING] 
[WARNING] It is highly recommended to fix these problems because they threaten the stability of your build.
[WARNING] 
[WARNING] For this reason, future Maven versions might no longer support building such malformed projects.
[WARNING] 
[INFO] 
[INFO] ------------< org.apache.maven.its.it0051:maven-it-it0051 >-------------
[INFO] Building Maven Integration Test :: it0051 1.0
[INFO] --------------------------------[ jar ]---------------------------------
[INFO] ------------------------------------------------------------------------
[INFO] BUILD FAILURE
[INFO] ------------------------------------------------------------------------
[INFO] Total time: 0.023 s
[INFO] Finished at: 2018-07-30T20:12:28Z
[INFO] ------------------------------------------------------------------------
[ERROR] Could not find goal 'jar-no-fork' in plugin org.apache.maven.plugins:maven-source-plugin:0.1-stub-SNAPSHOT among available goals jar -> [Help 1]
org.apache.maven.plugin.MojoNotFoundException: Could not find goal 'jar-no-fork' in plugin org.apache.maven.plugins:maven-source-plugin:0.1-stub-SNAPSHOT among available goals jar
    at org.apache.maven.plugin.internal.DefaultMavenPluginManager.getMojoDescriptor (DefaultMavenPluginManager.java:292)
    at org.apache.maven.plugin.DefaultBuildPluginManager.getMojoDescriptor (DefaultBuildPluginManager.java:244)
    at org.apache.maven.lifecycle.internal.DefaultLifecycleMappingDelegate.calculateLifecycleMappings (DefaultLifecycleMappingDelegate.java:116)
    at org.apache.maven.lifecycle.internal.DefaultLifecycleExecutionPlanCalculator.calculateLifecycleMappings (DefaultLifecycleExecutionPlanCalculator.java:265)
    at org.apache.maven.lifecycle.internal.DefaultLifecycleExecutionPlanCalculator.calculateMojoExecutions (DefaultLifecycleExecutionPlanCalculator.java:217)
    at org.apache.maven.lifecycle.internal.DefaultLifecycleExecutionPlanCalculator.calculateExecutionPlan (DefaultLifecycleExecutionPlanCalculator.java:126)
    at org.apache.maven.lifecycle.internal.DefaultLifecycleExecutionPlanCalculator.calculateExecutionPlan (DefaultLifecycleExecutionPlanCalculator.java:144)
    at org.apache.maven.lifecycle.internal.builder.BuilderCommon.resolveBuildPlan (BuilderCommon.java:97)
    at org.apache.maven.lifecycle.internal.LifecycleModuleBuilder.buildProject (LifecycleModuleBuilder.java:111)
    at org.apache.maven.lifecycle.internal.LifecycleModuleBuilder.buildProject (LifecycleModuleBuilder.java:81)
    at org.apache.maven.lifecycle.internal.builder.singlethreaded.SingleThreadedBuilder.build (SingleThreadedBuilder.java:56)
    at org.apache.maven.lifecycle.internal.LifecycleStarter.execute (LifecycleStarter.java:128)
    at org.apache.maven.DefaultMaven.doExecute (DefaultMaven.java:305)
    at org.apache.maven.DefaultMaven.doExecute (DefaultMaven.java:192)
    at org.apache.maven.DefaultMaven.execute (DefaultMaven.java:105)
    at org.apache.maven.cli.MavenCli.execute (MavenCli.java:954)
    at org.apache.maven.cli.MavenCli.doMain (MavenCli.java:288)
    at org.apache.maven.cli.MavenCli.doMain (MavenCli.java:243)
    at jdk.internal.reflect.GeneratedMethodAccessor59.invoke (Unknown Source)
    at jdk.internal.reflect.DelegatingMethodAccessorImpl.invoke (DelegatingMethodAccessorImpl.java:43)
    at java.lang.reflect.Method.invoke (Method.java:564)
    at org.apache.maven.it.Embedded3xLauncher.run (Embedded3xLauncher.java:247)
    at org.apache.maven.it.Verifier.executeGoals (Verifier.java:1354)
    at org.apache.maven.it.Verifier.executeGoal (Verifier.java:1254)
    at org.apache.maven.it.Verifier.executeGoal (Verifier.java:1248)
    at org.apache.maven.it.MavenIT0051ReleaseProfileTest.testit0051 (MavenIT0051ReleaseProfileTest.java:48)
    at jdk.internal.reflect.NativeMethodAccessorImpl.invoke0 (Native Method)
    at jdk.internal.reflect.NativeMethodAccessorImpl.invoke (NativeMethodAccessorImpl.java:62)
    at jdk.internal.reflect.DelegatingMethodAccessorImpl.invoke (DelegatingMethodAccessorImpl.java:43)
    at java.lang.reflect.Method.invoke (Method.java:564)
    at junit.framework.TestCase.runTest (TestCase.java:176)
    at org.apache.maven.it.AbstractMavenIntegrationTestCase.runTest (AbstractMavenIntegrationTestCase.java:222)
    at junit.framework.TestCase.runBare (TestCase.java:141)
    at junit.framework.TestResult$1.protect (TestResult.java:122)
    at junit.framework.TestResult.runProtected (TestResult.java:142)
    at junit.framework.TestResult.run (TestResult.java:125)
    at junit.framework.TestCase.run (TestCase.java:129)
    at junit.framework.TestSuite.runTest (TestSuite.java:252)
    at junit.framework.TestSuite.run (TestSuite.java:247)
    at junit.framework.TestSuite.runTest (TestSuite.java:252)
    at junit.framework.TestSuite.run (TestSuite.java:247)
    at org.junit.internal.runners.JUnit38ClassRunner.run (JUnit38ClassRunner.java:86)
    at org.apache.maven.surefire.junit4.JUnit4Provider.execute (JUnit4Provider.java:369)
    at org.apache.maven.surefire.junit4.JUnit4Provider.executeWithRerun (JUnit4Provider.java:275)
    at org.apache.maven.surefire.junit4.JUnit4Provider.executeTestSet (JUnit4Provider.java:239)
    at org.apache.maven.surefire.junit4.JUnit4Provider.invoke (JUnit4Provider.java:160)
    at org.apache.maven.surefire.booter.ForkedBooter.invokeProviderInSameClassLoader (ForkedBooter.java:373)
    at org.apache.maven.surefire.booter.ForkedBooter.runSuitesInProcess (ForkedBooter.java:334)
    at org.apache.maven.surefire.booter.ForkedBooter.execute (ForkedBooter.java:119)
    at org.apache.maven.surefire.booter.ForkedBooter.main (ForkedBooter.java:407)
[ERROR] 
[ERROR] Re-run Maven using the -X switch to enable full debug logging.
[ERROR] 
[ERROR] For more information about the errors and possible solutions, please read the following articles:
[ERROR] [Help 1] http://cwiki.apache.org/confluence/display/MAVEN/MojoNotFoundException

	at org.apache.maven.it.MavenIT0051ReleaseProfileTest.testit0051(MavenIT0051ReleaseProfileTest.java:48)


FAILED:  org.apache.maven.it.MavenITmng5958LifecyclePhaseBinaryCompat.testBad

Error Message:
Text not found in log: [ERROR] Internal error: java.lang.ClassCastException: org.apache.maven.lifecycle.mapping.LifecyclePhase cannot be cast to java.lang.String -> [Help 1]

Stack Trace:
org.apache.maven.it.VerificationException: Text not found in log: [ERROR] Internal error: java.lang.ClassCastException: org.apache.maven.lifecycle.mapping.LifecyclePhase cannot be cast to java.lang.String -> [Help 1]
	at org.apache.maven.it.MavenITmng5958LifecyclePhaseBinaryCompat.testBad(MavenITmng5958LifecyclePhaseBinaryCompat.java:40)


FAILED:  org.apache.maven.it.MavenITmng1957JdkActivationWithVersionRangeTest.testitMNG1957

Error Message:
expected:<PASSED> but was:<null>

Stack Trace:
junit.framework.ComparisonFailure: expected:<PASSED> but was:<null>
	at org.apache.maven.it.MavenITmng1957JdkActivationWithVersionRangeTest.testitMNG1957(MavenITmng1957JdkActivationWithVersionRangeTest.java:64)




Build log:
[...truncated 9.33 MB...]
[windows-jdk9] 	at org.jenkinsci.plugins.pipeline.maven.util.XmlUtils.getPathInWorkspace(XmlUtils.java:397)
[windows-jdk9] 	at org.jenkinsci.plugins.pipeline.maven.publishers.GeneratedArtifactsPublisher.process(GeneratedArtifactsPublisher.java:90)
[windows-jdk9] 	at org.jenkinsci.plugins.pipeline.maven.MavenSpyLogProcessor.processMavenSpyLogs(MavenSpyLogProcessor.java:118)
[windows-jdk9] 	at org.jenkinsci.plugins.pipeline.maven.WithMavenStepExecution$WithMavenStepExecutionCallBack.finished(WithMavenStepExecution.java:1050)
[windows-jdk9] 	at org.jenkinsci.plugins.workflow.steps.BodyExecutionCallback$TailCall.onSuccess(BodyExecutionCallback.java:114)
[windows-jdk9] 	at org.jenkinsci.plugins.workflow.cps.CpsBodyExecution$SuccessAdapter.receive(CpsBodyExecution.java:366)
[windows-jdk9] 	at com.cloudbees.groovy.cps.Outcome.resumeFrom(Outcome.java:73)
[windows-jdk9] 	at com.cloudbees.groovy.cps.Continuable$1.call(Continuable.java:166)
[windows-jdk9] 	at com.cloudbees.groovy.cps.Continuable$1.call(Continuable.java:163)
[windows-jdk9] 	at org.codehaus.groovy.runtime.GroovyCategorySupport$ThreadCategoryInfo.use(GroovyCategorySupport.java:122)
[windows-jdk9] 	at org.codehaus.groovy.runtime.GroovyCategorySupport.use(GroovyCategorySupport.java:261)
[windows-jdk9] 	at com.cloudbees.groovy.cps.Continuable.run0(Continuable.java:163)
[windows-jdk9] 	at org.jenkinsci.plugins.workflow.cps.SandboxContinuable.access$101(SandboxContinuable.java:34)
[windows-jdk9] 	at org.jenkinsci.plugins.workflow.cps.SandboxContinuable.lambda$run0$0(SandboxContinuable.java:59)
[windows-jdk9] 	at org.jenkinsci.plugins.scriptsecurity.sandbox.groovy.GroovySandbox.runInSandbox(GroovySandbox.java:108)
[windows-jdk9] 	at org.jenkinsci.plugins.workflow.cps.SandboxContinuable.run0(SandboxContinuable.java:58)
[windows-jdk9] 	at org.jenkinsci.plugins.workflow.cps.CpsThread.runNextChunk(CpsThread.java:174)
[windows-jdk9] 	at org.jenkinsci.plugins.workflow.cps.CpsThreadGroup.run(CpsThreadGroup.java:332)
[windows-jdk9] 	at org.jenkinsci.plugins.workflow.cps.CpsThreadGroup.access$200(CpsThreadGroup.java:83)
[windows-jdk9] 	at org.jenkinsci.plugins.workflow.cps.CpsThreadGroup$2.call(CpsThreadGroup.java:244)
[windows-jdk9] 	at org.jenkinsci.plugins.workflow.cps.CpsThreadGroup$2.call(CpsThreadGroup.java:232)
[windows-jdk9] 	at org.jenkinsci.plugins.workflow.cps.CpsVmExecutorService$2.call(CpsVmExecutorService.java:64)
[windows-jdk9] 	at java.util.concurrent.FutureTask.run(FutureTask.java:266)
[windows-jdk9] 	at hudson.remoting.SingleLaneExecutorService$1.run(SingleLaneExecutorService.java:131)
[windows-jdk9] 	at jenkins.util.ContextResettingExecutorService$1.run(ContextResettingExecutorService.java:28)
[windows-jdk9] 	at jenkins.security.ImpersonatingExecutorService$1.run(ImpersonatingExecutorService.java:59)
[windows-jdk9] 	at java.util.concurrent.Executors$RunnableAdapter.call(Executors.java:511)
[windows-jdk9] 	at java.util.concurrent.FutureTask.run(FutureTask.java:266)
[windows-jdk9] 	at java.util.concurrent.ThreadPoolExecutor.runWorker(ThreadPoolExecutor.java:1149)
[windows-jdk9] 	at java.util.concurrent.ThreadPoolExecutor$Worker.run(ThreadPoolExecutor.java:624)
[windows-jdk9] 	at java.lang.Thread.run(Thread.java:748)
[windows-jdk9] ERROR: [withMaven] artifactsPublisher - WARNING: Exception archiving and fingerprinting MavenArtifact{org.apache.maven.its:core-it-suite:pom:2.1-SNAPSHOT(version: 2.1-SNAPSHOT, snapshot:false)  C:\mvn-it-1.tmp\core-it-suite\pom.xml}, skip archiving of the artifacts
[windows-jdk9] java.lang.IllegalArgumentException: Cannot relativize 'C:\mvn-it-1.tmp\core-it-suite\pom.xml' relatively to '/mvn-it-1.tmp'
[windows-jdk9] 	at org.jenkinsci.plugins.pipeline.maven.util.XmlUtils.getPathInWorkspace(XmlUtils.java:397)
[windows-jdk9] 	at org.jenkinsci.plugins.pipeline.maven.publishers.GeneratedArtifactsPublisher.process(GeneratedArtifactsPublisher.java:75)
[windows-jdk9] 	at org.jenkinsci.plugins.pipeline.maven.MavenSpyLogProcessor.processMavenSpyLogs(MavenSpyLogProcessor.java:118)
[windows-jdk9] 	at org.jenkinsci.plugins.pipeline.maven.WithMavenStepExecution$WithMavenStepExecutionCallBack.finished(WithMavenStepExecution.java:1050)
[windows-jdk9] 	at org.jenkinsci.plugins.workflow.steps.BodyExecutionCallback$TailCall.onSuccess(BodyExecutionCallback.java:114)
[windows-jdk9] 	at org.jenkinsci.plugins.workflow.cps.CpsBodyExecution$SuccessAdapter.receive(CpsBodyExecution.java:366)
[windows-jdk9] 	at com.cloudbees.groovy.cps.Outcome.resumeFrom(Outcome.java:73)
[windows-jdk9] 	at com.cloudbees.groovy.cps.Continuable$1.call(Continuable.java:166)
[windows-jdk9] 	at com.cloudbees.groovy.cps.Continuable$1.call(Continuable.java:163)
[windows-jdk9] 	at org.codehaus.groovy.runtime.GroovyCategorySupport$ThreadCategoryInfo.use(GroovyCategorySupport.java:122)
[windows-jdk9] 	at org.codehaus.groovy.runtime.GroovyCategorySupport.use(GroovyCategorySupport.java:261)
[windows-jdk9] 	at com.cloudbees.groovy.cps.Continuable.run0(Continuable.java:163)
[windows-jdk9] 	at org.jenkinsci.plugins.workflow.cps.SandboxContinuable.access$101(SandboxContinuable.java:34)
[windows-jdk9] 	at org.jenkinsci.plugins.workflow.cps.SandboxContinuable.lambda$run0$0(SandboxContinuable.java:59)
[windows-jdk9] 	at org.jenkinsci.plugins.scriptsecurity.sandbox.groovy.GroovySandbox.runInSandbox(GroovySandbox.java:108)
[windows-jdk9] 	at org.jenkinsci.plugins.workflow.cps.SandboxContinuable.run0(SandboxContinuable.java:58)
[windows-jdk9] 	at org.jenkinsci.plugins.workflow.cps.CpsThread.runNextChunk(CpsThread.java:174)
[windows-jdk9] 	at org.jenkinsci.plugins.workflow.cps.CpsThreadGroup.run(CpsThreadGroup.java:332)
[windows-jdk9] 	at org.jenkinsci.plugins.workflow.cps.CpsThreadGroup.access$200(CpsThreadGroup.java:83)
[windows-jdk9] 	at org.jenkinsci.plugins.workflow.cps.CpsThreadGroup$2.call(CpsThreadGroup.java:244)
[windows-jdk9] 	at org.jenkinsci.plugins.workflow.cps.CpsThreadGroup$2.call(CpsThreadGroup.java:232)
[windows-jdk9] 	at org.jenkinsci.plugins.workflow.cps.CpsVmExecutorService$2.call(CpsVmExecutorService.java:64)
[windows-jdk9] 	at java.util.concurrent.FutureTask.run(FutureTask.java:266)
[windows-jdk9] 	at hudson.remoting.SingleLaneExecutorService$1.run(SingleLaneExecutorService.java:131)
[windows-jdk9] 	at jenkins.util.ContextResettingExecutorService$1.run(ContextResettingExecutorService.java:28)
[windows-jdk9] 	at jenkins.security.ImpersonatingExecutorService$1.run(ImpersonatingExecutorService.java:59)
[windows-jdk9] 	at java.util.concurrent.Executors$RunnableAdapter.call(Executors.java:511)
[windows-jdk9] 	at java.util.concurrent.FutureTask.run(FutureTask.java:266)
[windows-jdk9] 	at java.util.concurrent.ThreadPoolExecutor.runWorker(ThreadPoolExecutor.java:1149)
[windows-jdk9] 	at java.util.concurrent.ThreadPoolExecutor$Worker.run(ThreadPoolExecutor.java:624)
[windows-jdk9] 	at java.lang.Thread.run(Thread.java:748)
[windows-jdk9] ERROR: [withMaven] artifactsPublisher - WARNING: Exception archiving and fingerprinting MavenArtifact{org.apache.maven.its:core-it-suite:jar:2.1-SNAPSHOT(version: 2.1-SNAPSHOT, snapshot:true)  C:\mvn-it-1.tmp\core-it-suite\target\core-it-suite-2.1-SNAPSHOT.jar}, skip archiving of the artifacts
[windows-jdk9] java.lang.IllegalArgumentException: Cannot relativize 'C:\mvn-it-1.tmp\core-it-suite\target\core-it-suite-2.1-SNAPSHOT.jar' relatively to '/mvn-it-1.tmp'
[windows-jdk9] 	at org.jenkinsci.plugins.pipeline.maven.util.XmlUtils.getPathInWorkspace(XmlUtils.java:397)
[windows-jdk9] 	at org.jenkinsci.plugins.pipeline.maven.publishers.GeneratedArtifactsPublisher.process(GeneratedArtifactsPublisher.java:90)
[windows-jdk9] 	at org.jenkinsci.plugins.pipeline.maven.MavenSpyLogProcessor.processMavenSpyLogs(MavenSpyLogProcessor.java:118)
[windows-jdk9] 	at org.jenkinsci.plugins.pipeline.maven.WithMavenStepExecution$WithMavenStepExecutionCallBack.finished(WithMavenStepExecution.java:1050)
[windows-jdk9] 	at org.jenkinsci.plugins.workflow.steps.BodyExecutionCallback$TailCall.onSuccess(BodyExecutionCallback.java:114)
[windows-jdk9] 	at org.jenkinsci.plugins.workflow.cps.CpsBodyExecution$SuccessAdapter.receive(CpsBodyExecution.java:366)
[windows-jdk9] 	at com.cloudbees.groovy.cps.Outcome.resumeFrom(Outcome.java:73)
[windows-jdk9] 	at com.cloudbees.groovy.cps.Continuable$1.call(Continuable.java:166)
[windows-jdk9] 	at com.cloudbees.groovy.cps.Continuable$1.call(Continuable.java:163)
[windows-jdk9] 	at org.codehaus.groovy.runtime.GroovyCategorySupport$ThreadCategoryInfo.use(GroovyCategorySupport.java:122)
[windows-jdk9] 	at org.codehaus.groovy.runtime.GroovyCategorySupport.use(GroovyCategorySupport.java:261)
[windows-jdk9] 	at com.cloudbees.groovy.cps.Continuable.run0(Continuable.java:163)
[windows-jdk9] 	at org.jenkinsci.plugins.workflow.cps.SandboxContinuable.access$101(SandboxContinuable.java:34)
[windows-jdk9] 	at org.jenkinsci.plugins.workflow.cps.SandboxContinuable.lambda$run0$0(SandboxContinuable.java:59)
[windows-jdk9] 	at org.jenkinsci.plugins.scriptsecurity.sandbox.groovy.GroovySandbox.runInSandbox(GroovySandbox.java:108)
[windows-jdk9] 	at org.jenkinsci.plugins.workflow.cps.SandboxContinuable.run0(SandboxContinuable.java:58)
[windows-jdk9] 	at org.jenkinsci.plugins.workflow.cps.CpsThread.runNextChunk(CpsThread.java:174)
[windows-jdk9] 	at org.jenkinsci.plugins.workflow.cps.CpsThreadGroup.run(CpsThreadGroup.java:332)
[windows-jdk9] 	at org.jenkinsci.plugins.workflow.cps.CpsThreadGroup.access$200(CpsThreadGroup.java:83)
[windows-jdk9] 	at org.jenkinsci.plugins.workflow.cps.CpsThreadGroup$2.call(CpsThreadGroup.java:244)
[windows-jdk9] 	at org.jenkinsci.plugins.workflow.cps.CpsThreadGroup$2.call(CpsThreadGroup.java:232)
[windows-jdk9] 	at org.jenkinsci.plugins.workflow.cps.CpsVmExecutorService$2.call(CpsVmExecutorService.java:64)
[windows-jdk9] 	at java.util.concurrent.FutureTask.run(FutureTask.java:266)
[windows-jdk9] 	at hudson.remoting.SingleLaneExecutorService$1.run(SingleLaneExecutorService.java:131)
[windows-jdk9] 	at jenkins.util.ContextResettingExecutorService$1.run(ContextResettingExecutorService.java:28)
[windows-jdk9] 	at jenkins.security.ImpersonatingExecutorService$1.run(ImpersonatingExecutorService.java:59)
[windows-jdk9] 	at java.util.concurrent.Executors$RunnableAdapter.call(Executors.java:511)
[windows-jdk9] 	at java.util.concurrent.FutureTask.run(FutureTask.java:266)
[windows-jdk9] 	at java.util.concurrent.ThreadPoolExecutor.runWorker(ThreadPoolExecutor.java:1149)
[windows-jdk9] 	at java.util.concurrent.ThreadPoolExecutor$Worker.run(ThreadPoolExecutor.java:624)
[windows-jdk9] 	at java.lang.Thread.run(Thread.java:748)
[windows-jdk9] ERROR: [withMaven] artifactsPublisher - WARNING: Exception archiving and fingerprinting MavenArtifact{org.apache.maven.its:core-it-suite:test-jar:tests:2.1-SNAPSHOT(version: 2.1-SNAPSHOT, snapshot:true)  C:\mvn-it-1.tmp\core-it-suite\target\core-it-suite-2.1-SNAPSHOT-tests.jar}, skip archiving of the artifacts
[windows-jdk9] java.lang.IllegalArgumentException: Cannot relativize 'C:\mvn-it-1.tmp\core-it-suite\target\core-it-suite-2.1-SNAPSHOT-tests.jar' relatively to '/mvn-it-1.tmp'
[windows-jdk9] 	at org.jenkinsci.plugins.pipeline.maven.util.XmlUtils.getPathInWorkspace(XmlUtils.java:397)
[windows-jdk9] 	at org.jenkinsci.plugins.pipeline.maven.publishers.GeneratedArtifactsPublisher.process(GeneratedArtifactsPublisher.java:90)
[windows-jdk9] 	at org.jenkinsci.plugins.pipeline.maven.MavenSpyLogProcessor.processMavenSpyLogs(MavenSpyLogProcessor.java:118)
[windows-jdk9] 	at org.jenkinsci.plugins.pipeline.maven.WithMavenStepExecution$WithMavenStepExecutionCallBack.finished(WithMavenStepExecution.java:1050)
[windows-jdk9] 	at org.jenkinsci.plugins.workflow.steps.BodyExecutionCallback$TailCall.onSuccess(BodyExecutionCallback.java:114)
[windows-jdk9] 	at org.jenkinsci.plugins.workflow.cps.CpsBodyExecution$SuccessAdapter.receive(CpsBodyExecution.java:366)
[windows-jdk9] 	at com.cloudbees.groovy.cps.Outcome.resumeFrom(Outcome.java:73)
[windows-jdk9] 	at com.cloudbees.groovy.cps.Continuable$1.call(Continuable.java:166)
[windows-jdk9] 	at com.cloudbees.groovy.cps.Continuable$1.call(Continuable.java:163)
[windows-jdk9] 	at org.codehaus.groovy.runtime.GroovyCategorySupport$ThreadCategoryInfo.use(GroovyCategorySupport.java:122)
[windows-jdk9] 	at org.codehaus.groovy.runtime.GroovyCategorySupport.use(GroovyCategorySupport.java:261)
[windows-jdk9] 	at com.cloudbees.groovy.cps.Continuable.run0(Continuable.java:163)
[windows-jdk9] 	at org.jenkinsci.plugins.workflow.cps.SandboxContinuable.access$101(SandboxContinuable.java:34)
[windows-jdk9] 	at org.jenkinsci.plugins.workflow.cps.SandboxContinuable.lambda$run0$0(SandboxContinuable.java:59)
[windows-jdk9] 	at org.jenkinsci.plugins.scriptsecurity.sandbox.groovy.GroovySandbox.runInSandbox(GroovySandbox.java:108)
[windows-jdk9] 	at org.jenkinsci.plugins.workflow.cps.SandboxContinuable.run0(SandboxContinuable.java:58)
[windows-jdk9] 	at org.jenkinsci.plugins.workflow.cps.CpsThread.runNextChunk(CpsThread.java:174)
[windows-jdk9] 	at org.jenkinsci.plugins.workflow.cps.CpsThreadGroup.run(CpsThreadGroup.java:332)
[windows-jdk9] 	at org.jenkinsci.plugins.workflow.cps.CpsThreadGroup.access$200(CpsThreadGroup.java:83)
[windows-jdk9] 	at org.jenkinsci.plugins.workflow.cps.CpsThreadGroup$2.call(CpsThreadGroup.java:244)
[windows-jdk9] 	at org.jenkinsci.plugins.workflow.cps.CpsThreadGroup$2.call(CpsThreadGroup.java:232)
[windows-jdk9] 	at org.jenkinsci.plugins.workflow.cps.CpsVmExecutorService$2.call(CpsVmExecutorService.java:64)
[windows-jdk9] 	at java.util.concurrent.FutureTask.run(FutureTask.java:266)
[windows-jdk9] 	at hudson.remoting.SingleLaneExecutorService$1.run(SingleLaneExecutorService.java:131)
[windows-jdk9] 	at jenkins.util.ContextResettingExecutorService$1.run(ContextResettingExecutorService.java:28)
[windows-jdk9] 	at jenkins.security.ImpersonatingExecutorService$1.run(ImpersonatingExecutorService.java:59)
[windows-jdk9] 	at java.util.concurrent.Executors$RunnableAdapter.call(Executors.java:511)
[windows-jdk9] 	at java.util.concurrent.FutureTask.run(FutureTask.java:266)
[windows-jdk9] 	at java.util.concurrent.ThreadPoolExecutor.runWorker(ThreadPoolExecutor.java:1149)
[windows-jdk9] 	at java.util.concurrent.ThreadPoolExecutor$Worker.run(ThreadPoolExecutor.java:624)
[windows-jdk9] 	at java.lang.Thread.run(Thread.java:748)
[windows-jdk9] ERROR: [withMaven] WARNING Exception executing Maven reporter 'Junit Publisher' / org.jenkinsci.plugins.pipeline.maven.publishers.JunitTestsPublisher. Please report a bug associated for the component 'pipeline-maven-plugin' at https://issues.jenkins-ci.org 
[windows-jdk9] java.lang.IllegalArgumentException: Cannot relativize 'C:\mvn-it-1.tmp\core-it-support\core-it-plugins\maven-it-plugin-active-collection\target/surefire-reports' relatively to '/mvn-it-1.tmp'
[windows-jdk9] 	at org.jenkinsci.plugins.pipeline.maven.util.XmlUtils.getPathInWorkspace(XmlUtils.java:397)
[windows-jdk9] 	at org.jenkinsci.plugins.pipeline.maven.publishers.JunitTestsPublisher.executeReporter(JunitTestsPublisher.java:256)
[windows-jdk9] 	at org.jenkinsci.plugins.pipeline.maven.publishers.JunitTestsPublisher.process(JunitTestsPublisher.java:196)
[windows-jdk9] 	at org.jenkinsci.plugins.pipeline.maven.MavenSpyLogProcessor.processMavenSpyLogs(MavenSpyLogProcessor.java:118)
[windows-jdk9] 	at org.jenkinsci.plugins.pipeline.maven.WithMavenStepExecution$WithMavenStepExecutionCallBack.finished(WithMavenStepExecution.java:1050)
[windows-jdk9] 	at org.jenkinsci.plugins.workflow.steps.BodyExecutionCallback$TailCall.onSuccess(BodyExecutionCallback.java:114)
[windows-jdk9] 	at org.jenkinsci.plugins.workflow.cps.CpsBodyExecution$SuccessAdapter.receive(CpsBodyExecution.java:366)
[windows-jdk9] 	at com.cloudbees.groovy.cps.Outcome.resumeFrom(Outcome.java:73)
[windows-jdk9] 	at com.cloudbees.groovy.cps.Continuable$1.call(Continuable.java:166)
[windows-jdk9] 	at com.cloudbees.groovy.cps.Continuable$1.call(Continuable.java:163)
[windows-jdk9] 	at org.codehaus.groovy.runtime.GroovyCategorySupport$ThreadCategoryInfo.use(GroovyCategorySupport.java:122)
[windows-jdk9] 	at org.codehaus.groovy.runtime.GroovyCategorySupport.use(GroovyCategorySupport.java:261)
[windows-jdk9] 	at com.cloudbees.groovy.cps.Continuable.run0(Continuable.java:163)
[windows-jdk9] 	at org.jenkinsci.plugins.workflow.cps.SandboxContinuable.access$101(SandboxContinuable.java:34)
[windows-jdk9] 	at org.jenkinsci.plugins.workflow.cps.SandboxContinuable.lambda$run0$0(SandboxContinuable.java:59)
[windows-jdk9] 	at org.jenkinsci.plugins.scriptsecurity.sandbox.groovy.GroovySandbox.runInSandbox(GroovySandbox.java:108)
[windows-jdk9] 	at org.jenkinsci.plugins.workflow.cps.SandboxContinuable.run0(SandboxContinuable.java:58)
[windows-jdk9] 	at org.jenkinsci.plugins.workflow.cps.CpsThread.runNextChunk(CpsThread.java:174)
[windows-jdk9] 	at org.jenkinsci.plugins.workflow.cps.CpsThreadGroup.run(CpsThreadGroup.java:332)
[windows-jdk9] 	at org.jenkinsci.plugins.workflow.cps.CpsThreadGroup.access$200(CpsThreadGroup.java:83)
[windows-jdk9] 	at org.jenkinsci.plugins.workflow.cps.CpsThreadGroup$2.call(CpsThreadGroup.java:244)
[windows-jdk9] 	at org.jenkinsci.plugins.workflow.cps.CpsThreadGroup$2.call(CpsThreadGroup.java:232)
[windows-jdk9] 	at org.jenkinsci.plugins.workflow.cps.CpsVmExecutorService$2.call(CpsVmExecutorService.java:64)
[windows-jdk9] 	at java.util.concurrent.FutureTask.run(FutureTask.java:266)
[windows-jdk9] 	at hudson.remoting.SingleLaneExecutorService$1.run(SingleLaneExecutorService.java:131)
[windows-jdk9] 	at jenkins.util.ContextResettingExecutorService$1.run(ContextResettingExecutorService.java:28)
[windows-jdk9] 	at jenkins.security.ImpersonatingExecutorService$1.run(ImpersonatingExecutorService.java:59)
[windows-jdk9] 	at java.util.concurrent.Executors$RunnableAdapter.call(Executors.java:511)
[windows-jdk9] 	at java.util.concurrent.FutureTask.run(FutureTask.java:266)
[windows-jdk9] 	at java.util.concurrent.ThreadPoolExecutor.runWorker(ThreadPoolExecutor.java:1149)
[windows-jdk9] 	at java.util.concurrent.ThreadPoolExecutor$Worker.run(ThreadPoolExecutor.java:624)
[windows-jdk9] 	at java.lang.Thread.run(Thread.java:748)
[windows-jdk9] ERROR: [withMaven] WARNING Exception executing Maven reporter 'Open Task Scanner Publisher' / org.jenkinsci.plugins.pipeline.maven.publishers.TasksScannerPublisher. Please report a bug associated for the component 'pipeline-maven-plugin' at https://issues.jenkins-ci.org 
[windows-jdk9] java.lang.IllegalArgumentException: Cannot relativize 'C:\mvn-it-1.tmp\src\main\java' relatively to '/mvn-it-1.tmp'
[windows-jdk9] 	at org.jenkinsci.plugins.pipeline.maven.util.XmlUtils.getPathInWorkspace(XmlUtils.java:397)
[windows-jdk9] 	at org.jenkinsci.plugins.pipeline.maven.publishers.TasksScannerPublisher.process(TasksScannerPublisher.java:134)
[windows-jdk9] 	at org.jenkinsci.plugins.pipeline.maven.MavenSpyLogProcessor.processMavenSpyLogs(MavenSpyLogProcessor.java:118)
[windows-jdk9] 	at org.jenkinsci.plugins.pipeline.maven.WithMavenStepExecution$WithMavenStepExecutionCallBack.finished(WithMavenStepExecution.java:1050)
[windows-jdk9] 	at org.jenkinsci.plugins.workflow.steps.BodyExecutionCallback$TailCall.onSuccess(BodyExecutionCallback.java:114)
[windows-jdk9] 	at org.jenkinsci.plugins.workflow.cps.CpsBodyExecution$SuccessAdapter.receive(CpsBodyExecution.java:366)
[windows-jdk9] 	at com.cloudbees.groovy.cps.Outcome.resumeFrom(Outcome.java:73)
[windows-jdk9] 	at com.cloudbees.groovy.cps.Continuable$1.call(Continuable.java:166)
[windows-jdk9] 	at com.cloudbees.groovy.cps.Continuable$1.call(Continuable.java:163)
[windows-jdk9] 	at org.codehaus.groovy.runtime.GroovyCategorySupport$ThreadCategoryInfo.use(GroovyCategorySupport.java:122)
[windows-jdk9] 	at org.codehaus.groovy.runtime.GroovyCategorySupport.use(GroovyCategorySupport.java:261)
[windows-jdk9] 	at com.cloudbees.groovy.cps.Continuable.run0(Continuable.java:163)
[windows-jdk9] 	at org.jenkinsci.plugins.workflow.cps.SandboxContinuable.access$101(SandboxContinuable.java:34)
[windows-jdk9] 	at org.jenkinsci.plugins.workflow.cps.SandboxContinuable.lambda$run0$0(SandboxContinuable.java:59)
[windows-jdk9] 	at org.jenkinsci.plugins.scriptsecurity.sandbox.groovy.GroovySandbox.runInSandbox(GroovySandbox.java:108)
[windows-jdk9] 	at org.jenkinsci.plugins.workflow.cps.SandboxContinuable.run0(SandboxContinuable.java:58)
[windows-jdk9] 	at org.jenkinsci.plugins.workflow.cps.CpsThread.runNextChunk(CpsThread.java:174)
[windows-jdk9] 	at org.jenkinsci.plugins.workflow.cps.CpsThreadGroup.run(CpsThreadGroup.java:332)
[windows-jdk9] 	at org.jenkinsci.plugins.workflow.cps.CpsThreadGroup.access$200(CpsThreadGroup.java:83)
[windows-jdk9] 	at org.jenkinsci.plugins.workflow.cps.CpsThreadGroup$2.call(CpsThreadGroup.java:244)
[windows-jdk9] 	at org.jenkinsci.plugins.workflow.cps.CpsThreadGroup$2.call(CpsThreadGroup.java:232)
[windows-jdk9] 	at org.jenkinsci.plugins.workflow.cps.CpsVmExecutorService$2.call(CpsVmExecutorService.java:64)
[windows-jdk9] 	at java.util.concurrent.FutureTask.run(FutureTask.java:266)
[windows-jdk9] 	at hudson.remoting.SingleLaneExecutorService$1.run(SingleLaneExecutorService.java:131)
[windows-jdk9] 	at jenkins.util.ContextResettingExecutorService$1.run(ContextResettingExecutorService.java:28)
[windows-jdk9] 	at jenkins.security.ImpersonatingExecutorService$1.run(ImpersonatingExecutorService.java:59)
[windows-jdk9] 	at java.util.concurrent.Executors$RunnableAdapter.call(Executors.java:511)
[windows-jdk9] 	at java.util.concurrent.FutureTask.run(FutureTask.java:266)
[windows-jdk9] 	at java.util.concurrent.ThreadPoolExecutor.runWorker(ThreadPoolExecutor.java:1149)
[windows-jdk9] 	at java.util.concurrent.ThreadPoolExecutor$Worker.run(ThreadPoolExecutor.java:624)
[windows-jdk9] 	at java.lang.Thread.run(Thread.java:748)
[Pipeline] [linux-jdk8] // dir
[Pipeline] [windows-jdk8] // withMaven
[Pipeline] [windows-jdk9] // withMaven
[Pipeline] [linux-jdk8] }
[Pipeline] [linux-jdk7] }
[Pipeline] [linux-jdk9] }
[Pipeline] [windows-jdk8] deleteDir
[Pipeline] [windows-jdk9] deleteDir
[Pipeline] [linux-jdk8] // stage
[Pipeline] [linux-jdk7] // dir
[Pipeline] [linux-jdk9] // dir
[Pipeline] [linux-jdk8] }
[Pipeline] [linux-jdk7] }
[Pipeline] [linux-jdk9] }
[Pipeline] [linux-jdk8] // node
[Pipeline] [linux-jdk7] // stage
[Pipeline] [linux-jdk9] // stage
[Pipeline] [linux-jdk8] }
[Pipeline] [linux-jdk7] }
[Pipeline] [linux-jdk9] }
[Pipeline] [linux-jdk7] // node
[Pipeline] [linux-jdk9] // node
[Pipeline] [linux-jdk7] }
[Pipeline] [linux-jdk9] }
[Pipeline] [windows-jdk7] }
[Pipeline] [windows-jdk7] // dir
[Pipeline] [windows-jdk7] }
[Pipeline] [windows-jdk7] // stage
[Pipeline] [windows-jdk7] }
[Pipeline] [windows-jdk7] // node
[Pipeline] [windows-jdk7] }
[Pipeline] [windows-jdk8] }
[Pipeline] [windows-jdk8] // dir
[Pipeline] [windows-jdk8] }
[Pipeline] [windows-jdk9] }
[Pipeline] [windows-jdk8] // stage
[Pipeline] [windows-jdk9] // dir
[Pipeline] [windows-jdk8] }
[Pipeline] [windows-jdk9] }
[Pipeline] [windows-jdk8] // node
[Pipeline] [windows-jdk9] // stage
[Pipeline] [windows-jdk8] }
[Pipeline] [windows-jdk9] }
[Pipeline] [windows-jdk9] // node
[Pipeline] [windows-jdk9] }
[Pipeline] // parallel
[Pipeline] stage
[Pipeline] { (Notifications)
[Pipeline] echo
Build result: UNSTABLE
[Pipeline] jiraIssueSelector
[Pipeline] emailext
Mime
  • Unnamed multipart/mixed (inline, None, 0 bytes)
View raw message