maven-notifications mailing list archives

Site index · List index
Message view « Date » · « Thread »
Top « Date » · « Thread »
From Apache Jenkins Server <jenk...@builds.apache.org>
Subject Build failed in Jenkins: Maven TLP » maven-project-info-reports-plugin » MNGSITE-332 #3
Date Fri, 13 Jul 2018 10:02:00 GMT
See https://builds.apache.org/job/maven-box/job/maven-project-info-reports-plugin/job/MNGSITE-332/3/

No changes.

No tests ran.

Build log:
Branch indexing
Obtained Jenkinsfile from 8d0dbb0e5fc8ee0a120fdb45b862fe26c7febe5d
Running in Durability level: MAX_SURVIVABILITY
Loading library jenkins-env@master
Attempting to resolve master from remote references...
 > git --version # timeout=10
 > git ls-remote -h https://gitbox.apache.org/repos/asf/maven-jenkins-env.git # timeout=10
Found match: refs/heads/master revision c7625b1aa84b6dd6c2d7f9872e19046718b26f6b
 > git rev-parse --is-inside-work-tree # timeout=10
Fetching changes from the remote Git repository
 > git config remote.origin.url https://gitbox.apache.org/repos/asf/maven-jenkins-env.git
# timeout=10
Fetching without tags
Fetching upstream changes from https://gitbox.apache.org/repos/asf/maven-jenkins-env.git
 > git --version # timeout=10
 > git fetch --no-tags --progress https://gitbox.apache.org/repos/asf/maven-jenkins-env.git
+refs/heads/*:refs/remotes/origin/*
Checking out Revision c7625b1aa84b6dd6c2d7f9872e19046718b26f6b (master)
 > git config core.sparsecheckout # timeout=10
 > git checkout -f c7625b1aa84b6dd6c2d7f9872e19046718b26f6b
Commit message: "Try to fix it."
 > git rev-list --no-walk c7625b1aa84b6dd6c2d7f9872e19046718b26f6b # timeout=10
Loading library jenkins-lib@master
Attempting to resolve master from remote references...
 > git --version # timeout=10
 > git ls-remote -h https://gitbox.apache.org/repos/asf/maven-jenkins-lib.git # timeout=10
Found match: refs/heads/master revision 8c7a5535a63e567b533627e0eb9876799ccd8364
 > git rev-parse --is-inside-work-tree # timeout=10
Fetching changes from the remote Git repository
 > git config remote.origin.url https://gitbox.apache.org/repos/asf/maven-jenkins-lib.git
# timeout=10
Fetching without tags
Fetching upstream changes from https://gitbox.apache.org/repos/asf/maven-jenkins-lib.git
 > git --version # timeout=10
 > git fetch --no-tags --progress https://gitbox.apache.org/repos/asf/maven-jenkins-lib.git
+refs/heads/*:refs/remotes/origin/*
Checking out Revision 8c7a5535a63e567b533627e0eb9876799ccd8364 (master)
 > git config core.sparsecheckout # timeout=10
 > git checkout -f 8c7a5535a63e567b533627e0eb9876799ccd8364
Commit message: "Disable site plan, doesn't work with multimodules"
 > git rev-list --no-walk 8c7a5535a63e567b533627e0eb9876799ccd8364 # timeout=10
[Pipeline] properties
[Pipeline] echo
OS: linux JDK: 7 Maven: 3.x.x => Label: ubuntu JDK: JDK 1.7 (latest) Maven: Maven 3.5.2
[Pipeline] echo
OS: linux JDK: 8 Maven: 3.x.x => Label: ubuntu JDK: JDK 1.8 (latest) Maven: Maven 3.5.2
[Pipeline] echo
OS: linux JDK: 9 Maven: 3.x.x => Label: ubuntu JDK: JDK 1.9 (latest) Maven: Maven 3.5.2
[Pipeline] echo
OS: linux JDK: 10 Maven: 3.x.x => Label: ubuntu JDK: JDK 10 (latest) Maven: Maven 3.5.2
[Pipeline] echo
OS: windows JDK: 7 Maven: 3.x.x => Label: Windows JDK: JDK 1.7 (latest) Maven: Maven 3.5.0
(Windows)
[Pipeline] echo
OS: windows JDK: 8 Maven: 3.x.x => Label: Windows JDK: JDK 1.8 (latest) Maven: Maven 3.5.0
(Windows)
[Pipeline] echo
OS: windows JDK: 9 Maven: 3.x.x => Label: Windows JDK: JDK 1.9 (latest) Maven: Maven 3.5.0
(Windows)
[Pipeline] echo
OS: windows JDK: 10 Maven: 3.x.x => Label: Windows JDK: JDK 10 (latest) Maven: Maven 3.5.0
(Windows)
[Pipeline] parallel
[Pipeline] [linux-jdk7] { (Branch: linux-jdk7)
[Pipeline] [linux-jdk8] { (Branch: linux-jdk8)
[Pipeline] [linux-jdk9] { (Branch: linux-jdk9)
[Pipeline] [linux-jdk10] { (Branch: linux-jdk10)
[Pipeline] [windows-jdk7] { (Branch: windows-jdk7)
[Pipeline] [windows-jdk8] { (Branch: windows-jdk8)
[Pipeline] [windows-jdk9] { (Branch: windows-jdk9)
[Pipeline] [windows-jdk10] { (Branch: windows-jdk10)
[Pipeline] [linux-jdk7] node
[Pipeline] [linux-jdk8] node
[Pipeline] [linux-jdk9] node
[Pipeline] [linux-jdk10] node
[Pipeline] [windows-jdk7] node
[Pipeline] [windows-jdk8] node
[Pipeline] [windows-jdk9] node
[Pipeline] [windows-jdk10] node
[linux-jdk7] Still waiting to schedule task
[linux-jdk7] Waiting for next available executor on ubuntu
[linux-jdk8] Still waiting to schedule task
[linux-jdk8] Waiting for next available executor on ubuntu
[linux-jdk9] Still waiting to schedule task
[linux-jdk9] Waiting for next available executor on ubuntu
[linux-jdk10] Still waiting to schedule task
[linux-jdk10] Waiting for next available executor on ubuntu
[windows-jdk7] Still waiting to schedule task
[windows-jdk7] Waiting for next available executor on Windows
[windows-jdk8] Still waiting to schedule task
[windows-jdk8] Waiting for next available executor on Windows
[windows-jdk9] Still waiting to schedule task
[windows-jdk9] Waiting for next available executor on Windows
[windows-jdk10] Still waiting to schedule task
[windows-jdk10] Waiting for next available executor on Windows
[windows-jdk7] Running on windows-2012-1 in f:\jenkins\jenkins-slave\workspace\-reports-plugin_MNGSITE-332-3FIAGBSJG5IBNGSLQKN7LBN3L33EZ7DTE6TVU5NRJ7T5NM3PB2YQ
[Pipeline] [windows-jdk7] {
[Pipeline] [windows-jdk7] stage
[Pipeline] [windows-jdk7] { (Checkout windows-jdk7)
[Pipeline] [windows-jdk7] dir
[windows-jdk7] Running in f:\jenkins\jenkins-slave\workspace\-reports-plugin_MNGSITE-332-3FIAGBSJG5IBNGSLQKN7LBN3L33EZ7DTE6TVU5NRJ7T5NM3PB2YQ\m
[Pipeline] [windows-jdk7] {
[Pipeline] [windows-jdk7] checkout
[windows-jdk7]  > git rev-parse --is-inside-work-tree # timeout=10
[windows-jdk7] Fetching changes from the remote Git repository
[windows-jdk7]  > git config remote.origin.url https://gitbox.apache.org/repos/asf/maven-project-info-reports-plugin.git
# timeout=10
[windows-jdk7] Fetching without tags
[windows-jdk7] Fetching upstream changes from https://gitbox.apache.org/repos/asf/maven-project-info-reports-plugin.git
[windows-jdk7]  > git --version # timeout=10
[windows-jdk7]  > git fetch --no-tags --progress https://gitbox.apache.org/repos/asf/maven-project-info-reports-plugin.git
+refs/heads/*:refs/remotes/origin/*
[windows-jdk8] Running on windows-2012-1 in f:\jenkins\jenkins-slave\workspace\-reports-plugin_MNGSITE-332-3FIAGBSJG5IBNGSLQKN7LBN3L33EZ7DTE6TVU5NRJ7T5NM3PB2YQ@2
[Pipeline] [windows-jdk8] {
[Pipeline] [windows-jdk8] stage
[Pipeline] [windows-jdk8] { (Checkout windows-jdk8)
[Pipeline] [windows-jdk8] dir
[windows-jdk8] Running in f:\jenkins\jenkins-slave\workspace\-reports-plugin_MNGSITE-332-3FIAGBSJG5IBNGSLQKN7LBN3L33EZ7DTE6TVU5NRJ7T5NM3PB2YQ@2\m
[Pipeline] [windows-jdk8] {
[Pipeline] [windows-jdk8] checkout
[windows-jdk7] Checking out Revision 8d0dbb0e5fc8ee0a120fdb45b862fe26c7febe5d (MNGSITE-332)
[windows-jdk7]  > git config core.sparsecheckout # timeout=10
[windows-jdk7]  > git checkout -f 8d0dbb0e5fc8ee0a120fdb45b862fe26c7febe5d
[windows-jdk8] Cloning the remote Git repository
[windows-jdk8] Cloning with configured refspecs honoured and without tags
[windows-jdk8] Cloning repository https://gitbox.apache.org/repos/asf/maven-project-info-reports-plugin.git
[windows-jdk8]  > git init f:\jenkins\jenkins-slave\workspace\-reports-plugin_MNGSITE-332-3FIAGBSJG5IBNGSLQKN7LBN3L33EZ7DTE6TVU5NRJ7T5NM3PB2YQ@2\m
# timeout=10
[windows-jdk8] ERROR: Error cloning remote repo 'origin'
[windows-jdk8] hudson.plugins.git.GitException: Could not init f:\jenkins\jenkins-slave\workspace\-reports-plugin_MNGSITE-332-3FIAGBSJG5IBNGSLQKN7LBN3L33EZ7DTE6TVU5NRJ7T5NM3PB2YQ@2\m
[windows-jdk8] 	at org.jenkinsci.plugins.gitclient.CliGitAPIImpl$5.execute(CliGitAPIImpl.java:772)
[windows-jdk8] 	at org.jenkinsci.plugins.gitclient.CliGitAPIImpl$2.execute(CliGitAPIImpl.java:564)
[windows-jdk8] 	at org.jenkinsci.plugins.gitclient.RemoteGitImpl$CommandInvocationHandler$1.call(RemoteGitImpl.java:153)
[windows-jdk8] 	at org.jenkinsci.plugins.gitclient.RemoteGitImpl$CommandInvocationHandler$1.call(RemoteGitImpl.java:146)
[windows-jdk8] 	at hudson.remoting.UserRequest.perform(UserRequest.java:153)
[windows-jdk8] 	at hudson.remoting.UserRequest.perform(UserRequest.java:50)
[windows-jdk8] 	at hudson.remoting.Request$2.run(Request.java:336)
[windows-jdk8] 	at hudson.remoting.InterceptingExecutorService$1.call(InterceptingExecutorService.java:68)
[windows-jdk8] 	at java.util.concurrent.FutureTask.run(Unknown Source)
[windows-jdk8] 	at java.util.concurrent.ThreadPoolExecutor.runWorker(Unknown Source)
[windows-jdk8] 	at java.util.concurrent.ThreadPoolExecutor$Worker.run(Unknown Source)
[windows-jdk8] 	at hudson.remoting.Engine$1$1.run(Engine.java:94)
[windows-jdk8] 	at java.lang.Thread.run(Unknown Source)
[windows-jdk8] 	Suppressed: hudson.remoting.Channel$CallSiteStackTrace: Remote call to JNLP4-connect
connection from 37.48.69.226/37.48.69.226:50144
[windows-jdk8] 		at hudson.remoting.Channel.attachCallSiteStackTrace(Channel.java:1741)
[windows-jdk8] 		at hudson.remoting.UserResponse.retrieve(UserRequest.java:389)
[windows-jdk8] 		at hudson.remoting.Channel.call(Channel.java:955)
[windows-jdk8] 		at org.jenkinsci.plugins.gitclient.RemoteGitImpl$CommandInvocationHandler.execute(RemoteGitImpl.java:146)
[windows-jdk8] 		at sun.reflect.GeneratedMethodAccessor905.invoke(Unknown Source)
[windows-jdk8] 		at sun.reflect.DelegatingMethodAccessorImpl.invoke(DelegatingMethodAccessorImpl.java:43)
[windows-jdk8] 		at java.lang.reflect.Method.invoke(Method.java:498)
[windows-jdk8] 		at org.jenkinsci.plugins.gitclient.RemoteGitImpl$CommandInvocationHandler.invoke(RemoteGitImpl.java:132)
[windows-jdk8] 		at com.sun.proxy.$Proxy130.execute(Unknown Source)
[windows-jdk8] 		at hudson.plugins.git.GitSCM.retrieveChanges(GitSCM.java:1146)
[windows-jdk8] 		at hudson.plugins.git.GitSCM.checkout(GitSCM.java:1186)
[windows-jdk8] 		at org.jenkinsci.plugins.workflow.steps.scm.SCMStep.checkout(SCMStep.java:113)
[windows-jdk8] 		at org.jenkinsci.plugins.workflow.steps.scm.SCMStep$StepExecutionImpl.run(SCMStep.java:85)
[windows-jdk8] 		at org.jenkinsci.plugins.workflow.steps.scm.SCMStep$StepExecutionImpl.run(SCMStep.java:75)
[windows-jdk8] 		at org.jenkinsci.plugins.workflow.steps.AbstractSynchronousNonBlockingStepExecution$1$1.call(AbstractSynchronousNonBlockingStepExecution.java:47)
[windows-jdk8] 		at hudson.security.ACL.impersonate(ACL.java:290)
[windows-jdk8] 		at org.jenkinsci.plugins.workflow.steps.AbstractSynchronousNonBlockingStepExecution$1.run(AbstractSynchronousNonBlockingStepExecution.java:44)
[windows-jdk8] 		at java.util.concurrent.Executors$RunnableAdapter.call(Executors.java:511)
[windows-jdk8] 		at java.util.concurrent.FutureTask.run(FutureTask.java:266)
[windows-jdk8] 		at java.util.concurrent.ThreadPoolExecutor.runWorker(ThreadPoolExecutor.java:1149)
[windows-jdk8] 		at java.util.concurrent.ThreadPoolExecutor$Worker.run(ThreadPoolExecutor.java:624)
[windows-jdk8] 		at java.lang.Thread.run(Thread.java:748)
[windows-jdk8] Caused by: hudson.plugins.git.GitException: Command "git init f:\jenkins\jenkins-slave\workspace\-reports-plugin_MNGSITE-332-3FIAGBSJG5IBNGSLQKN7LBN3L33EZ7DTE6TVU5NRJ7T5NM3PB2YQ@2\m"
returned status code 128:
[windows-jdk8] stdout: 
[windows-jdk8] stderr: error: copy-fd: write returned: No space left on device
[windows-jdk8] fatal: cannot copy 'C:\Program Files\Git\mingw64/share/git-core/templates/hooks/commit-msg.sample'
to 'f:/jenkins/jenkins-slave/workspace/-reports-plugin_MNGSITE-332-3FIAGBSJG5IBNGSLQKN7LBN3L33EZ7DTE6TVU5NRJ7T5NM3PB2YQ@2/m/.git/hooks/commit-msg.sample':
No space left on device
[windows-jdk8] 
[windows-jdk8] 	at org.jenkinsci.plugins.gitclient.CliGitAPIImpl.launchCommandIn(CliGitAPIImpl.java:2002)
[windows-jdk8] 	at org.jenkinsci.plugins.gitclient.CliGitAPIImpl.launchCommandIn(CliGitAPIImpl.java:1970)
[windows-jdk8] 	at org.jenkinsci.plugins.gitclient.CliGitAPIImpl.launchCommandIn(CliGitAPIImpl.java:1966)
[windows-jdk8] 	at org.jenkinsci.plugins.gitclient.CliGitAPIImpl.launchCommand(CliGitAPIImpl.java:1597)
[windows-jdk8] 	at org.jenkinsci.plugins.gitclient.CliGitAPIImpl$5.execute(CliGitAPIImpl.java:770)
[windows-jdk8] 	... 12 more
[Pipeline] [windows-jdk8] }
[Pipeline] [windows-jdk8] // dir
[Pipeline] [windows-jdk8] echo
[windows-jdk8] [FAIL FAST] This is the first failure and likely root cause
[Pipeline] [windows-jdk8] }
[Pipeline] [windows-jdk8] // stage
[Pipeline] [windows-jdk8] }
[Pipeline] [windows-jdk8] // node
[Pipeline] [windows-jdk8] }
[windows-jdk8] Failed in branch windows-jdk8
[Pipeline] [linux-jdk7] // node
[Pipeline] [linux-jdk8] // node
[Pipeline] [linux-jdk9] // node
[Pipeline] [linux-jdk10] // node
[Pipeline] [windows-jdk9] // node
[Pipeline] [windows-jdk10] // node
[Pipeline] [linux-jdk7] }
[linux-jdk7] Failed in branch linux-jdk7
[Pipeline] [linux-jdk8] }
[linux-jdk8] Failed in branch linux-jdk8
[Pipeline] [linux-jdk9] }
[linux-jdk9] Failed in branch linux-jdk9
[Pipeline] [linux-jdk10] }
[linux-jdk10] Failed in branch linux-jdk10
[Pipeline] [windows-jdk9] }
[windows-jdk9] Failed in branch windows-jdk9
[Pipeline] [windows-jdk10] }
[windows-jdk10] Failed in branch windows-jdk10
[Pipeline] [windows-jdk7] }
[Pipeline] [windows-jdk7] // dir
[Pipeline] [windows-jdk7] echo
[windows-jdk7] [FAIL FAST] windows-jdk8 had first failure, ignoring null
[Pipeline] [windows-jdk7] }
[Pipeline] [windows-jdk7] // stage
[Pipeline] [windows-jdk7] stage
[Pipeline] [windows-jdk7] { (Build windows-jdk7)
[Pipeline] [windows-jdk7] echo
[windows-jdk7] [FAIL FAST] windows-jdk8 has failed. Skipping windows-jdk7.
[Pipeline] [windows-jdk7] }
[Pipeline] [windows-jdk7] // stage
[Pipeline] [windows-jdk7] }
[Pipeline] [windows-jdk7] // node
[Pipeline] [windows-jdk7] }
[Pipeline] // parallel
[Pipeline] echo
***** FAST FAILURE *****

Fast failure triggered by windows-jdk8

***** FAST FAILURE *****
[Pipeline] stage
[Pipeline] { (Notifications)
[Pipeline] echo
Build result: FAILURE
[Pipeline] jiraIssueSelector
Mime
  • Unnamed multipart/mixed (inline, None, 0 bytes)
View raw message