maven-notifications mailing list archives

Site index · List index
Message view « Date » · « Thread »
Top « Date » · « Thread »
From Apache Jenkins Server <jenk...@builds.apache.org>
Subject Build failed in Jenkins: Maven TLP » maven-acr-plugin » master #16
Date Sat, 21 Jul 2018 14:03:52 GMT
See https://builds.apache.org/job/maven-box/job/maven-acr-plugin/job/master/16/

Changes:

* [MACR-48] - Upgrade maven-plugins parent to version 32
* [MACR-48] - Upgrade maven-plugins parent to version 32
* [MACR-48] - Upgrade maven-plugins parent to version 32
* [MACR-48] - Upgrade maven-plugins parent to version 32
* [MACR-48] - Upgrade maven-plugins parent to version 32
* [MACR-48] - Upgrade maven-plugins parent to version 32
* [MACR-48] - Upgrade maven-plugins parent to version 32

No tests ran.

Build log:
[...truncated 2.21 MB...]
[windows-jdk8] [INFO] Final Memory: 45M/446M
[windows-jdk8] [INFO] ------------------------------------------------------------------------
[windows-jdk8] [INFO] [jenkins-event-spy] Generated F:\jenkins\jenkins-slave\workspace\box_maven-acr-plugin_master-DR2AUSNQJ7C2CF74VSZZNIFXXYVCALCHKOCIXDLUR5AX7HPABDAQ@tmp\withMaven613922a7\maven-spy-20180721-140222-7826465932808278695570.log
[windows-jdk8] [ERROR] Failed to execute goal org.apache.maven.plugins:maven-checkstyle-plugin:3.0.0:check
(checkstyle-check) on project maven-acr-plugin: Execution checkstyle-check of goal org.apache.maven.plugins:maven-checkstyle-plugin:3.0.0:check
failed: Plugin org.apache.maven.plugins:maven-checkstyle-plugin:3.0.0 or one of its dependencies
could not be resolved: Failed to collect dependencies at org.apache.maven.plugins:maven-checkstyle-plugin:jar:3.0.0
-> com.puppycrawl.tools:checkstyle:jar:6.18 -> com.google.guava:guava:jar:19.0: Failed
to read artifact descriptor for com.google.guava:guava:jar:19.0: Could not transfer artifact
org.sonatype.oss:oss-parent:pom:7 from/to central (https://repo.maven.apache.org/maven2):
GET request of: org/sonatype/oss/oss-parent/7/oss-parent-7.pom from central failed: There
is not enough space on the disk -> [Help 1]
[windows-jdk8] [ERROR] 
[windows-jdk8] [ERROR] To see the full stack trace of the errors, re-run Maven with the -e
switch.
[windows-jdk8] [ERROR] Re-run Maven using the -X switch to enable full debug logging.
[windows-jdk8] [ERROR] 
[windows-jdk8] [ERROR] For more information about the errors and possible solutions, please
read the following articles:
[windows-jdk8] [ERROR] [Help 1] http://cwiki.apache.org/confluence/display/MAVEN/PluginResolutionException
[windows-jdk8] Picked up JAVA_TOOL_OPTIONS: -Dmaven.ext.class.path="f:\jenkins\jenkins-slave\workspace\box_maven-acr-plugin_master-DR2AUSNQJ7C2CF74VSZZNIFXXYVCALCHKOCIXDLUR5AX7HPABDAQ@tmp\withMaven613922a7\pipeline-maven-spy.jar"
-Dorg.jenkinsci.plugins.pipeline.maven.reportsFolder="f:\jenkins\jenkins-slave\workspace\box_maven-acr-plugin_master-DR2AUSNQJ7C2CF74VSZZNIFXXYVCALCHKOCIXDLUR5AX7HPABDAQ@tmp\withMaven613922a7"

[Pipeline] [linux-jdk8] }
[linux-jdk9] [INFO] run post-build script verify.bsh
[linux-jdk9] [INFO]           it-03/pom.xml .................................... SUCCESS (4.8
s)
[linux-jdk9] [INFO] 
[linux-jdk9] [INFO] --- maven-checkstyle-plugin:3.0.0:check (checkstyle-check) @ maven-acr-plugin
---
[linux-jdk9] [INFO] Downloading from central: https://repo.maven.apache.org/maven2/org/apache/maven/shared/maven-shared-resources/2/maven-shared-resources-2.pom
[linux-jdk9] [INFO] Downloaded from central: https://repo.maven.apache.org/maven2/org/apache/maven/shared/maven-shared-resources/2/maven-shared-resources-2.pom
(3.0 kB at 174 kB/s)
[linux-jdk8] [withMaven] invokerPublisher - Archive invoker results for Maven artifact MavenArtifact{org.apache.maven.plugins:maven-acr-plugin::3.1.1-SNAPSHOT(version:
3.1.1-SNAPSHOT, snapshot:false) } generated by PluginInvocation{org.apache.maven.plugins:maven-invoker-plugin:3.1.0@integration-test
 integration-test}: m/target/invoker-reports/*.xml
[linux-jdk8] performing MavenInvokerRecorder, reportsFilenamePattern:'**/m/target/invoker-reports/BUILD*.xml',
invokerBuildDir:'**/m/target/it'
[linux-jdk8] Found reports:[/home/jenkins/jenkins-slave/workspace/box_maven-acr-plugin_master-DR2AUSNQJ7C2CF74VSZZNIFXXYVCALCHKOCIXDLUR5AX7HPABDAQ/m/target/invoker-reports/BUILD-it-01.xml,
/home/jenkins/jenkins-slave/workspace/box_maven-acr-plugin_master-DR2AUSNQJ7C2CF74VSZZNIFXXYVCALCHKOCIXDLUR5AX7HPABDAQ/m/target/invoker-reports/BUILD-it-02.xml,
/home/jenkins/jenkins-slave/workspace/box_maven-acr-plugin_master-DR2AUSNQJ7C2CF74VSZZNIFXXYVCALCHKOCIXDLUR5AX7HPABDAQ/m/target/invoker-reports/BUILD-it-03.xml,
/home/jenkins/jenkins-slave/workspace/box_maven-acr-plugin_master-DR2AUSNQJ7C2CF74VSZZNIFXXYVCALCHKOCIXDLUR5AX7HPABDAQ/m/target/invoker-reports/BUILD-it-04.xml]
[linux-jdk8] Found logs:[/home/jenkins/jenkins-slave/workspace/box_maven-acr-plugin_master-DR2AUSNQJ7C2CF74VSZZNIFXXYVCALCHKOCIXDLUR5AX7HPABDAQ/m/target/it/it-01/build.log,
/home/jenkins/jenkins-slave/workspace/box_maven-acr-plugin_master-DR2AUSNQJ7C2CF74VSZZNIFXXYVCALCHKOCIXDLUR5AX7HPABDAQ/m/target/it/it-02/build.log,
/home/jenkins/jenkins-slave/workspace/box_maven-acr-plugin_master-DR2AUSNQJ7C2CF74VSZZNIFXXYVCALCHKOCIXDLUR5AX7HPABDAQ/m/target/it/it-03/build.log,
/home/jenkins/jenkins-slave/workspace/box_maven-acr-plugin_master-DR2AUSNQJ7C2CF74VSZZNIFXXYVCALCHKOCIXDLUR5AX7HPABDAQ/m/target/it/it-04/build.log]
[linux-jdk8] Finished parsing Maven Invoker results (found 4)
[linux-jdk8] [withMaven] junitPublisher - Archive test results for Maven artifact org.apache.maven.plugins:maven-acr-plugin:3.1.1-SNAPSHOT
generated by maven-surefire-plugin:test (default-test): m/target/surefire-reports/*.xml
[linux-jdk8] Recording test results
[linux-jdk8] None of the test reports contained any result
[Pipeline] [linux-jdk8] // withMaven
[Pipeline] [windows-jdk8] }
[Pipeline] [linux-jdk8] }
[Pipeline] [linux-jdk10] }
[Pipeline] [windows-jdk9] }
[Pipeline] [windows-jdk10] }
[Pipeline] [windows-jdk8] // dir
[Pipeline] [linux-jdk8] // stage
[Pipeline] [linux-jdk10] // dir
[Pipeline] [windows-jdk9] // dir
[Pipeline] [windows-jdk10] // dir
[linux-jdk7] [INFO] 
[linux-jdk7] [INFO] --- maven-invoker-plugin:3.1.0:verify (integration-test) @ maven-acr-plugin
---
[linux-jdk7] [INFO] -------------------------------------------------
[linux-jdk7] [INFO] Build Summary:
[linux-jdk7] [INFO]   Passed: 4, Failed: 0, Errors: 0, Skipped: 0
[linux-jdk7] [INFO] -------------------------------------------------
[linux-jdk7] [INFO] ------------------------------------------------------------------------
[linux-jdk7] [INFO] BUILD SUCCESS
[linux-jdk7] [INFO] ------------------------------------------------------------------------
[linux-jdk7] [INFO] Total time: 47.779 s
[linux-jdk7] [INFO] Finished at: 2018-07-21T14:03:26Z
[linux-jdk7] [INFO] Final Memory: 42M/897M
[linux-jdk7] [INFO] ------------------------------------------------------------------------
[linux-jdk7] [INFO] [jenkins-event-spy] Generated /home/jenkins/jenkins-slave/workspace/box_maven-acr-plugin_master-DR2AUSNQJ7C2CF74VSZZNIFXXYVCALCHKOCIXDLUR5AX7HPABDAQ@tmp/withMavendcb8fef4/maven-spy-20180721-140238-4973627510258565142418.log
[linux-jdk9] [INFO] Downloading from central: https://repo.maven.apache.org/maven2/org/codehaus/plexus/plexus-utils/3.0.10/plexus-utils-3.0.10.pom
[linux-jdk9] [INFO] Downloaded from central: https://repo.maven.apache.org/maven2/org/codehaus/plexus/plexus-utils/3.0.10/plexus-utils-3.0.10.pom
(3.1 kB at 286 kB/s)
[linux-jdk9] [INFO] Downloading from central: https://repo.maven.apache.org/maven2/org/codehaus/plexus/plexus/3.3/plexus-3.3.pom
[linux-jdk9] [INFO] Downloaded from central: https://repo.maven.apache.org/maven2/org/codehaus/plexus/plexus/3.3/plexus-3.3.pom
(20 kB at 1.7 MB/s)
[linux-jdk9] [INFO] Downloading from central: https://repo.maven.apache.org/maven2/org/apache/maven/doxia/doxia-integration-tools/1.6/doxia-integration-tools-1.6.pom
[linux-jdk9] [INFO] Downloaded from central: https://repo.maven.apache.org/maven2/org/apache/maven/doxia/doxia-integration-tools/1.6/doxia-integration-tools-1.6.pom
(7.0 kB at 580 kB/s)
[linux-jdk9] [INFO] Downloading from central: https://repo.maven.apache.org/maven2/org/apache/maven/doxia/doxia-tools/3/doxia-tools-3.pom
[linux-jdk9] [INFO] Downloaded from central: https://repo.maven.apache.org/maven2/org/apache/maven/doxia/doxia-tools/3/doxia-tools-3.pom
(9.9 kB at 827 kB/s)
[linux-jdk9] [INFO] Downloading from central: https://repo.maven.apache.org/maven2/org/codehaus/plexus/plexus-resources/1.1.0/plexus-resources-1.1.0.pom
[linux-jdk9] [INFO] Downloaded from central: https://repo.maven.apache.org/maven2/org/codehaus/plexus/plexus-resources/1.1.0/plexus-resources-1.1.0.pom
(3.2 kB at 289 kB/s)
[linux-jdk9] [INFO] Downloading from central: https://repo.maven.apache.org/maven2/com/puppycrawl/tools/checkstyle/6.18/checkstyle-6.18.pom
[linux-jdk9] [INFO] Downloaded from central: https://repo.maven.apache.org/maven2/com/puppycrawl/tools/checkstyle/6.18/checkstyle-6.18.pom
(71 kB at 5.1 MB/s)
[linux-jdk9] [INFO] Downloading from central: https://repo.maven.apache.org/maven2/antlr/antlr/2.7.7/antlr-2.7.7.pom
[linux-jdk9] [INFO] Downloaded from central: https://repo.maven.apache.org/maven2/antlr/antlr/2.7.7/antlr-2.7.7.pom
(632 B at 57 kB/s)
[linux-jdk9] [INFO] Downloading from central: https://repo.maven.apache.org/maven2/org/antlr/antlr4-runtime/4.5.3/antlr4-runtime-4.5.3.pom
[linux-jdk9] [INFO] Downloaded from central: https://repo.maven.apache.org/maven2/org/antlr/antlr4-runtime/4.5.3/antlr4-runtime-4.5.3.pom
(2.3 kB at 210 kB/s)
[linux-jdk9] [INFO] Downloading from central: https://repo.maven.apache.org/maven2/org/antlr/antlr4-master/4.5.3/antlr4-master-4.5.3.pom
[linux-jdk9] [INFO] Downloaded from central: https://repo.maven.apache.org/maven2/org/antlr/antlr4-master/4.5.3/antlr4-master-4.5.3.pom
(3.7 kB at 307 kB/s)
[linux-jdk9] [INFO] Downloading from central: https://repo.maven.apache.org/maven2/commons-beanutils/commons-beanutils/1.9.2/commons-beanutils-1.9.2.pom
[linux-jdk9] [INFO] Downloaded from central: https://repo.maven.apache.org/maven2/commons-beanutils/commons-beanutils/1.9.2/commons-beanutils-1.9.2.pom
(14 kB at 1.1 MB/s)
[linux-jdk9] [INFO] Downloading from central: https://repo.maven.apache.org/maven2/org/apache/commons/commons-parent/33/commons-parent-33.pom
[linux-jdk9] [INFO] Downloaded from central: https://repo.maven.apache.org/maven2/org/apache/commons/commons-parent/33/commons-parent-33.pom
(53 kB at 4.1 MB/s)
[linux-jdk9] [INFO] Downloading from central: https://repo.maven.apache.org/maven2/commons-cli/commons-cli/1.3.1/commons-cli-1.3.1.pom
[linux-jdk9] [INFO] Downloaded from central: https://repo.maven.apache.org/maven2/commons-cli/commons-cli/1.3.1/commons-cli-1.3.1.pom
(10 kB at 866 kB/s)
[linux-jdk9] [INFO] Downloading from central: https://repo.maven.apache.org/maven2/com/google/guava/guava/19.0/guava-19.0.pom
[linux-jdk9] [INFO] Downloaded from central: https://repo.maven.apache.org/maven2/com/google/guava/guava/19.0/guava-19.0.pom
(6.8 kB at 485 kB/s)
[linux-jdk9] [INFO] Downloading from central: https://repo.maven.apache.org/maven2/com/google/guava/guava-parent/19.0/guava-parent-19.0.pom
[linux-jdk9] [INFO] Downloaded from central: https://repo.maven.apache.org/maven2/com/google/guava/guava-parent/19.0/guava-parent-19.0.pom
(9.9 kB at 823 kB/s)
[linux-jdk9] [INFO] Downloading from central: https://repo.maven.apache.org/maven2/org/sonatype/oss/oss-parent/7/oss-parent-7.pom
[linux-jdk9] [INFO] Downloaded from central: https://repo.maven.apache.org/maven2/org/sonatype/oss/oss-parent/7/oss-parent-7.pom
(4.8 kB at 439 kB/s)
[linux-jdk9] [INFO] Downloading from central: https://repo.maven.apache.org/maven2/javax/xml/bind/jaxb-api/2.3.0/jaxb-api-2.3.0.pom
[linux-jdk9] [INFO] Downloaded from central: https://repo.maven.apache.org/maven2/javax/xml/bind/jaxb-api/2.3.0/jaxb-api-2.3.0.pom
(23 kB at 1.6 MB/s)
[linux-jdk9] [INFO] Downloading from central: https://repo.maven.apache.org/maven2/javax/xml/bind/jaxb-api-parent/2.3.0/jaxb-api-parent-2.3.0.pom
[linux-jdk9] [INFO] Downloaded from central: https://repo.maven.apache.org/maven2/javax/xml/bind/jaxb-api-parent/2.3.0/jaxb-api-parent-2.3.0.pom
(5.6 kB at 403 kB/s)
[linux-jdk9] [INFO] Downloading from central: https://repo.maven.apache.org/maven2/net/java/jvnet-parent/5/jvnet-parent-5.pom
[linux-jdk9] [INFO] Downloaded from central: https://repo.maven.apache.org/maven2/net/java/jvnet-parent/5/jvnet-parent-5.pom
(8.9 kB at 739 kB/s)
[linux-jdk9] [INFO] Downloading from central: https://repo.maven.apache.org/maven2/org/apache/maven/shared/maven-shared-resources/2/maven-shared-resources-2.jar
[linux-jdk9] [INFO] Downloading from central: https://repo.maven.apache.org/maven2/org/apache/maven/doxia/doxia-core/1.2/doxia-core-1.2.jar
[linux-jdk9] [INFO] Downloading from central: https://repo.maven.apache.org/maven2/commons-digester/commons-digester/1.6/commons-digester-1.6.jar
[linux-jdk9] [INFO] Downloading from central: https://repo.maven.apache.org/maven2/commons-logging/commons-logging/1.0.4/commons-logging-1.0.4.jar
[linux-jdk9] [INFO] Downloading from central: https://repo.maven.apache.org/maven2/org/apache/maven/doxia/doxia-integration-tools/1.6/doxia-integration-tools-1.6.jar
[linux-jdk9] [INFO] Downloaded from central: https://repo.maven.apache.org/maven2/org/apache/maven/shared/maven-shared-resources/2/maven-shared-resources-2.jar
(13 kB at 768 kB/s)
[linux-jdk9] [INFO] Downloading from central: https://repo.maven.apache.org/maven2/commons-io/commons-io/1.4/commons-io-1.4.jar
[linux-jdk9] [INFO] Downloaded from central: https://repo.maven.apache.org/maven2/commons-logging/commons-logging/1.0.4/commons-logging-1.0.4.jar
(38 kB at 2.2 MB/s)
[linux-jdk9] [INFO] Downloading from central: https://repo.maven.apache.org/maven2/org/codehaus/plexus/plexus-resources/1.1.0/plexus-resources-1.1.0.jar
[linux-jdk9] [INFO] Downloaded from central: https://repo.maven.apache.org/maven2/org/apache/maven/doxia/doxia-core/1.2/doxia-core-1.2.jar
(154 kB at 7.7 MB/s)
[linux-jdk9] [INFO] Downloading from central: https://repo.maven.apache.org/maven2/com/puppycrawl/tools/checkstyle/6.18/checkstyle-6.18.jar
[linux-jdk9] [INFO] Downloaded from central: https://repo.maven.apache.org/maven2/org/apache/maven/doxia/doxia-integration-tools/1.6/doxia-integration-tools-1.6.jar
(45 kB at 2.3 MB/s)
[linux-jdk9] [INFO] Downloading from central: https://repo.maven.apache.org/maven2/antlr/antlr/2.7.7/antlr-2.7.7.jar
[linux-jdk9] [INFO] Downloaded from central: https://repo.maven.apache.org/maven2/commons-digester/commons-digester/1.6/commons-digester-1.6.jar
(168 kB at 7.3 MB/s)
[linux-jdk9] [INFO] Downloading from central: https://repo.maven.apache.org/maven2/org/antlr/antlr4-runtime/4.5.3/antlr4-runtime-4.5.3.jar
[linux-jdk9] [INFO] Downloaded from central: https://repo.maven.apache.org/maven2/org/codehaus/plexus/plexus-resources/1.1.0/plexus-resources-1.1.0.jar
(23 kB at 800 kB/s)
[linux-jdk9] [INFO] Downloading from central: https://repo.maven.apache.org/maven2/commons-beanutils/commons-beanutils/1.9.2/commons-beanutils-1.9.2.jar
[linux-jdk9] [INFO] Downloaded from central: https://repo.maven.apache.org/maven2/commons-io/commons-io/1.4/commons-io-1.4.jar
(109 kB at 3.4 MB/s)
[linux-jdk9] [INFO] Downloading from central: https://repo.maven.apache.org/maven2/commons-cli/commons-cli/1.3.1/commons-cli-1.3.1.jar
[linux-jdk9] [INFO] Downloaded from central: https://repo.maven.apache.org/maven2/org/antlr/antlr4-runtime/4.5.3/antlr4-runtime-4.5.3.jar
(302 kB at 7.6 MB/s)
[linux-jdk9] [INFO] Downloading from central: https://repo.maven.apache.org/maven2/com/google/guava/guava/19.0/guava-19.0.jar
[linux-jdk9] [INFO] Downloaded from central: https://repo.maven.apache.org/maven2/antlr/antlr/2.7.7/antlr-2.7.7.jar
(445 kB at 9.9 MB/s)
[linux-jdk9] [INFO] Downloaded from central: https://repo.maven.apache.org/maven2/commons-cli/commons-cli/1.3.1/commons-cli-1.3.1.jar
(53 kB at 1.2 MB/s)
[linux-jdk9] [INFO] Downloading from central: https://repo.maven.apache.org/maven2/commons-lang/commons-lang/2.1/commons-lang-2.1.jar
[linux-jdk9] [INFO] Downloading from central: https://repo.maven.apache.org/maven2/javax/xml/bind/jaxb-api/2.3.0/jaxb-api-2.3.0.jar
[linux-jdk9] [INFO] Downloaded from central: https://repo.maven.apache.org/maven2/commons-beanutils/commons-beanutils/1.9.2/commons-beanutils-1.9.2.jar
(234 kB at 5.0 MB/s)
[linux-jdk9] [INFO] Downloaded from central: https://repo.maven.apache.org/maven2/javax/xml/bind/jaxb-api/2.3.0/jaxb-api-2.3.0.jar
(126 kB at 2.0 MB/s)
[linux-jdk9] [INFO] Downloaded from central: https://repo.maven.apache.org/maven2/commons-lang/commons-lang/2.1/commons-lang-2.1.jar
(208 kB at 3.2 MB/s)
[linux-jdk9] [INFO] Downloaded from central: https://repo.maven.apache.org/maven2/com/puppycrawl/tools/checkstyle/6.18/checkstyle-6.18.jar
(1.2 MB at 18 MB/s)
[linux-jdk9] [INFO] Downloaded from central: https://repo.maven.apache.org/maven2/com/google/guava/guava/19.0/guava-19.0.jar
(2.3 MB at 19 MB/s)
[linux-jdk9] [INFO] 
[linux-jdk9] [INFO] --- maven-invoker-plugin:3.1.0:verify (integration-test) @ maven-acr-plugin
---
[linux-jdk9] [INFO] -------------------------------------------------
[linux-jdk9] [INFO] Build Summary:
[linux-jdk9] [INFO]   Passed: 4, Failed: 0, Errors: 0, Skipped: 0
[linux-jdk9] [INFO] -------------------------------------------------
[linux-jdk9] [INFO] ------------------------------------------------------------------------
[linux-jdk9] [INFO] BUILD SUCCESS
[linux-jdk9] [INFO] ------------------------------------------------------------------------
[linux-jdk9] [INFO] Total time: 50.416 s
[linux-jdk9] [INFO] Finished at: 2018-07-21T14:03:28Z
[linux-jdk9] [INFO] Final Memory: 50M/164M
[linux-jdk9] [INFO] ------------------------------------------------------------------------
[linux-jdk9] [INFO] [jenkins-event-spy] Generated /home/jenkins/jenkins-slave/workspace/box_maven-acr-plugin_master-DR2AUSNQJ7C2CF74VSZZNIFXXYVCALCHKOCIXDLUR5AX7HPABDAQ@tmp/withMavenf4a27aff/maven-spy-20180721-140238-18116328395708953324956.log
[Pipeline] [linux-jdk8] }
[Pipeline] [windows-jdk8] }
[windows-jdk8] [withMaven] invokerPublisher - Archive invoker results for Maven artifact MavenArtifact{org.apache.maven.plugins:maven-acr-plugin::3.1.1-SNAPSHOT(version:
3.1.1-SNAPSHOT, snapshot:false) } generated by PluginInvocation{org.apache.maven.plugins:maven-invoker-plugin:3.1.0@integration-test
 integration-test}: m\target\invoker-reports\*.xml
[windows-jdk8] performing MavenInvokerRecorder, reportsFilenamePattern:'**/m\target\invoker-reports/BUILD*.xml',
invokerBuildDir:'**/m\target\it'
[windows-jdk8] Found reports:[f:\jenkins\jenkins-slave\workspace\box_maven-acr-plugin_master-DR2AUSNQJ7C2CF74VSZZNIFXXYVCALCHKOCIXDLUR5AX7HPABDAQ\m\target\invoker-reports\BUILD-it-01.xml,
f:\jenkins\jenkins-slave\workspace\box_maven-acr-plugin_master-DR2AUSNQJ7C2CF74VSZZNIFXXYVCALCHKOCIXDLUR5AX7HPABDAQ\m\target\invoker-reports\BUILD-it-02.xml,
f:\jenkins\jenkins-slave\workspace\box_maven-acr-plugin_master-DR2AUSNQJ7C2CF74VSZZNIFXXYVCALCHKOCIXDLUR5AX7HPABDAQ\m\target\invoker-reports\BUILD-it-03.xml,
f:\jenkins\jenkins-slave\workspace\box_maven-acr-plugin_master-DR2AUSNQJ7C2CF74VSZZNIFXXYVCALCHKOCIXDLUR5AX7HPABDAQ\m\target\invoker-reports\BUILD-it-04.xml]
[windows-jdk8] Found logs:[f:\jenkins\jenkins-slave\workspace\box_maven-acr-plugin_master-DR2AUSNQJ7C2CF74VSZZNIFXXYVCALCHKOCIXDLUR5AX7HPABDAQ\m\target\it\it-01\build.log,
f:\jenkins\jenkins-slave\workspace\box_maven-acr-plugin_master-DR2AUSNQJ7C2CF74VSZZNIFXXYVCALCHKOCIXDLUR5AX7HPABDAQ\m\target\it\it-02\build.log,
f:\jenkins\jenkins-slave\workspace\box_maven-acr-plugin_master-DR2AUSNQJ7C2CF74VSZZNIFXXYVCALCHKOCIXDLUR5AX7HPABDAQ\m\target\it\it-03\build.log,
f:\jenkins\jenkins-slave\workspace\box_maven-acr-plugin_master-DR2AUSNQJ7C2CF74VSZZNIFXXYVCALCHKOCIXDLUR5AX7HPABDAQ\m\target\it\it-04\build.log]
[windows-jdk8] Finished parsing Maven Invoker results (found 4)
[windows-jdk8] [withMaven] junitPublisher - Archive test results for Maven artifact org.apache.maven.plugins:maven-acr-plugin:3.1.1-SNAPSHOT
generated by maven-surefire-plugin:test (default-test): m\target\surefire-reports\*.xml
[windows-jdk8] Recording test results
[windows-jdk8] None of the test reports contained any result
[Pipeline] [linux-jdk10] }
[linux-jdk10] [withMaven] invokerPublisher - Archive invoker results for Maven artifact MavenArtifact{org.apache.maven.plugins:maven-acr-plugin::3.1.1-SNAPSHOT(version:
3.1.1-SNAPSHOT, snapshot:false) } generated by PluginInvocation{org.apache.maven.plugins:maven-invoker-plugin:3.1.0@integration-test
 integration-test}: m/target/invoker-reports/*.xml
[linux-jdk10] performing MavenInvokerRecorder, reportsFilenamePattern:'**/m/target/invoker-reports/BUILD*.xml',
invokerBuildDir:'**/m/target/it'
[linux-jdk10] Found reports:[/home/jenkins/jenkins-slave/workspace/box_maven-acr-plugin_master-DR2AUSNQJ7C2CF74VSZZNIFXXYVCALCHKOCIXDLUR5AX7HPABDAQ/m/target/invoker-reports/BUILD-it-01.xml,
/home/jenkins/jenkins-slave/workspace/box_maven-acr-plugin_master-DR2AUSNQJ7C2CF74VSZZNIFXXYVCALCHKOCIXDLUR5AX7HPABDAQ/m/target/invoker-reports/BUILD-it-02.xml,
/home/jenkins/jenkins-slave/workspace/box_maven-acr-plugin_master-DR2AUSNQJ7C2CF74VSZZNIFXXYVCALCHKOCIXDLUR5AX7HPABDAQ/m/target/invoker-reports/BUILD-it-03.xml,
/home/jenkins/jenkins-slave/workspace/box_maven-acr-plugin_master-DR2AUSNQJ7C2CF74VSZZNIFXXYVCALCHKOCIXDLUR5AX7HPABDAQ/m/target/invoker-reports/BUILD-it-04.xml]
[linux-jdk10] Found logs:[/home/jenkins/jenkins-slave/workspace/box_maven-acr-plugin_master-DR2AUSNQJ7C2CF74VSZZNIFXXYVCALCHKOCIXDLUR5AX7HPABDAQ/m/target/it/it-01/build.log,
/home/jenkins/jenkins-slave/workspace/box_maven-acr-plugin_master-DR2AUSNQJ7C2CF74VSZZNIFXXYVCALCHKOCIXDLUR5AX7HPABDAQ/m/target/it/it-02/build.log,
/home/jenkins/jenkins-slave/workspace/box_maven-acr-plugin_master-DR2AUSNQJ7C2CF74VSZZNIFXXYVCALCHKOCIXDLUR5AX7HPABDAQ/m/target/it/it-03/build.log,
/home/jenkins/jenkins-slave/workspace/box_maven-acr-plugin_master-DR2AUSNQJ7C2CF74VSZZNIFXXYVCALCHKOCIXDLUR5AX7HPABDAQ/m/target/it/it-04/build.log]
[linux-jdk10] Finished parsing Maven Invoker results (found 4)
[linux-jdk10] [withMaven] junitPublisher - Archive test results for Maven artifact org.apache.maven.plugins:maven-acr-plugin:3.1.1-SNAPSHOT
generated by maven-surefire-plugin:test (default-test): m/target/surefire-reports/*.xml
[linux-jdk10] Recording test results
[linux-jdk10] None of the test reports contained any result
[Pipeline] [windows-jdk9] }
[windows-jdk9] [withMaven] invokerPublisher - Archive invoker results for Maven artifact MavenArtifact{org.apache.maven.plugins:maven-acr-plugin::3.1.1-SNAPSHOT(version:
3.1.1-SNAPSHOT, snapshot:false) } generated by PluginInvocation{org.apache.maven.plugins:maven-invoker-plugin:3.1.0@integration-test
 integration-test}: m\target\invoker-reports\*.xml
[windows-jdk9] performing MavenInvokerRecorder, reportsFilenamePattern:'**/m\target\invoker-reports/BUILD*.xml',
invokerBuildDir:'**/m\target\it'
[windows-jdk9] Found reports:[f:\jenkins\jenkins-slave\workspace\box_maven-acr-plugin_master-DR2AUSNQJ7C2CF74VSZZNIFXXYVCALCHKOCIXDLUR5AX7HPABDAQ@2\m\target\invoker-reports\BUILD-it-01.xml,
f:\jenkins\jenkins-slave\workspace\box_maven-acr-plugin_master-DR2AUSNQJ7C2CF74VSZZNIFXXYVCALCHKOCIXDLUR5AX7HPABDAQ@2\m\target\invoker-reports\BUILD-it-02.xml,
f:\jenkins\jenkins-slave\workspace\box_maven-acr-plugin_master-DR2AUSNQJ7C2CF74VSZZNIFXXYVCALCHKOCIXDLUR5AX7HPABDAQ@2\m\target\invoker-reports\BUILD-it-03.xml,
f:\jenkins\jenkins-slave\workspace\box_maven-acr-plugin_master-DR2AUSNQJ7C2CF74VSZZNIFXXYVCALCHKOCIXDLUR5AX7HPABDAQ@2\m\target\invoker-reports\BUILD-it-04.xml]
[windows-jdk9] Found logs:[f:\jenkins\jenkins-slave\workspace\box_maven-acr-plugin_master-DR2AUSNQJ7C2CF74VSZZNIFXXYVCALCHKOCIXDLUR5AX7HPABDAQ@2\m\target\it\it-01\build.log,
f:\jenkins\jenkins-slave\workspace\box_maven-acr-plugin_master-DR2AUSNQJ7C2CF74VSZZNIFXXYVCALCHKOCIXDLUR5AX7HPABDAQ@2\m\target\it\it-02\build.log,
f:\jenkins\jenkins-slave\workspace\box_maven-acr-plugin_master-DR2AUSNQJ7C2CF74VSZZNIFXXYVCALCHKOCIXDLUR5AX7HPABDAQ@2\m\target\it\it-03\build.log,
f:\jenkins\jenkins-slave\workspace\box_maven-acr-plugin_master-DR2AUSNQJ7C2CF74VSZZNIFXXYVCALCHKOCIXDLUR5AX7HPABDAQ@2\m\target\it\it-04\build.log]
[windows-jdk9] Finished parsing Maven Invoker results (found 4)
[windows-jdk9] [withMaven] junitPublisher - Archive test results for Maven artifact org.apache.maven.plugins:maven-acr-plugin:3.1.1-SNAPSHOT
generated by maven-surefire-plugin:test (default-test): m\target\surefire-reports\*.xml
[windows-jdk9] Recording test results
[windows-jdk9] None of the test reports contained any result
[Pipeline] [windows-jdk10] }
[windows-jdk10] [withMaven] invokerPublisher - Archive invoker results for Maven artifact
MavenArtifact{org.apache.maven.plugins:maven-acr-plugin::3.1.1-SNAPSHOT(version: 3.1.1-SNAPSHOT,
snapshot:false) } generated by PluginInvocation{org.apache.maven.plugins:maven-invoker-plugin:3.1.0@integration-test
 integration-test}: m\target\invoker-reports\*.xml
[windows-jdk10] performing MavenInvokerRecorder, reportsFilenamePattern:'**/m\target\invoker-reports/BUILD*.xml',
invokerBuildDir:'**/m\target\it'
[windows-jdk10] Found reports:[f:\jenkins\jenkins-slave\workspace\box_maven-acr-plugin_master-DR2AUSNQJ7C2CF74VSZZNIFXXYVCALCHKOCIXDLUR5AX7HPABDAQ\m\target\invoker-reports\BUILD-it-01.xml,
f:\jenkins\jenkins-slave\workspace\box_maven-acr-plugin_master-DR2AUSNQJ7C2CF74VSZZNIFXXYVCALCHKOCIXDLUR5AX7HPABDAQ\m\target\invoker-reports\BUILD-it-02.xml,
f:\jenkins\jenkins-slave\workspace\box_maven-acr-plugin_master-DR2AUSNQJ7C2CF74VSZZNIFXXYVCALCHKOCIXDLUR5AX7HPABDAQ\m\target\invoker-reports\BUILD-it-03.xml,
f:\jenkins\jenkins-slave\workspace\box_maven-acr-plugin_master-DR2AUSNQJ7C2CF74VSZZNIFXXYVCALCHKOCIXDLUR5AX7HPABDAQ\m\target\invoker-reports\BUILD-it-04.xml]
[windows-jdk10] Found logs:[f:\jenkins\jenkins-slave\workspace\box_maven-acr-plugin_master-DR2AUSNQJ7C2CF74VSZZNIFXXYVCALCHKOCIXDLUR5AX7HPABDAQ\m\target\it\it-01\build.log,
f:\jenkins\jenkins-slave\workspace\box_maven-acr-plugin_master-DR2AUSNQJ7C2CF74VSZZNIFXXYVCALCHKOCIXDLUR5AX7HPABDAQ\m\target\it\it-02\build.log,
f:\jenkins\jenkins-slave\workspace\box_maven-acr-plugin_master-DR2AUSNQJ7C2CF74VSZZNIFXXYVCALCHKOCIXDLUR5AX7HPABDAQ\m\target\it\it-03\build.log,
f:\jenkins\jenkins-slave\workspace\box_maven-acr-plugin_master-DR2AUSNQJ7C2CF74VSZZNIFXXYVCALCHKOCIXDLUR5AX7HPABDAQ\m\target\it\it-04\build.log]
[windows-jdk10] Finished parsing Maven Invoker results (found 4)
[windows-jdk10] [withMaven] junitPublisher - Archive test results for Maven artifact org.apache.maven.plugins:maven-acr-plugin:3.1.1-SNAPSHOT
generated by maven-surefire-plugin:test (default-test): m\target\surefire-reports\*.xml
[windows-jdk10] Recording test results
[windows-jdk10] None of the test reports contained any result
[Pipeline] [linux-jdk8] // node
[Pipeline] [windows-jdk8] // withMaven
[Pipeline] [linux-jdk10] // withMaven
[Pipeline] [windows-jdk9] // withMaven
[Pipeline] [windows-jdk10] // withMaven
[Pipeline] [linux-jdk8] }
[Pipeline] [windows-jdk8] cleanWs
[Pipeline] [linux-jdk10] }
[Pipeline] [windows-jdk9] cleanWs
[Pipeline] [windows-jdk10] }
[Pipeline] [linux-jdk7] }
[Pipeline] [linux-jdk9] }
[Pipeline] [linux-jdk10] // stage
[Pipeline] [windows-jdk10] // stage
[Pipeline] [linux-jdk7] // dir
[windows-jdk8] [WS-CLEANUP] Deleting project workspace...[WS-CLEANUP] done
[windows-jdk9] [WS-CLEANUP] Deleting project workspace...[WS-CLEANUP] done
[Pipeline] [linux-jdk9] // dir
[Pipeline] [linux-jdk10] }
[Pipeline] [windows-jdk10] }
[Pipeline] [linux-jdk7] }
[linux-jdk7] [withMaven] artifactsPublisher - Archive artifact m/pom.xml under org/apache/maven/plugins/maven-acr-plugin/3.1.1-SNAPSHOT/maven-acr-plugin-3.1.1-SNAPSHOT.pom
[linux-jdk7] [withMaven] artifactsPublisher - Archive artifact m/target/maven-acr-plugin-3.1.1-SNAPSHOT.jar
under org/apache/maven/plugins/maven-acr-plugin/3.1.1-SNAPSHOT/maven-acr-plugin-3.1.1-SNAPSHOT.jar
[linux-jdk7] [withMaven] invokerPublisher - Archive invoker results for Maven artifact MavenArtifact{org.apache.maven.plugins:maven-acr-plugin::3.1.1-SNAPSHOT(version:
3.1.1-SNAPSHOT, snapshot:false) } generated by PluginInvocation{org.apache.maven.plugins:maven-invoker-plugin:3.1.0@integration-test
 integration-test}: m/target/invoker-reports/*.xml
[linux-jdk7] performing MavenInvokerRecorder, reportsFilenamePattern:'**/m/target/invoker-reports/BUILD*.xml',
invokerBuildDir:'**/m/target/it'
[linux-jdk7] Found reports:[/home/jenkins/jenkins-slave/workspace/box_maven-acr-plugin_master-DR2AUSNQJ7C2CF74VSZZNIFXXYVCALCHKOCIXDLUR5AX7HPABDAQ/m/target/invoker-reports/BUILD-it-01.xml,
/home/jenkins/jenkins-slave/workspace/box_maven-acr-plugin_master-DR2AUSNQJ7C2CF74VSZZNIFXXYVCALCHKOCIXDLUR5AX7HPABDAQ/m/target/invoker-reports/BUILD-it-02.xml,
/home/jenkins/jenkins-slave/workspace/box_maven-acr-plugin_master-DR2AUSNQJ7C2CF74VSZZNIFXXYVCALCHKOCIXDLUR5AX7HPABDAQ/m/target/invoker-reports/BUILD-it-03.xml,
/home/jenkins/jenkins-slave/workspace/box_maven-acr-plugin_master-DR2AUSNQJ7C2CF74VSZZNIFXXYVCALCHKOCIXDLUR5AX7HPABDAQ/m/target/invoker-reports/BUILD-it-04.xml]
[linux-jdk7] Found logs:[/home/jenkins/jenkins-slave/workspace/box_maven-acr-plugin_master-DR2AUSNQJ7C2CF74VSZZNIFXXYVCALCHKOCIXDLUR5AX7HPABDAQ/m/target/it/it-01/build.log,
/home/jenkins/jenkins-slave/workspace/box_maven-acr-plugin_master-DR2AUSNQJ7C2CF74VSZZNIFXXYVCALCHKOCIXDLUR5AX7HPABDAQ/m/target/it/it-02/build.log,
/home/jenkins/jenkins-slave/workspace/box_maven-acr-plugin_master-DR2AUSNQJ7C2CF74VSZZNIFXXYVCALCHKOCIXDLUR5AX7HPABDAQ/m/target/it/it-03/build.log,
/home/jenkins/jenkins-slave/workspace/box_maven-acr-plugin_master-DR2AUSNQJ7C2CF74VSZZNIFXXYVCALCHKOCIXDLUR5AX7HPABDAQ/m/target/it/it-04/build.log]
[linux-jdk7] Finished parsing Maven Invoker results (found 4)
[linux-jdk7] [withMaven] junitPublisher - Archive test results for Maven artifact org.apache.maven.plugins:maven-acr-plugin:3.1.1-SNAPSHOT
generated by maven-surefire-plugin:test (default-test): m/target/surefire-reports/*.xml
[linux-jdk7] Recording test results
[linux-jdk7] None of the test reports contained any result
[linux-jdk7] [withMaven] openTasksPublisher - Scan Tasks for Maven artifact org.apache.maven.plugins:maven-acr-plugin:3.1.1-SNAPSHOT
in source directory m/src/main/java
[linux-jdk7] [TASKS] Scanning folder '/home/jenkins/jenkins-slave/workspace/box_maven-acr-plugin_master-DR2AUSNQJ7C2CF74VSZZNIFXXYVCALCHKOCIXDLUR5AX7HPABDAQ'
for files matching the pattern 'm/src/main/java/**/*' - excludes: null
[linux-jdk7] [TASKS] Found 1 files to scan for tasks
[linux-jdk7] [TASKS] Found 1 open tasks.
[linux-jdk7] Skipping warnings blame since pipelines do not have an SCM link.%n
[linux-jdk7] [TASKS] Computing warning deltas based on reference build #14
[Pipeline] [linux-jdk9] }
[linux-jdk9] [withMaven] invokerPublisher - Archive invoker results for Maven artifact MavenArtifact{org.apache.maven.plugins:maven-acr-plugin::3.1.1-SNAPSHOT(version:
3.1.1-SNAPSHOT, snapshot:false) } generated by PluginInvocation{org.apache.maven.plugins:maven-invoker-plugin:3.1.0@integration-test
 integration-test}: m/target/invoker-reports/*.xml
[linux-jdk9] performing MavenInvokerRecorder, reportsFilenamePattern:'**/m/target/invoker-reports/BUILD*.xml',
invokerBuildDir:'**/m/target/it'
[linux-jdk9] Found reports:[/home/jenkins/jenkins-slave/workspace/box_maven-acr-plugin_master-DR2AUSNQJ7C2CF74VSZZNIFXXYVCALCHKOCIXDLUR5AX7HPABDAQ/m/target/invoker-reports/BUILD-it-01.xml,
/home/jenkins/jenkins-slave/workspace/box_maven-acr-plugin_master-DR2AUSNQJ7C2CF74VSZZNIFXXYVCALCHKOCIXDLUR5AX7HPABDAQ/m/target/invoker-reports/BUILD-it-02.xml,
/home/jenkins/jenkins-slave/workspace/box_maven-acr-plugin_master-DR2AUSNQJ7C2CF74VSZZNIFXXYVCALCHKOCIXDLUR5AX7HPABDAQ/m/target/invoker-reports/BUILD-it-03.xml,
/home/jenkins/jenkins-slave/workspace/box_maven-acr-plugin_master-DR2AUSNQJ7C2CF74VSZZNIFXXYVCALCHKOCIXDLUR5AX7HPABDAQ/m/target/invoker-reports/BUILD-it-04.xml]
[linux-jdk9] Found logs:[/home/jenkins/jenkins-slave/workspace/box_maven-acr-plugin_master-DR2AUSNQJ7C2CF74VSZZNIFXXYVCALCHKOCIXDLUR5AX7HPABDAQ/m/target/it/it-01/build.log,
/home/jenkins/jenkins-slave/workspace/box_maven-acr-plugin_master-DR2AUSNQJ7C2CF74VSZZNIFXXYVCALCHKOCIXDLUR5AX7HPABDAQ/m/target/it/it-02/build.log,
/home/jenkins/jenkins-slave/workspace/box_maven-acr-plugin_master-DR2AUSNQJ7C2CF74VSZZNIFXXYVCALCHKOCIXDLUR5AX7HPABDAQ/m/target/it/it-03/build.log,
/home/jenkins/jenkins-slave/workspace/box_maven-acr-plugin_master-DR2AUSNQJ7C2CF74VSZZNIFXXYVCALCHKOCIXDLUR5AX7HPABDAQ/m/target/it/it-04/build.log]
[linux-jdk9] Finished parsing Maven Invoker results (found 4)
[linux-jdk9] [withMaven] junitPublisher - Archive test results for Maven artifact org.apache.maven.plugins:maven-acr-plugin:3.1.1-SNAPSHOT
generated by maven-surefire-plugin:test (default-test): m/target/surefire-reports/*.xml
[linux-jdk9] Recording test results
[linux-jdk9] None of the test reports contained any result
[Pipeline] [windows-jdk8] }
[Pipeline] [windows-jdk9] }
[Pipeline] [linux-jdk10] // node
[Pipeline] [windows-jdk10] // node
[Pipeline] [linux-jdk7] // withMaven
[Pipeline] [linux-jdk9] // withMaven
[Pipeline] [linux-jdk10] }
[Pipeline] [windows-jdk10] }
[Pipeline] [linux-jdk7] }
[Pipeline] [linux-jdk9] }
[Pipeline] [windows-jdk8] // stage
[Pipeline] [windows-jdk9] // stage
[Pipeline] [windows-jdk8] }
[Pipeline] [windows-jdk9] }
[Pipeline] [linux-jdk7] // stage
[Pipeline] [linux-jdk9] // stage
[Pipeline] [linux-jdk7] }
[Pipeline] [linux-jdk9] }
[Pipeline] [windows-jdk8] // node
[Pipeline] [windows-jdk9] // node
[Pipeline] [windows-jdk8] }
[windows-jdk8] Failed in branch windows-jdk8
[Pipeline] [windows-jdk9] }
[windows-jdk9] Failed in branch windows-jdk9
[Pipeline] [linux-jdk7] // node
[Pipeline] [linux-jdk9] // node
[Pipeline] [linux-jdk7] }
[Pipeline] [linux-jdk9] }
[Pipeline] // parallel
[Pipeline] stage
[Pipeline] { (Notifications)
[Pipeline] echo
Build result: FAILURE
[Pipeline] jiraIssueSelector
[Pipeline] jiraComment
Mime
  • Unnamed multipart/mixed (inline, None, 0 bytes)
View raw message