maven-notifications mailing list archives

Site index · List index
Message view « Date » · « Thread »
Top « Date » · « Thread »
From Apache Jenkins Server <jenk...@builds.apache.org>
Subject Build unstable in Jenkins: Maven TLP » maven-jxr » INFRA-16467 #2
Date Tue, 03 Jul 2018 23:51:28 GMT
See https://builds.apache.org/job/maven-box/job/maven-jxr/job/INFRA-16467/2/

Changes:

* Add jdkForMaven and mavenForJdk methods Use reqexp for version matching
* regex in switch/case are full match, not partial match
* Update JDKs
* Looks like the API has changed.
* Try to fix it.
* TLSv1.x being deactivated since June. So only TLSv1.2 is valid for
* Add asfMavenTlpPlgnBuild to run plugins with multiple Maven versions
* Add maven version to stageId
* Add removeFromCollection() due to RejectedAccessException on
* Scripts not permitted to use method java.util.Collection stream
* Pass 'first'
* Ensure at least minimum required Java version is used
* builds.a.o doesn't have a Maven 3.1.x
* Pass 'failfast'
* Pass 'failingFast'
* Set https.protocols for Java7
* Make failingFast global variable
* Introduce a shared taskContext to keep track of failures
* Make taskContext accessible for try-catch
* Ensure tasks on the same Jenkins instance don't block each others
* dir('m') was used twice
* Also run site goal
* Remove unused parameter
* Disable site plan, doesn't work with multimodules

All tests passed

Build log:
[...truncated 1.95 MB...]
[linux-jdk8] [INFO]           new-site-config/pom.xml .......................... SUCCESS (10.5
s)
[linux-jdk8] [INFO] -------------------------------------------------
[linux-jdk8] [INFO] Build Summary:
[linux-jdk8] [INFO]   Passed: 4, Failed: 0, Errors: 0, Skipped: 0
[linux-jdk8] [INFO] -------------------------------------------------
[linux-jdk8] [INFO] 
[linux-jdk8] [INFO] --- maven-checkstyle-plugin:3.0.0:check (checkstyle-check) @ maven-jxr-plugin
---
[linux-jdk10] [INFO] 
[linux-jdk10] [INFO] --- maven-enforcer-plugin:1.4.1:enforce (ban-known-bad-maven-versions)
@ maven-jxr-plugin ---
[linux-jdk10] [INFO] 
[linux-jdk10] [INFO] --- apache-rat-plugin:0.12:check (rat-check) @ maven-jxr-plugin ---
[linux-jdk10] [INFO] Enabled default license matchers.
[linux-jdk10] [INFO] Will parse SCM ignores for exclusions...
[linux-jdk10] [INFO] Finished adding exclusions from SCM ignore files.
[linux-jdk10] [INFO] 61 implicit excludes (use -debug for more details).
[linux-jdk10] [INFO] Exclude: src/test/resources/unit/default-configuration/javadoc-files/apidocs/package-list
[linux-jdk10] [INFO] Exclude: .repository/**
[linux-jdk10] [INFO] Exclude: .maven/spy.log
[linux-jdk10] [INFO] Exclude: dependency-reduced-pom.xml
[linux-jdk10] [INFO] Exclude: .java-version
[linux-jdk10] [INFO] 128 resources included (use -debug for more details)
[linux-jdk10] [INFO] Rat check: Summary over all files. Unapproved: 0, unknown: 0, generated:
0, approved: 107 licenses.
[linux-jdk10] [INFO] 
[linux-jdk10] [INFO] --- maven-plugin-plugin:3.5.1:helpmojo (generated-helpmojo) @ maven-jxr-plugin
---
[linux-jdk10] [INFO] Downloading from central: https://repo.maven.apache.org/maven2/org/ow2/asm/asm/6.0_ALPHA/asm-6.0_ALPHA.pom
[linux-jdk10] [INFO] Downloaded from central: https://repo.maven.apache.org/maven2/org/ow2/asm/asm/6.0_ALPHA/asm-6.0_ALPHA.pom
(1.9 kB at 102 kB/s)
[linux-jdk10] [INFO] Downloading from central: https://repo.maven.apache.org/maven2/org/ow2/asm/asm-parent/6.0_ALPHA/asm-parent-6.0_ALPHA.pom
[linux-jdk10] [INFO] Downloaded from central: https://repo.maven.apache.org/maven2/org/ow2/asm/asm-parent/6.0_ALPHA/asm-parent-6.0_ALPHA.pom
(5.5 kB at 323 kB/s)
[linux-jdk10] [INFO] Downloading from central: https://repo.maven.apache.org/maven2/org/ow2/asm/asm-commons/6.0_ALPHA/asm-commons-6.0_ALPHA.pom
[linux-jdk10] [INFO] Downloaded from central: https://repo.maven.apache.org/maven2/org/ow2/asm/asm-commons/6.0_ALPHA/asm-commons-6.0_ALPHA.pom
(2.1 kB at 123 kB/s)
[linux-jdk10] [INFO] Downloading from central: https://repo.maven.apache.org/maven2/org/ow2/asm/asm-tree/6.0_ALPHA/asm-tree-6.0_ALPHA.pom
[linux-jdk10] [INFO] Downloaded from central: https://repo.maven.apache.org/maven2/org/ow2/asm/asm-tree/6.0_ALPHA/asm-tree-6.0_ALPHA.pom
(2.1 kB at 123 kB/s)
[linux-jdk10] [INFO] Downloading from central: https://repo.maven.apache.org/maven2/org/ow2/asm/asm/6.0_ALPHA/asm-6.0_ALPHA.jar
[linux-jdk10] [INFO] Downloading from central: https://repo.maven.apache.org/maven2/org/ow2/asm/asm-commons/6.0_ALPHA/asm-commons-6.0_ALPHA.jar
[linux-jdk10] [INFO] Downloading from central: https://repo.maven.apache.org/maven2/org/ow2/asm/asm-tree/6.0_ALPHA/asm-tree-6.0_ALPHA.jar
[linux-jdk10] [INFO] Downloaded from central: https://repo.maven.apache.org/maven2/org/ow2/asm/asm/6.0_ALPHA/asm-6.0_ALPHA.jar
(56 kB at 1.5 MB/s)
[linux-jdk10] [INFO] Downloaded from central: https://repo.maven.apache.org/maven2/org/ow2/asm/asm-tree/6.0_ALPHA/asm-tree-6.0_ALPHA.jar
(32 kB at 657 kB/s)
[linux-jdk10] [INFO] Downloaded from central: https://repo.maven.apache.org/maven2/org/ow2/asm/asm-commons/6.0_ALPHA/asm-commons-6.0_ALPHA.jar
(49 kB at 837 kB/s)
[linux-jdk8] [INFO] ------------------------------------------------------------------------
[linux-jdk8] [INFO] Reactor Summary:
[linux-jdk8] [INFO] 
[linux-jdk8] [INFO] Maven JXR Parent ................................... SUCCESS [ 14.022
s]
[linux-jdk8] [INFO] Maven JXR .......................................... SUCCESS [  5.570
s]
[linux-jdk8] [INFO] Maven JXR Plugin ................................... SUCCESS [01:06 min]
[linux-jdk8] [INFO] ------------------------------------------------------------------------
[linux-jdk8] [INFO] BUILD SUCCESS
[linux-jdk8] [INFO] ------------------------------------------------------------------------
[linux-jdk8] [INFO] Total time: 01:27 min
[linux-jdk8] [INFO] Finished at: 2018-07-03T23:50:41Z
[linux-jdk8] [INFO] Final Memory: 65M/2791M
[linux-jdk8] [INFO] ------------------------------------------------------------------------
[linux-jdk8] [INFO] [jenkins-event-spy] Generated /home/jenkins/jenkins-slave/workspace/n-box_maven-jxr_INFRA-16467-I2AMGGYLR272SNDX3B5GZSMGQOG37K77KQWR7XAK4UOEJSCXYROQ@tmp/withMavenacb198d5/maven-spy-20180703-234914-177573504870319381043.log
[linux-jdk10] [INFO] Using 'UTF-8' encoding to read mojo source files.
[linux-jdk10] [INFO] java-javadoc mojo extractor found 0 mojo descriptor.
[linux-jdk10] [INFO] java-annotations mojo extractor found 0 mojo descriptor.
[linux-jdk10] [INFO] 
[linux-jdk10] [INFO] --- maven-remote-resources-plugin:1.5:process (process-resource-bundles)
@ maven-jxr-plugin ---
[linux-jdk10] [INFO] 
[linux-jdk10] [INFO] --- maven-resources-plugin:3.0.2:resources (default-resources) @ maven-jxr-plugin
---
[linux-jdk10] [INFO] Using 'UTF-8' encoding to copy filtered resources.
[linux-jdk10] [INFO] Copying 7 resources
[linux-jdk10] [INFO] Copying 3 resources
[linux-jdk10] [INFO] 
[linux-jdk10] [INFO] --- maven-compiler-plugin:3.7.0:compile (default-compile) @ maven-jxr-plugin
---
[linux-jdk10] [INFO] Changes detected - recompiling the module!
[linux-jdk10] [INFO] Compiling 8 source files to /home/jenkins/jenkins-slave/workspace/n-box_maven-jxr_INFRA-16467-I2AMGGYLR272SNDX3B5GZSMGQOG37K77KQWR7XAK4UOEJSCXYROQ/m/maven-jxr-plugin/target/classes
[linux-jdk10] [INFO] /home/jenkins/jenkins-slave/workspace/n-box_maven-jxr_INFRA-16467-I2AMGGYLR272SNDX3B5GZSMGQOG37K77KQWR7XAK4UOEJSCXYROQ/m/maven-jxr-plugin/src/main/java/org/apache/maven/plugin/jxr/JxrReportUtil.java:
/home/jenkins/jenkins-slave/workspace/n-box_maven-jxr_INFRA-16467-I2AMGGYLR272SNDX3B5GZSMGQOG37K77KQWR7XAK4UOEJSCXYROQ/m/maven-jxr-plugin/src/main/java/org/apache/maven/plugin/jxr/JxrReportUtil.java
uses or overrides a deprecated API.
[linux-jdk10] [INFO] /home/jenkins/jenkins-slave/workspace/n-box_maven-jxr_INFRA-16467-I2AMGGYLR272SNDX3B5GZSMGQOG37K77KQWR7XAK4UOEJSCXYROQ/m/maven-jxr-plugin/src/main/java/org/apache/maven/plugin/jxr/JxrReportUtil.java:
Recompile with -Xlint:deprecation for details.
[linux-jdk10] [INFO] /home/jenkins/jenkins-slave/workspace/n-box_maven-jxr_INFRA-16467-I2AMGGYLR272SNDX3B5GZSMGQOG37K77KQWR7XAK4UOEJSCXYROQ/m/maven-jxr-plugin/src/main/java/org/apache/maven/plugin/jxr/AbstractJxrReport.java:
Some input files use unchecked or unsafe operations.
[linux-jdk10] [INFO] /home/jenkins/jenkins-slave/workspace/n-box_maven-jxr_INFRA-16467-I2AMGGYLR272SNDX3B5GZSMGQOG37K77KQWR7XAK4UOEJSCXYROQ/m/maven-jxr-plugin/src/main/java/org/apache/maven/plugin/jxr/AbstractJxrReport.java:
Recompile with -Xlint:unchecked for details.
[linux-jdk10] [INFO] 
[linux-jdk10] [INFO] --- maven-plugin-plugin:3.5.1:descriptor (default-descriptor) @ maven-jxr-plugin
---
[linux-jdk10] [INFO] Using 'UTF-8' encoding to read mojo source files.
[linux-jdk10] [INFO] java-javadoc mojo extractor found 0 mojo descriptor.
[linux-jdk10] [INFO] java-annotations mojo extractor found 5 mojo descriptors.
[linux-jdk10] [INFO] 
[linux-jdk10] [INFO] --- maven-plugin-plugin:3.5.1:descriptor (mojo-descriptor) @ maven-jxr-plugin
---
[linux-jdk10] [INFO] Using 'UTF-8' encoding to read mojo source files.
[linux-jdk10] [INFO] java-javadoc mojo extractor found 0 mojo descriptor.
[linux-jdk10] [INFO] java-annotations mojo extractor found 5 mojo descriptors.
[linux-jdk10] [INFO] 
[linux-jdk10] [INFO] --- maven-resources-plugin:3.0.2:testResources (default-testResources)
@ maven-jxr-plugin ---
[linux-jdk10] [INFO] Using 'UTF-8' encoding to copy filtered resources.
[linux-jdk10] [INFO] Copying 52 resources
[linux-jdk10] [INFO] Copying 3 resources
[linux-jdk10] [INFO] 
[linux-jdk10] [INFO] --- maven-compiler-plugin:3.7.0:testCompile (default-testCompile) @ maven-jxr-plugin
---
[linux-jdk10] [INFO] Changes detected - recompiling the module!
[linux-jdk10] [INFO] Compiling 14 source files to /home/jenkins/jenkins-slave/workspace/n-box_maven-jxr_INFRA-16467-I2AMGGYLR272SNDX3B5GZSMGQOG37K77KQWR7XAK4UOEJSCXYROQ/m/maven-jxr-plugin/target/test-classes
[linux-jdk10] [INFO] /home/jenkins/jenkins-slave/workspace/n-box_maven-jxr_INFRA-16467-I2AMGGYLR272SNDX3B5GZSMGQOG37K77KQWR7XAK4UOEJSCXYROQ/m/maven-jxr-plugin/src/test/java/org/apache/maven/plugin/jxr/stubs/IncludeConfigurationMavenProjectStub.java:
Some input files use unchecked or unsafe operations.
[linux-jdk10] [INFO] /home/jenkins/jenkins-slave/workspace/n-box_maven-jxr_INFRA-16467-I2AMGGYLR272SNDX3B5GZSMGQOG37K77KQWR7XAK4UOEJSCXYROQ/m/maven-jxr-plugin/src/test/java/org/apache/maven/plugin/jxr/stubs/IncludeConfigurationMavenProjectStub.java:
Recompile with -Xlint:unchecked for details.
[linux-jdk10] [INFO] 
[linux-jdk10] [INFO] --- maven-surefire-plugin:2.21.0:test (default-test) @ maven-jxr-plugin
---
[linux-jdk10] [INFO] 
[linux-jdk10] [INFO] -------------------------------------------------------
[linux-jdk10] [INFO]  T E S T S
[linux-jdk10] [INFO] -------------------------------------------------------
[linux-jdk10] [INFO] Running org.apache.maven.plugin.jxr.JxrTestReportTest
[Pipeline] [linux-jdk9] }
[linux-jdk9] [withMaven] invokerPublisher - Archive invoker results for Maven artifact MavenArtifact{org.apache.maven.plugins:maven-jxr-plugin::2.6-SNAPSHOT(version:
2.6-SNAPSHOT, snapshot:false) } generated by PluginInvocation{org.apache.maven.plugins:maven-invoker-plugin:3.0.1@run
 integration-test}: m/maven-jxr-plugin/target/invoker-reports/*.xml
[linux-jdk9] performing MavenInvokerRecorder, reportsFilenamePattern:'**/m/maven-jxr-plugin/target/invoker-reports/BUILD*.xml',
invokerBuildDir:'**/m/maven-jxr-plugin/target/it'
[linux-jdk9] Found reports:[/home/jenkins/jenkins-slave/workspace/n-box_maven-jxr_INFRA-16467-I2AMGGYLR272SNDX3B5GZSMGQOG37K77KQWR7XAK4UOEJSCXYROQ/m/maven-jxr-plugin/target/invoker-reports/BUILD-aggregate.xml,
/home/jenkins/jenkins-slave/workspace/n-box_maven-jxr_INFRA-16467-I2AMGGYLR272SNDX3B5GZSMGQOG37K77KQWR7XAK4UOEJSCXYROQ/m/maven-jxr-plugin/target/invoker-reports/BUILD-mixed-plugin-report.xml,
/home/jenkins/jenkins-slave/workspace/n-box_maven-jxr_INFRA-16467-I2AMGGYLR272SNDX3B5GZSMGQOG37K77KQWR7XAK4UOEJSCXYROQ/m/maven-jxr-plugin/target/invoker-reports/BUILD-new-site-config.xml,
/home/jenkins/jenkins-slave/workspace/n-box_maven-jxr_INFRA-16467-I2AMGGYLR272SNDX3B5GZSMGQOG37K77KQWR7XAK4UOEJSCXYROQ/m/maven-jxr-plugin/target/invoker-reports/BUILD-simple-project.xml]
[linux-jdk9] Found logs:[/home/jenkins/jenkins-slave/workspace/n-box_maven-jxr_INFRA-16467-I2AMGGYLR272SNDX3B5GZSMGQOG37K77KQWR7XAK4UOEJSCXYROQ/m/maven-jxr-plugin/target/it/aggregate/build.log,
/home/jenkins/jenkins-slave/workspace/n-box_maven-jxr_INFRA-16467-I2AMGGYLR272SNDX3B5GZSMGQOG37K77KQWR7XAK4UOEJSCXYROQ/m/maven-jxr-plugin/target/it/mixed-plugin-report/build.log,
/home/jenkins/jenkins-slave/workspace/n-box_maven-jxr_INFRA-16467-I2AMGGYLR272SNDX3B5GZSMGQOG37K77KQWR7XAK4UOEJSCXYROQ/m/maven-jxr-plugin/target/it/new-site-config/build.log,
/home/jenkins/jenkins-slave/workspace/n-box_maven-jxr_INFRA-16467-I2AMGGYLR272SNDX3B5GZSMGQOG37K77KQWR7XAK4UOEJSCXYROQ/m/maven-jxr-plugin/target/it/simple-project/build.log]
[linux-jdk9] Finished parsing Maven Invoker results (found 4)
[linux-jdk9] [withMaven] junitPublisher - Archive test results for Maven artifact org.apache.maven:maven-jxr:2.6-SNAPSHOT
generated by maven-surefire-plugin:test (default-test): m/maven-jxr/target/surefire-reports/*.xml
[linux-jdk9] Recording test results
[linux-jdk9] [withMaven] junitPublisher - Archive test results for Maven artifact org.apache.maven.plugins:maven-jxr-plugin:2.6-SNAPSHOT
generated by maven-surefire-plugin:test (default-test): m/maven-jxr-plugin/target/surefire-reports/*.xml
[linux-jdk9] Recording test results
[Pipeline] [linux-jdk9] // withMaven
[Pipeline] [linux-jdk8] }
[Pipeline] [linux-jdk9] }
[Pipeline] [linux-jdk8] // dir
[Pipeline] [linux-jdk9] // stage
[linux-jdk10] [INFO] Tests run: 1, Failures: 0, Errors: 0, Skipped: 0, Time elapsed: 0.757
s - in org.apache.maven.plugin.jxr.JxrTestReportTest
[linux-jdk10] [INFO] Running org.apache.maven.plugin.jxr.JxrReportTest
[linux-jdk10] [ERROR] ResourceManager : unable to find resource 'temp/index.vm' in any resource
loader.
[linux-jdk10] [INFO] Tests run: 8, Failures: 0, Errors: 0, Skipped: 0, Time elapsed: 0.62
s - in org.apache.maven.plugin.jxr.JxrReportTest
[linux-jdk10] [INFO] 
[linux-jdk10] [INFO] Results:
[linux-jdk10] [INFO] 
[linux-jdk10] [INFO] Tests run: 9, Failures: 0, Errors: 0, Skipped: 0
[linux-jdk10] [INFO] 
[linux-jdk10] [INFO] 
[linux-jdk10] [INFO] --- maven-jar-plugin:3.0.2:jar (default-jar) @ maven-jxr-plugin ---
[linux-jdk10] [INFO] Building jar: /home/jenkins/jenkins-slave/workspace/n-box_maven-jxr_INFRA-16467-I2AMGGYLR272SNDX3B5GZSMGQOG37K77KQWR7XAK4UOEJSCXYROQ/m/maven-jxr-plugin/target/maven-jxr-plugin-2.6-SNAPSHOT.jar
[linux-jdk10] [INFO] 
[linux-jdk10] [INFO] --- maven-plugin-plugin:3.5.1:addPluginArtifactMetadata (default-addPluginArtifactMetadata)
@ maven-jxr-plugin ---
[linux-jdk10] [INFO] 
[linux-jdk10] [INFO] --- maven-site-plugin:3.7:attach-descriptor (attach-descriptor) @ maven-jxr-plugin
---
[linux-jdk10] [INFO] Skipping because packaging 'maven-plugin' is not pom.
[linux-jdk10] [INFO] 
[linux-jdk10] [INFO] --- maven-invoker-plugin:3.0.1:install (integration-test) @ maven-jxr-plugin
---
[linux-jdk10] [INFO] Installing /home/jenkins/jenkins-slave/workspace/n-box_maven-jxr_INFRA-16467-I2AMGGYLR272SNDX3B5GZSMGQOG37K77KQWR7XAK4UOEJSCXYROQ/m/pom.xml
to /home/jenkins/jenkins-slave/workspace/n-box_maven-jxr_INFRA-16467-I2AMGGYLR272SNDX3B5GZSMGQOG37K77KQWR7XAK4UOEJSCXYROQ/m/maven-jxr-plugin/target/local-repo/org/apache/maven/jxr/jxr/2.6-SNAPSHOT/jxr-2.6-SNAPSHOT.pom
[linux-jdk10] [INFO] Installing /home/jenkins/jenkins-slave/workspace/n-box_maven-jxr_INFRA-16467-I2AMGGYLR272SNDX3B5GZSMGQOG37K77KQWR7XAK4UOEJSCXYROQ/m/target/jxr-2.6-SNAPSHOT-site.xml
to /home/jenkins/jenkins-slave/workspace/n-box_maven-jxr_INFRA-16467-I2AMGGYLR272SNDX3B5GZSMGQOG37K77KQWR7XAK4UOEJSCXYROQ/m/maven-jxr-plugin/target/local-repo/org/apache/maven/jxr/jxr/2.6-SNAPSHOT/jxr-2.6-SNAPSHOT-site.xml
[linux-jdk10] [INFO] Installing /home/jenkins/jenkins-slave/workspace/n-box_maven-jxr_INFRA-16467-I2AMGGYLR272SNDX3B5GZSMGQOG37K77KQWR7XAK4UOEJSCXYROQ/m/maven-jxr/pom.xml
to /home/jenkins/jenkins-slave/workspace/n-box_maven-jxr_INFRA-16467-I2AMGGYLR272SNDX3B5GZSMGQOG37K77KQWR7XAK4UOEJSCXYROQ/m/maven-jxr-plugin/target/local-repo/org/apache/maven/maven-jxr/2.6-SNAPSHOT/maven-jxr-2.6-SNAPSHOT.pom
[linux-jdk10] [INFO] Installing /home/jenkins/jenkins-slave/workspace/n-box_maven-jxr_INFRA-16467-I2AMGGYLR272SNDX3B5GZSMGQOG37K77KQWR7XAK4UOEJSCXYROQ/m/maven-jxr/target/maven-jxr-2.6-SNAPSHOT.jar
to /home/jenkins/jenkins-slave/workspace/n-box_maven-jxr_INFRA-16467-I2AMGGYLR272SNDX3B5GZSMGQOG37K77KQWR7XAK4UOEJSCXYROQ/m/maven-jxr-plugin/target/local-repo/org/apache/maven/maven-jxr/2.6-SNAPSHOT/maven-jxr-2.6-SNAPSHOT.jar
[linux-jdk10] [INFO] Installing /home/jenkins/jenkins-slave/workspace/n-box_maven-jxr_INFRA-16467-I2AMGGYLR272SNDX3B5GZSMGQOG37K77KQWR7XAK4UOEJSCXYROQ/m/maven-jxr-plugin/pom.xml
to /home/jenkins/jenkins-slave/workspace/n-box_maven-jxr_INFRA-16467-I2AMGGYLR272SNDX3B5GZSMGQOG37K77KQWR7XAK4UOEJSCXYROQ/m/maven-jxr-plugin/target/local-repo/org/apache/maven/plugins/maven-jxr-plugin/2.6-SNAPSHOT/maven-jxr-plugin-2.6-SNAPSHOT.pom
[linux-jdk10] [INFO] Installing /home/jenkins/jenkins-slave/workspace/n-box_maven-jxr_INFRA-16467-I2AMGGYLR272SNDX3B5GZSMGQOG37K77KQWR7XAK4UOEJSCXYROQ/m/maven-jxr-plugin/target/maven-jxr-plugin-2.6-SNAPSHOT.jar
to /home/jenkins/jenkins-slave/workspace/n-box_maven-jxr_INFRA-16467-I2AMGGYLR272SNDX3B5GZSMGQOG37K77KQWR7XAK4UOEJSCXYROQ/m/maven-jxr-plugin/target/local-repo/org/apache/maven/plugins/maven-jxr-plugin/2.6-SNAPSHOT/maven-jxr-plugin-2.6-SNAPSHOT.jar
[linux-jdk10] [INFO] 
[linux-jdk10] [INFO] --- maven-invoker-plugin:3.0.1:run (integration-test) @ maven-jxr-plugin
---
[linux-jdk10] [INFO] Running Setup Jobs
[linux-jdk10] [INFO] Building: new-site-config/pom.xml
[Pipeline] [linux-jdk8] }
[linux-jdk8] [withMaven] invokerPublisher - Archive invoker results for Maven artifact MavenArtifact{org.apache.maven.plugins:maven-jxr-plugin::2.6-SNAPSHOT(version:
2.6-SNAPSHOT, snapshot:false) } generated by PluginInvocation{org.apache.maven.plugins:maven-invoker-plugin:3.0.1@run
 integration-test}: m/maven-jxr-plugin/target/invoker-reports/*.xml
[linux-jdk8] performing MavenInvokerRecorder, reportsFilenamePattern:'**/m/maven-jxr-plugin/target/invoker-reports/BUILD*.xml',
invokerBuildDir:'**/m/maven-jxr-plugin/target/it'
[linux-jdk8] Found reports:[/home/jenkins/jenkins-slave/workspace/n-box_maven-jxr_INFRA-16467-I2AMGGYLR272SNDX3B5GZSMGQOG37K77KQWR7XAK4UOEJSCXYROQ/m/maven-jxr-plugin/target/invoker-reports/BUILD-aggregate.xml,
/home/jenkins/jenkins-slave/workspace/n-box_maven-jxr_INFRA-16467-I2AMGGYLR272SNDX3B5GZSMGQOG37K77KQWR7XAK4UOEJSCXYROQ/m/maven-jxr-plugin/target/invoker-reports/BUILD-mixed-plugin-report.xml,
/home/jenkins/jenkins-slave/workspace/n-box_maven-jxr_INFRA-16467-I2AMGGYLR272SNDX3B5GZSMGQOG37K77KQWR7XAK4UOEJSCXYROQ/m/maven-jxr-plugin/target/invoker-reports/BUILD-new-site-config.xml,
/home/jenkins/jenkins-slave/workspace/n-box_maven-jxr_INFRA-16467-I2AMGGYLR272SNDX3B5GZSMGQOG37K77KQWR7XAK4UOEJSCXYROQ/m/maven-jxr-plugin/target/invoker-reports/BUILD-simple-project.xml]
[linux-jdk8] Found logs:[/home/jenkins/jenkins-slave/workspace/n-box_maven-jxr_INFRA-16467-I2AMGGYLR272SNDX3B5GZSMGQOG37K77KQWR7XAK4UOEJSCXYROQ/m/maven-jxr-plugin/target/it/aggregate/build.log,
/home/jenkins/jenkins-slave/workspace/n-box_maven-jxr_INFRA-16467-I2AMGGYLR272SNDX3B5GZSMGQOG37K77KQWR7XAK4UOEJSCXYROQ/m/maven-jxr-plugin/target/it/mixed-plugin-report/build.log,
/home/jenkins/jenkins-slave/workspace/n-box_maven-jxr_INFRA-16467-I2AMGGYLR272SNDX3B5GZSMGQOG37K77KQWR7XAK4UOEJSCXYROQ/m/maven-jxr-plugin/target/it/new-site-config/build.log,
/home/jenkins/jenkins-slave/workspace/n-box_maven-jxr_INFRA-16467-I2AMGGYLR272SNDX3B5GZSMGQOG37K77KQWR7XAK4UOEJSCXYROQ/m/maven-jxr-plugin/target/it/simple-project/build.log]
[linux-jdk8] Finished parsing Maven Invoker results (found 4)
[linux-jdk8] [withMaven] junitPublisher - Archive test results for Maven artifact org.apache.maven:maven-jxr:2.6-SNAPSHOT
generated by maven-surefire-plugin:test (default-test): m/maven-jxr/target/surefire-reports/*.xml
[linux-jdk8] Recording test results
[linux-jdk8] [withMaven] junitPublisher - Archive test results for Maven artifact org.apache.maven.plugins:maven-jxr-plugin:2.6-SNAPSHOT
generated by maven-surefire-plugin:test (default-test): m/maven-jxr-plugin/target/surefire-reports/*.xml
[linux-jdk8] Recording test results
[Pipeline] [linux-jdk9] }
[Pipeline] [linux-jdk8] // withMaven
[Pipeline] [linux-jdk9] // node
[Pipeline] [linux-jdk9] }
[Pipeline] [linux-jdk8] }
[Pipeline] [linux-jdk8] // stage
[Pipeline] [linux-jdk8] }
[Pipeline] [linux-jdk8] // node
[Pipeline] [linux-jdk8] }
[linux-jdk10] [INFO] run post-build script verify.groovy
[linux-jdk10] WARNING: An illegal reflective access operation has occurred
[linux-jdk10] WARNING: Illegal reflective access by org.codehaus.groovy.reflection.CachedClass
(file:/home/jenkins/jenkins-slave/workspace/n-box_maven-jxr_INFRA-16467-I2AMGGYLR272SNDX3B5GZSMGQOG37K77KQWR7XAK4UOEJSCXYROQ/.repository/org/codehaus/groovy/groovy-all/2.4.8/groovy-all-2.4.8.jar)
to method java.lang.Object.finalize()
[linux-jdk10] WARNING: Please consider reporting this to the maintainers of org.codehaus.groovy.reflection.CachedClass
[linux-jdk10] WARNING: Use --illegal-access=warn to enable warnings of further illegal reflective
access operations
[linux-jdk10] WARNING: All illegal access operations will be denied in a future release
[linux-jdk10] [INFO]           new-site-config/pom.xml .......................... FAILED (9.6
s)
[linux-jdk10] [INFO]   The post-build script did not succeed. assert new File( basedir, 'target/site'
).exists()
[linux-jdk10]        |         |                        |
[linux-jdk10]        |         |                        false
[linux-jdk10]        |         /home/jenkins/jenkins-slave/workspace/n-box_maven-jxr_INFRA-16467-I2AMGGYLR272SNDX3B5GZSMGQOG37K77KQWR7XAK4UOEJSCXYROQ/m/maven-jxr-plugin/target/it/new-site-config
[linux-jdk10]        /home/jenkins/jenkins-slave/workspace/n-box_maven-jxr_INFRA-16467-I2AMGGYLR272SNDX3B5GZSMGQOG37K77KQWR7XAK4UOEJSCXYROQ/m/maven-jxr-plugin/target/it/new-site-config/target/site
[linux-jdk10] [INFO] Building: simple-project/pom.xml
[linux-jdk10] [INFO] run post-build script verify.groovy
[linux-jdk10] [INFO]           simple-project/pom.xml ........................... FAILED (5.1
s)
[linux-jdk10] [INFO]   The post-build script did not succeed. assert new File( basedir, 'target/site'
).exists()
[linux-jdk10]        |         |                        |
[linux-jdk10]        |         |                        false
[linux-jdk10]        |         /home/jenkins/jenkins-slave/workspace/n-box_maven-jxr_INFRA-16467-I2AMGGYLR272SNDX3B5GZSMGQOG37K77KQWR7XAK4UOEJSCXYROQ/m/maven-jxr-plugin/target/it/simple-project
[linux-jdk10]        /home/jenkins/jenkins-slave/workspace/n-box_maven-jxr_INFRA-16467-I2AMGGYLR272SNDX3B5GZSMGQOG37K77KQWR7XAK4UOEJSCXYROQ/m/maven-jxr-plugin/target/it/simple-project/target/site
[linux-jdk10] [INFO] Building: mixed-plugin-report/pom.xml
[linux-jdk10] [INFO] run post-build script verify.groovy
[linux-jdk10] [INFO]           mixed-plugin-report/pom.xml ...................... FAILED (6.7
s)
[linux-jdk10] [INFO]   The post-build script did not succeed. assert new File( basedir, 'target/site'
).exists()
[linux-jdk10]        |         |                        |
[linux-jdk10]        |         |                        false
[linux-jdk10]        |         /home/jenkins/jenkins-slave/workspace/n-box_maven-jxr_INFRA-16467-I2AMGGYLR272SNDX3B5GZSMGQOG37K77KQWR7XAK4UOEJSCXYROQ/m/maven-jxr-plugin/target/it/mixed-plugin-report
[linux-jdk10]        /home/jenkins/jenkins-slave/workspace/n-box_maven-jxr_INFRA-16467-I2AMGGYLR272SNDX3B5GZSMGQOG37K77KQWR7XAK4UOEJSCXYROQ/m/maven-jxr-plugin/target/it/mixed-plugin-report/target/site
[linux-jdk10] [INFO] Building: aggregate/pom.xml
[linux-jdk10] [INFO] run post-build script verify.groovy
[linux-jdk10] [INFO]           aggregate/pom.xml ................................ FAILED (5.6
s)
[linux-jdk10] [INFO]   The post-build script did not succeed. assert new File( basedir, 'target/site'
).exists()
[linux-jdk10]        |         |                        |
[linux-jdk10]        |         |                        false
[linux-jdk10]        |         /home/jenkins/jenkins-slave/workspace/n-box_maven-jxr_INFRA-16467-I2AMGGYLR272SNDX3B5GZSMGQOG37K77KQWR7XAK4UOEJSCXYROQ/m/maven-jxr-plugin/target/it/aggregate
[linux-jdk10]        /home/jenkins/jenkins-slave/workspace/n-box_maven-jxr_INFRA-16467-I2AMGGYLR272SNDX3B5GZSMGQOG37K77KQWR7XAK4UOEJSCXYROQ/m/maven-jxr-plugin/target/it/aggregate/target/site
[linux-jdk10] [INFO] -------------------------------------------------
[linux-jdk10] [INFO] Build Summary:
[linux-jdk10] [INFO]   Passed: 0, Failed: 4, Errors: 0, Skipped: 0
[linux-jdk10] [INFO] -------------------------------------------------
[linux-jdk10] [WARNING] The following builds failed:
[linux-jdk10] [WARNING] *  new-site-config/pom.xml
[linux-jdk10] [WARNING] *  simple-project/pom.xml
[linux-jdk10] [WARNING] *  mixed-plugin-report/pom.xml
[linux-jdk10] [WARNING] *  aggregate/pom.xml
[linux-jdk10] [INFO] -------------------------------------------------
[linux-jdk10] [WARNING] Ignoring that 4 builds failed.
[linux-jdk10] [INFO] 
[linux-jdk10] [INFO] --- maven-checkstyle-plugin:3.0.0:check (checkstyle-check) @ maven-jxr-plugin
---
[linux-jdk10] [INFO] ------------------------------------------------------------------------
[linux-jdk10] [INFO] Reactor Summary:
[linux-jdk10] [INFO] 
[linux-jdk10] [INFO] Maven JXR Parent ................................... SUCCESS [  5.738
s]
[linux-jdk10] [INFO] Maven JXR .......................................... SUCCESS [  5.285
s]
[linux-jdk10] [INFO] Maven JXR Plugin ................................... SUCCESS [ 37.918
s]
[linux-jdk10] [INFO] ------------------------------------------------------------------------
[linux-jdk10] [INFO] BUILD SUCCESS
[linux-jdk10] [INFO] ------------------------------------------------------------------------
[linux-jdk10] [INFO] Total time: 49.324 s
[linux-jdk10] [INFO] Finished at: 2018-07-03T23:51:17Z
[linux-jdk10] [INFO] Final Memory: 47M/216M
[linux-jdk10] [INFO] ------------------------------------------------------------------------
[linux-jdk10] [INFO] [jenkins-event-spy] Generated /home/jenkins/jenkins-slave/workspace/n-box_maven-jxr_INFRA-16467-I2AMGGYLR272SNDX3B5GZSMGQOG37K77KQWR7XAK4UOEJSCXYROQ@tmp/withMavene3653f2a/maven-spy-20180703-235028-20711168952904023751986.log
[Pipeline] [linux-jdk10] }
[Pipeline] [linux-jdk10] // dir
[Pipeline] [linux-jdk10] }
[linux-jdk10] [withMaven] invokerPublisher - Archive invoker results for Maven artifact MavenArtifact{org.apache.maven.plugins:maven-jxr-plugin::2.6-SNAPSHOT(version:
2.6-SNAPSHOT, snapshot:false) } generated by PluginInvocation{org.apache.maven.plugins:maven-invoker-plugin:3.0.1@run
 integration-test}: m/maven-jxr-plugin/target/invoker-reports/*.xml
[linux-jdk10] performing MavenInvokerRecorder, reportsFilenamePattern:'**/m/maven-jxr-plugin/target/invoker-reports/BUILD*.xml',
invokerBuildDir:'**/m/maven-jxr-plugin/target/it'
[linux-jdk10] Found reports:[/home/jenkins/jenkins-slave/workspace/n-box_maven-jxr_INFRA-16467-I2AMGGYLR272SNDX3B5GZSMGQOG37K77KQWR7XAK4UOEJSCXYROQ/m/maven-jxr-plugin/target/invoker-reports/BUILD-aggregate.xml,
/home/jenkins/jenkins-slave/workspace/n-box_maven-jxr_INFRA-16467-I2AMGGYLR272SNDX3B5GZSMGQOG37K77KQWR7XAK4UOEJSCXYROQ/m/maven-jxr-plugin/target/invoker-reports/BUILD-mixed-plugin-report.xml,
/home/jenkins/jenkins-slave/workspace/n-box_maven-jxr_INFRA-16467-I2AMGGYLR272SNDX3B5GZSMGQOG37K77KQWR7XAK4UOEJSCXYROQ/m/maven-jxr-plugin/target/invoker-reports/BUILD-new-site-config.xml,
/home/jenkins/jenkins-slave/workspace/n-box_maven-jxr_INFRA-16467-I2AMGGYLR272SNDX3B5GZSMGQOG37K77KQWR7XAK4UOEJSCXYROQ/m/maven-jxr-plugin/target/invoker-reports/BUILD-simple-project.xml]
[linux-jdk10] Found logs:[/home/jenkins/jenkins-slave/workspace/n-box_maven-jxr_INFRA-16467-I2AMGGYLR272SNDX3B5GZSMGQOG37K77KQWR7XAK4UOEJSCXYROQ/m/maven-jxr-plugin/target/it/aggregate/build.log,
/home/jenkins/jenkins-slave/workspace/n-box_maven-jxr_INFRA-16467-I2AMGGYLR272SNDX3B5GZSMGQOG37K77KQWR7XAK4UOEJSCXYROQ/m/maven-jxr-plugin/target/it/mixed-plugin-report/build.log,
/home/jenkins/jenkins-slave/workspace/n-box_maven-jxr_INFRA-16467-I2AMGGYLR272SNDX3B5GZSMGQOG37K77KQWR7XAK4UOEJSCXYROQ/m/maven-jxr-plugin/target/it/new-site-config/build.log,
/home/jenkins/jenkins-slave/workspace/n-box_maven-jxr_INFRA-16467-I2AMGGYLR272SNDX3B5GZSMGQOG37K77KQWR7XAK4UOEJSCXYROQ/m/maven-jxr-plugin/target/it/simple-project/build.log]
[linux-jdk10] Finished parsing Maven Invoker results (found 4)
[linux-jdk10] [withMaven] junitPublisher - Archive test results for Maven artifact org.apache.maven:maven-jxr:2.6-SNAPSHOT
generated by maven-surefire-plugin:test (default-test): m/maven-jxr/target/surefire-reports/*.xml
[linux-jdk10] Recording test results
[linux-jdk10] [withMaven] junitPublisher - Archive test results for Maven artifact org.apache.maven.plugins:maven-jxr-plugin:2.6-SNAPSHOT
generated by maven-surefire-plugin:test (default-test): m/maven-jxr-plugin/target/surefire-reports/*.xml
[linux-jdk10] Recording test results
[Pipeline] [linux-jdk10] // withMaven
[Pipeline] [linux-jdk10] }
[Pipeline] [linux-jdk10] // stage
[Pipeline] [linux-jdk10] }
[Pipeline] [linux-jdk10] // node
[Pipeline] [linux-jdk10] }
[Pipeline] // parallel
[Pipeline] stage
[Pipeline] { (Notifications)
[Pipeline] echo
Build result: UNSTABLE
[Pipeline] jiraIssueSelector
[Pipeline] emailext
Mime
  • Unnamed multipart/mixed (inline, None, 0 bytes)
View raw message