maven-notifications mailing list archives

Site index · List index
Message view « Date » · « Thread »
Top « Date » · « Thread »
From Apache Jenkins Server <jenk...@builds.apache.org>
Subject Build failed in Jenkins: Maven TLP » maven-javadoc-plugin » MJAVADOC-516 #5
Date Mon, 16 Jul 2018 04:32:22 GMT
See https://builds.apache.org/job/maven-box/job/maven-javadoc-plugin/job/MJAVADOC-516/5/

Changes:

* Add jenkinsEnv#nodeSelection to globally finetune node selection
* Try another expression
* INFRA-16749, INFRA-16768  - Trying to keep workspace clean
* INFRA-16749, INFRA-16768  - Followup
* INFRA-16749, INFRA-16768  - Followup temporarily failFast = false.
* Used the wrong comment style.
* Exclude ubuntu-eu2 due to lack of disk space
* Apply jenkinsEnv.nodeSelection

15 tests failed.
FAILED:  org.apache.maven.plugins.javadoc.FixJavadocMojoTest.testFix

Error Message:
Error when invoking Maven, consult the invoker log file: /home/jenkins/jenkins-slave/workspace/javadoc-plugin_MJAVADOC-516-Z27AS7O3YE3KP4HN2X3EMP56QPDDJR4P5EBKM2B5MKLXDNLXZ3DA/m/target/invoker/FixJavadocMojoTest959162518.txt

Stack Trace:
org.apache.maven.shared.invoker.MavenInvocationException: Error when invoking Maven, consult the invoker log file: /home/jenkins/jenkins-slave/workspace/javadoc-plugin_MJAVADOC-516-Z27AS7O3YE3KP4HN2X3EMP56QPDDJR4P5EBKM2B5MKLXDNLXZ3DA/m/target/invoker/FixJavadocMojoTest959162518.txt
	at org.apache.maven.plugins.javadoc.FixJavadocMojoTest.invokeCompileGoal(FixJavadocMojoTest.java:662)
	at org.apache.maven.plugins.javadoc.FixJavadocMojoTest.executeMojoAndTest(FixJavadocMojoTest.java:619)
	at org.apache.maven.plugins.javadoc.FixJavadocMojoTest.testFix(FixJavadocMojoTest.java:141)


FAILED:  org.apache.maven.plugins.javadoc.FixJavadocMojoTest.testFixJdk5

Error Message:
Error when invoking Maven, consult the invoker log file: /home/jenkins/jenkins-slave/workspace/javadoc-plugin_MJAVADOC-516-Z27AS7O3YE3KP4HN2X3EMP56QPDDJR4P5EBKM2B5MKLXDNLXZ3DA/m/target/invoker/FixJavadocMojoTest2001860446.txt

Stack Trace:
org.apache.maven.shared.invoker.MavenInvocationException: Error when invoking Maven, consult the invoker log file: /home/jenkins/jenkins-slave/workspace/javadoc-plugin_MJAVADOC-516-Z27AS7O3YE3KP4HN2X3EMP56QPDDJR4P5EBKM2B5MKLXDNLXZ3DA/m/target/invoker/FixJavadocMojoTest2001860446.txt
	at org.apache.maven.plugins.javadoc.FixJavadocMojoTest.invokeCompileGoal(FixJavadocMojoTest.java:662)
	at org.apache.maven.plugins.javadoc.FixJavadocMojoTest.executeMojoAndTest(FixJavadocMojoTest.java:619)
	at org.apache.maven.plugins.javadoc.FixJavadocMojoTest.testFixJdk5(FixJavadocMojoTest.java:159)


FAILED:  org.apache.maven.plugins.javadoc.FixJavadocMojoTest.testFixJdk6

Error Message:
Error when invoking Maven, consult the invoker log file: /home/jenkins/jenkins-slave/workspace/javadoc-plugin_MJAVADOC-516-Z27AS7O3YE3KP4HN2X3EMP56QPDDJR4P5EBKM2B5MKLXDNLXZ3DA/m/target/invoker/FixJavadocMojoTest476889175.txt

Stack Trace:
org.apache.maven.shared.invoker.MavenInvocationException: Error when invoking Maven, consult the invoker log file: /home/jenkins/jenkins-slave/workspace/javadoc-plugin_MJAVADOC-516-Z27AS7O3YE3KP4HN2X3EMP56QPDDJR4P5EBKM2B5MKLXDNLXZ3DA/m/target/invoker/FixJavadocMojoTest476889175.txt
	at org.apache.maven.plugins.javadoc.FixJavadocMojoTest.invokeCompileGoal(FixJavadocMojoTest.java:662)
	at org.apache.maven.plugins.javadoc.FixJavadocMojoTest.executeMojoAndTest(FixJavadocMojoTest.java:619)
	at org.apache.maven.plugins.javadoc.FixJavadocMojoTest.testFixJdk6(FixJavadocMojoTest.java:170)


FAILED:  org.apache.maven.plugins.javadoc.FixJavadocMojoTest.testFix

Error Message:
Error when invoking Maven, consult the invoker log file: f:\jenkins\jenkins-slave\workspace\javadoc-plugin_MJAVADOC-516-Z27AS7O3YE3KP4HN2X3EMP56QPDDJR4P5EBKM2B5MKLXDNLXZ3DA\m\target\invoker\FixJavadocMojoTest1715150948.txt

Stack Trace:
org.apache.maven.shared.invoker.MavenInvocationException: Error when invoking Maven, consult the invoker log file: f:\jenkins\jenkins-slave\workspace\javadoc-plugin_MJAVADOC-516-Z27AS7O3YE3KP4HN2X3EMP56QPDDJR4P5EBKM2B5MKLXDNLXZ3DA\m\target\invoker\FixJavadocMojoTest1715150948.txt
	at org.apache.maven.plugins.javadoc.FixJavadocMojoTest.invokeCompileGoal(FixJavadocMojoTest.java:662)
	at org.apache.maven.plugins.javadoc.FixJavadocMojoTest.executeMojoAndTest(FixJavadocMojoTest.java:619)
	at org.apache.maven.plugins.javadoc.FixJavadocMojoTest.testFix(FixJavadocMojoTest.java:141)


FAILED:  org.apache.maven.plugins.javadoc.FixJavadocMojoTest.testFixJdk5

Error Message:
Error when invoking Maven, consult the invoker log file: f:\jenkins\jenkins-slave\workspace\javadoc-plugin_MJAVADOC-516-Z27AS7O3YE3KP4HN2X3EMP56QPDDJR4P5EBKM2B5MKLXDNLXZ3DA\m\target\invoker\FixJavadocMojoTest1893217463.txt

Stack Trace:
org.apache.maven.shared.invoker.MavenInvocationException: Error when invoking Maven, consult the invoker log file: f:\jenkins\jenkins-slave\workspace\javadoc-plugin_MJAVADOC-516-Z27AS7O3YE3KP4HN2X3EMP56QPDDJR4P5EBKM2B5MKLXDNLXZ3DA\m\target\invoker\FixJavadocMojoTest1893217463.txt
	at org.apache.maven.plugins.javadoc.FixJavadocMojoTest.invokeCompileGoal(FixJavadocMojoTest.java:662)
	at org.apache.maven.plugins.javadoc.FixJavadocMojoTest.executeMojoAndTest(FixJavadocMojoTest.java:619)
	at org.apache.maven.plugins.javadoc.FixJavadocMojoTest.testFixJdk5(FixJavadocMojoTest.java:159)


FAILED:  org.apache.maven.plugins.javadoc.FixJavadocMojoTest.testFixJdk6

Error Message:
Error when invoking Maven, consult the invoker log file: f:\jenkins\jenkins-slave\workspace\javadoc-plugin_MJAVADOC-516-Z27AS7O3YE3KP4HN2X3EMP56QPDDJR4P5EBKM2B5MKLXDNLXZ3DA\m\target\invoker\FixJavadocMojoTest1121302007.txt

Stack Trace:
org.apache.maven.shared.invoker.MavenInvocationException: Error when invoking Maven, consult the invoker log file: f:\jenkins\jenkins-slave\workspace\javadoc-plugin_MJAVADOC-516-Z27AS7O3YE3KP4HN2X3EMP56QPDDJR4P5EBKM2B5MKLXDNLXZ3DA\m\target\invoker\FixJavadocMojoTest1121302007.txt
	at org.apache.maven.plugins.javadoc.FixJavadocMojoTest.invokeCompileGoal(FixJavadocMojoTest.java:662)
	at org.apache.maven.plugins.javadoc.FixJavadocMojoTest.executeMojoAndTest(FixJavadocMojoTest.java:619)
	at org.apache.maven.plugins.javadoc.FixJavadocMojoTest.testFixJdk6(FixJavadocMojoTest.java:170)


FAILED:  org.apache.maven.plugins.javadoc.FixJavadocMojoTest.testFix

Error Message:
null

Stack Trace:
java.lang.NullPointerException
	at org.apache.maven.plugins.javadoc.FixJavadocMojoTest.executeMojoAndTest(FixJavadocMojoTest.java:622)
	at org.apache.maven.plugins.javadoc.FixJavadocMojoTest.testFix(FixJavadocMojoTest.java:141)


FAILED:  org.apache.maven.plugins.javadoc.FixJavadocMojoTest.testRemoveUnknownExceptions

Error Message:
null

Stack Trace:
java.lang.NullPointerException
	at org.apache.maven.plugins.javadoc.FixJavadocMojoTest.testRemoveUnknownExceptions(FixJavadocMojoTest.java:576)


FAILED:  org.apache.maven.plugins.javadoc.JavadocReportTest.testTagletArtifacts

Error Message:
expected:<20> but was:<0>

Stack Trace:
junit.framework.AssertionFailedError: expected:<20> but was:<0>
	at org.apache.maven.plugins.javadoc.JavadocReportTest.testTagletArtifacts(JavadocReportTest.java:1044)


FAILED:  org.apache.maven.plugins.javadoc.JavadocReportTest.testTaglets

Error Message:
An error has occurred in Javadoc report generation: 
Exit code: 1 - Picked up JAVA_TOOL_OPTIONS: -Dmaven.ext.class.path="f:\jenkins\jenkins-slave\workspace\javadoc-plugin_MJAVADOC-516-Z27AS7O3YE3KP4HN2X3EMP56QPDDJR4P5EBKM2B5MKLXDNLXZ3DA@tmp\withMaven254943ba\pipeline-maven-spy.jar" -Dorg.jenkinsci.plugins.pipeline.maven.reportsFolder="f:\jenkins\jenkins-slave\workspace\javadoc-plugin_MJAVADOC-516-Z27AS7O3YE3KP4HN2X3EMP56QPDDJR4P5EBKM2B5MKLXDNLXZ3DA@tmp\withMaven254943ba" 
javadoc: error - An internal exception has occurred. 
 (java.lang.NoClassDefFoundError: com/sun/tools/doclets/Taglet)
Please file a bug against the javadoc tool via the Java bug reporting page
(http://bugreport.java.com) after checking the Bug Database (http://bugs.java.com)
for duplicates. Include error messages and the following diagnostic in your report. Thank you.
java.lang.NoClassDefFoundError: com/sun/tools/doclets/Taglet
 at java.base/java.lang.ClassLoader.defineClass1(Native Method)
 at java.base/java.lang.ClassLoader.defineClass(ClassLoader.java:1009)
 at java.base/java.security.SecureClassLoader.defineClass(SecureClassLoader.java:174)
 at java.base/java.net.URLClassLoader.defineClass(URLClassLoader.java:545)
 at java.base/java.net.URLClassLoader.access$100(URLClassLoader.java:83)
 at java.base/java.net.URLClassLoader$1.run(URLClassLoader.java:453)
 at java.base/java.net.URLClassLoader$1.run(URLClassLoader.java:447)
 at java.base/java.security.AccessController.doPrivileged(Native Method)
 at java.base/java.net.URLClassLoader.findClass(URLClassLoader.java:446)
 at java.base/java.lang.ClassLoader.loadClass(ClassLoader.java:566)
 at java.base/java.lang.ClassLoader.loadClass(ClassLoader.java:499)
 at java.base/java.lang.ClassLoader.defineClass1(Native Method)
 at java.base/java.lang.ClassLoader.defineClass(ClassLoader.java:1009)
 at java.base/java.security.SecureClassLoader.defineClass(SecureClassLoader.java:174)
 at java.base/java.net.URLClassLoader.defineClass(URLClassLoader.java:545)
 at java.base/java.net.URLClassLoader.access$100(URLClassLoader.java:83)
 at java.base/java.net.URLClassLoader$1.run(URLClassLoader.java:453)
 at java.base/java.net.URLClassLoader$1.run(URLClassLoader.java:447)
 at java.base/java.security.AccessController.doPrivileged(Native Method)
 at java.base/java.net.URLClassLoader.findClass(URLClassLoader.java:446)
 at java.base/java.lang.ClassLoader.loadClass(ClassLoader.java:566)
 at java.base/java.lang.ClassLoader.loadClass(ClassLoader.java:499)
 at jdk.javadoc/jdk.javadoc.internal.doclets.toolkit.taglets.TagletManager.addCustomTag(TagletManager.java:262)
 at jdk.javadoc/jdk.javadoc.internal.doclets.toolkit.BaseConfiguration.initTagletManager(BaseConfiguration.java:786)
 at jdk.javadoc/jdk.javadoc.internal.doclets.toolkit.BaseConfiguration.finishOptionSettings0(BaseConfiguration.java:726)
 at jdk.javadoc/jdk.javadoc.internal.doclets.formats.html.HtmlConfiguration.finishOptionSettings0(HtmlConfiguration.java:867)
 at jdk.javadoc/jdk.javadoc.internal.doclets.toolkit.BaseConfiguration.setOptions(BaseConfiguration.java:747)
 at jdk.javadoc/jdk.javadoc.internal.doclets.toolkit.AbstractDoclet.startGeneration(AbstractDoclet.java:204)
 at jdk.javadoc/jdk.javadoc.internal.doclets.toolkit.AbstractDoclet.run(AbstractDoclet.java:117)
 at jdk.javadoc/jdk.javadoc.doclet.StandardDoclet.run(StandardDoclet.java:72)
 at jdk.javadoc/jdk.javadoc.internal.tool.Start.parseAndExecute(Start.java:581)
 at jdk.javadoc/jdk.javadoc.internal.tool.Start.begin(Start.java:430)
 at jdk.javadoc/jdk.javadoc.internal.tool.Start.begin(Start.java:343)
 at jdk.javadoc/jdk.javadoc.internal.tool.Main.execute(Main.java:63)
 at jdk.javadoc/jdk.javadoc.internal.tool.Main.main(Main.java:52)
Caused by: java.lang.ClassNotFoundException: com.sun.tools.doclets.Taglet
 at java.base/java.net.URLClassLoader.findClass(URLClassLoader.java:466)
 at java.base/java.lang.ClassLoader.loadClass(ClassLoader.java:566)
 at java.base/java.lang.ClassLoader.loadClass(ClassLoader.java:499)
 ... 35 more

Command line was: f:\jenkins\tools\java\latest10\bin\javadoc.exe @options @argfile

Refer to the generated Javadoc files in 'f:\jenkins\jenkins-slave\workspace\javadoc-plugin_MJAVADOC-516-Z27AS7O3YE3KP4HN2X3EMP56QPDDJR4P5EBKM2B5MKLXDNLXZ3DA\m\target\test\unit\taglet-test\target\site\apidocs' dir.


Stack Trace:
org.apache.maven.plugin.MojoExecutionException: 
An error has occurred in Javadoc report generation: 
Exit code: 1 - Picked up JAVA_TOOL_OPTIONS: -Dmaven.ext.class.path="f:\jenkins\jenkins-slave\workspace\javadoc-plugin_MJAVADOC-516-Z27AS7O3YE3KP4HN2X3EMP56QPDDJR4P5EBKM2B5MKLXDNLXZ3DA@tmp\withMaven254943ba\pipeline-maven-spy.jar" -Dorg.jenkinsci.plugins.pipeline.maven.reportsFolder="f:\jenkins\jenkins-slave\workspace\javadoc-plugin_MJAVADOC-516-Z27AS7O3YE3KP4HN2X3EMP56QPDDJR4P5EBKM2B5MKLXDNLXZ3DA@tmp\withMaven254943ba" 
javadoc: error - An internal exception has occurred. 
	(java.lang.NoClassDefFoundError: com/sun/tools/doclets/Taglet)
Please file a bug against the javadoc tool via the Java bug reporting page
(http://bugreport.java.com) after checking the Bug Database (http://bugs.java.com)
for duplicates. Include error messages and the following diagnostic in your report. Thank you.
java.lang.NoClassDefFoundError: com/sun/tools/doclets/Taglet
	at java.base/java.lang.ClassLoader.defineClass1(Native Method)
	at java.base/java.lang.ClassLoader.defineClass(ClassLoader.java:1009)
	at java.base/java.security.SecureClassLoader.defineClass(SecureClassLoader.java:174)
	at java.base/java.net.URLClassLoader.defineClass(URLClassLoader.java:545)
	at java.base/java.net.URLClassLoader.access$100(URLClassLoader.java:83)
	at java.base/java.net.URLClassLoader$1.run(URLClassLoader.java:453)
	at java.base/java.net.URLClassLoader$1.run(URLClassLoader.java:447)
	at java.base/java.security.AccessController.doPrivileged(Native Method)
	at java.base/java.net.URLClassLoader.findClass(URLClassLoader.java:446)
	at java.base/java.lang.ClassLoader.loadClass(ClassLoader.java:566)
	at java.base/java.lang.ClassLoader.loadClass(ClassLoader.java:499)
	at java.base/java.lang.ClassLoader.defineClass1(Native Method)
	at java.base/java.lang.ClassLoader.defineClass(ClassLoader.java:1009)
	at java.base/java.security.SecureClassLoader.defineClass(SecureClassLoader.java:174)
	at java.base/java.net.URLClassLoader.defineClass(URLClassLoader.java:545)
	at java.base/java.net.URLClassLoader.access$100(URLClassLoader.java:83)
	at java.base/java.net.URLClassLoader$1.run(URLClassLoader.java:453)
	at java.base/java.net.URLClassLoader$1.run(URLClassLoader.java:447)
	at java.base/java.security.AccessController.doPrivileged(Native Method)
	at java.base/java.net.URLClassLoader.findClass(URLClassLoader.java:446)
	at java.base/java.lang.ClassLoader.loadClass(ClassLoader.java:566)
	at java.base/java.lang.ClassLoader.loadClass(ClassLoader.java:499)
	at jdk.javadoc/jdk.javadoc.internal.doclets.toolkit.taglets.TagletManager.addCustomTag(TagletManager.java:262)
	at jdk.javadoc/jdk.javadoc.internal.doclets.toolkit.BaseConfiguration.initTagletManager(BaseConfiguration.java:786)
	at jdk.javadoc/jdk.javadoc.internal.doclets.toolkit.BaseConfiguration.finishOptionSettings0(BaseConfiguration.java:726)
	at jdk.javadoc/jdk.javadoc.internal.doclets.formats.html.HtmlConfiguration.finishOptionSettings0(HtmlConfiguration.java:867)
	at jdk.javadoc/jdk.javadoc.internal.doclets.toolkit.BaseConfiguration.setOptions(BaseConfiguration.java:747)
	at jdk.javadoc/jdk.javadoc.internal.doclets.toolkit.AbstractDoclet.startGeneration(AbstractDoclet.java:204)
	at jdk.javadoc/jdk.javadoc.internal.doclets.toolkit.AbstractDoclet.run(AbstractDoclet.java:117)
	at jdk.javadoc/jdk.javadoc.doclet.StandardDoclet.run(StandardDoclet.java:72)
	at jdk.javadoc/jdk.javadoc.internal.tool.Start.parseAndExecute(Start.java:581)
	at jdk.javadoc/jdk.javadoc.internal.tool.Start.begin(Start.java:430)
	at jdk.javadoc/jdk.javadoc.internal.tool.Start.begin(Start.java:343)
	at jdk.javadoc/jdk.javadoc.internal.tool.Main.execute(Main.java:63)
	at jdk.javadoc/jdk.javadoc.internal.tool.Main.main(Main.java:52)
Caused by: java.lang.ClassNotFoundException: com.sun.tools.doclets.Taglet
	at java.base/java.net.URLClassLoader.findClass(URLClassLoader.java:466)
	at java.base/java.lang.ClassLoader.loadClass(ClassLoader.java:566)
	at java.base/java.lang.ClassLoader.loadClass(ClassLoader.java:499)
	... 35 more

Command line was: f:\jenkins\tools\java\latest10\bin\javadoc.exe @options @argfile

Refer to the generated Javadoc files in 'f:\jenkins\jenkins-slave\workspace\javadoc-plugin_MJAVADOC-516-Z27AS7O3YE3KP4HN2X3EMP56QPDDJR4P5EBKM2B5MKLXDNLXZ3DA\m\target\test\unit\taglet-test\target\site\apidocs' dir.

	at org.apache.maven.plugins.javadoc.JavadocReportTest.testTaglets(JavadocReportTest.java:559)
Caused by: org.apache.maven.reporting.MavenReportException: 

Exit code: 1 - Picked up JAVA_TOOL_OPTIONS: -Dmaven.ext.class.path="f:\jenkins\jenkins-slave\workspace\javadoc-plugin_MJAVADOC-516-Z27AS7O3YE3KP4HN2X3EMP56QPDDJR4P5EBKM2B5MKLXDNLXZ3DA@tmp\withMaven254943ba\pipeline-maven-spy.jar" -Dorg.jenkinsci.plugins.pipeline.maven.reportsFolder="f:\jenkins\jenkins-slave\workspace\javadoc-plugin_MJAVADOC-516-Z27AS7O3YE3KP4HN2X3EMP56QPDDJR4P5EBKM2B5MKLXDNLXZ3DA@tmp\withMaven254943ba" 
javadoc: error - An internal exception has occurred. 
	(java.lang.NoClassDefFoundError: com/sun/tools/doclets/Taglet)
Please file a bug against the javadoc tool via the Java bug reporting page
(http://bugreport.java.com) after checking the Bug Database (http://bugs.java.com)
for duplicates. Include error messages and the following diagnostic in your report. Thank you.
java.lang.NoClassDefFoundError: com/sun/tools/doclets/Taglet
	at java.base/java.lang.ClassLoader.defineClass1(Native Method)
	at java.base/java.lang.ClassLoader.defineClass(ClassLoader.java:1009)
	at java.base/java.security.SecureClassLoader.defineClass(SecureClassLoader.java:174)
	at java.base/java.net.URLClassLoader.defineClass(URLClassLoader.java:545)
	at java.base/java.net.URLClassLoader.access$100(URLClassLoader.java:83)
	at java.base/java.net.URLClassLoader$1.run(URLClassLoader.java:453)
	at java.base/java.net.URLClassLoader$1.run(URLClassLoader.java:447)
	at java.base/java.security.AccessController.doPrivileged(Native Method)
	at java.base/java.net.URLClassLoader.findClass(URLClassLoader.java:446)
	at java.base/java.lang.ClassLoader.loadClass(ClassLoader.java:566)
	at java.base/java.lang.ClassLoader.loadClass(ClassLoader.java:499)
	at java.base/java.lang.ClassLoader.defineClass1(Native Method)
	at java.base/java.lang.ClassLoader.defineClass(ClassLoader.java:1009)
	at java.base/java.security.SecureClassLoader.defineClass(SecureClassLoader.java:174)
	at java.base/java.net.URLClassLoader.defineClass(URLClassLoader.java:545)
	at java.base/java.net.URLClassLoader.access$100(URLClassLoader.java:83)
	at java.base/java.net.URLClassLoader$1.run(URLClassLoader.java:453)
	at java.base/java.net.URLClassLoader$1.run(URLClassLoader.java:447)
	at java.base/java.security.AccessController.doPrivileged(Native Method)
	at java.base/java.net.URLClassLoader.findClass(URLClassLoader.java:446)
	at java.base/java.lang.ClassLoader.loadClass(ClassLoader.java:566)
	at java.base/java.lang.ClassLoader.loadClass(ClassLoader.java:499)
	at jdk.javadoc/jdk.javadoc.internal.doclets.toolkit.taglets.TagletManager.addCustomTag(TagletManager.java:262)
	at jdk.javadoc/jdk.javadoc.internal.doclets.toolkit.BaseConfiguration.initTagletManager(BaseConfiguration.java:786)
	at jdk.javadoc/jdk.javadoc.internal.doclets.toolkit.BaseConfiguration.finishOptionSettings0(BaseConfiguration.java:726)
	at jdk.javadoc/jdk.javadoc.internal.doclets.formats.html.HtmlConfiguration.finishOptionSettings0(HtmlConfiguration.java:867)
	at jdk.javadoc/jdk.javadoc.internal.doclets.toolkit.BaseConfiguration.setOptions(BaseConfiguration.java:747)
	at jdk.javadoc/jdk.javadoc.internal.doclets.toolkit.AbstractDoclet.startGeneration(AbstractDoclet.java:204)
	at jdk.javadoc/jdk.javadoc.internal.doclets.toolkit.AbstractDoclet.run(AbstractDoclet.java:117)
	at jdk.javadoc/jdk.javadoc.doclet.StandardDoclet.run(StandardDoclet.java:72)
	at jdk.javadoc/jdk.javadoc.internal.tool.Start.parseAndExecute(Start.java:581)
	at jdk.javadoc/jdk.javadoc.internal.tool.Start.begin(Start.java:430)
	at jdk.javadoc/jdk.javadoc.internal.tool.Start.begin(Start.java:343)
	at jdk.javadoc/jdk.javadoc.internal.tool.Main.execute(Main.java:63)
	at jdk.javadoc/jdk.javadoc.internal.tool.Main.main(Main.java:52)
Caused by: java.lang.ClassNotFoundException: com.sun.tools.doclets.Taglet
	at java.base/java.net.URLClassLoader.findClass(URLClassLoader.java:466)
	at java.base/java.lang.ClassLoader.loadClass(ClassLoader.java:566)
	at java.base/java.lang.ClassLoader.loadClass(ClassLoader.java:499)
	... 35 more

Command line was: f:\jenkins\tools\java\latest10\bin\javadoc.exe @options @argfile

Refer to the generated Javadoc files in 'f:\jenkins\jenkins-slave\workspace\javadoc-plugin_MJAVADOC-516-Z27AS7O3YE3KP4HN2X3EMP56QPDDJR4P5EBKM2B5MKLXDNLXZ3DA\m\target\test\unit\taglet-test\target\site\apidocs' dir.

	at org.apache.maven.plugins.javadoc.JavadocReportTest.testTaglets(JavadocReportTest.java:559)


FAILED:  org.apache.maven.plugins.javadoc.JavadocReportTest.testJavadocResources

Error Message:
null

Stack Trace:
junit.framework.AssertionFailedError
	at org.apache.maven.plugins.javadoc.JavadocReportTest.testJavadocResources(JavadocReportTest.java:673)


FAILED:  org.apache.maven.plugins.javadoc.JavadocReportTest.testQuotedPath

Error Message:
null

Stack Trace:
junit.framework.AssertionFailedError
	at org.apache.maven.plugins.javadoc.JavadocReportTest.testQuotedPath(JavadocReportTest.java:498)


FAILED:  org.apache.maven.plugins.javadoc.JavadocReportTest.testDefaultConfiguration

Error Message:
null

Stack Trace:
junit.framework.AssertionFailedError
	at org.apache.maven.plugins.javadoc.JavadocReportTest.testDefaultConfiguration(JavadocReportTest.java:240)


FAILED:  org.apache.maven.plugins.javadoc.JavadocReportTest.testDocfiles

Error Message:
null

Stack Trace:
junit.framework.AssertionFailedError
	at org.apache.maven.plugins.javadoc.JavadocReportTest.testDocfiles(JavadocReportTest.java:330)


FAILED:  org.apache.maven.plugins.javadoc.JavadocReportTest.testStylesheetfile

Error Message:
null

Stack Trace:
junit.framework.AssertionFailedError
	at org.apache.maven.plugins.javadoc.JavadocReportTest.testStylesheetfile(JavadocReportTest.java:1115)




Build log:
[...truncated 2.94 MB...]
[windows-jdk9] [INFO] ..SUCCESS (13.2 s)
[windows-jdk9] [INFO] Building: MJAVADOC-172\pom.xml
[windows-jdk9] [INFO] run script verify.bsh
[windows-jdk9] [INFO] ..SUCCESS (11.4 s)
[windows-jdk9] [INFO] Building: MJAVADOC-180\pom.xml
[windows-jdk9] [INFO] run script verify.bsh
[windows-jdk9] [INFO] ..SUCCESS (9.9 s)
[windows-jdk9] [INFO] Building: MJAVADOC-194\pom.xml
[windows-jdk10] [INFO] run script verify.bsh
[windows-jdk10] [INFO] ..FAILED (6.6 s)
[windows-jdk10] [INFO]   The post-build script returned false.
[windows-jdk10] [INFO] Building: MJAVADOC-498_aggr_modulepath\pom.xml
[windows-jdk9] [INFO] run script verify.bsh
[windows-jdk9] [INFO] ..SUCCESS (10.6 s)
[windows-jdk9] [INFO] Building: MJAVADOC-250\pom.xml
[windows-jdk10] [INFO] ..SUCCESS (18.5 s)
[windows-jdk10] [INFO] Building: MJAVADOC-498_mm_modulepath\pom.xml
[windows-jdk9] [INFO] run script verify.bsh
[windows-jdk9] [INFO] ..SUCCESS (14.7 s)
[windows-jdk9] [INFO] Building: MJAVADOC-257\pom.xml
[windows-jdk10] [INFO] ..SUCCESS (8.8 s)
[windows-jdk10] [INFO] Building: MJAVADOC-498_modulepath\pom.xml
[windows-jdk10] [INFO] run script verify.groovy
[windows-jdk10] [INFO] ..SUCCESS (11.4 s)
[windows-jdk10] [INFO] Building: MJAVADOC-508\pom.xml
[windows-jdk10] [INFO] ..SUCCESS (5.4 s)
[windows-jdk10] [INFO] Building: site-failOnError\pom.xml
[windows-jdk9] [INFO] run script verify.bsh
[windows-jdk9] [INFO] ..SUCCESS (22.9 s)
[windows-jdk9] [INFO] Building: MJAVADOC-259\pom.xml
[windows-jdk10] [INFO] ..SUCCESS (12.2 s)
[windows-jdk10] [INFO] 
[windows-jdk10] [INFO] --- mrm-maven-plugin:1.1.0:stop (repository) @ maven-javadoc-plugin ---
[windows-jdk10] [INFO] Stopping Mock Repository Manager on http://localhost:61583
[windows-jdk10] [INFO] Stopped SocketConnector@0.0.0.0:61583
[windows-jdk10] [INFO] Mock Repository Manager http://localhost:61583 is stopped.
[windows-jdk10] [INFO] 
[windows-jdk10] [INFO] --- mrm-maven-plugin:1.1.0:stop (3rdparty) @ maven-javadoc-plugin ---
[windows-jdk10] [INFO] Stopping Mock Repository Manager on http://localhost:61584
[windows-jdk10] [INFO] Stopped SocketConnector@0.0.0.0:61584
[windows-jdk10] [INFO] Mock Repository Manager http://localhost:61584 is stopped.
[windows-jdk10] [INFO] 
[windows-jdk10] [INFO] --- maven-checkstyle-plugin:2.15:check (checkstyle-check) @ maven-javadoc-plugin ---
[windows-jdk10] [INFO] There are 4 errors reported by Checkstyle 6.1.1 with config/maven_checks.xml ruleset.
[windows-jdk10] [INFO] Ignored 4 errors, 0 violation remaining.
[windows-jdk10] [INFO] 
[windows-jdk10] [INFO] --- maven-invoker-plugin:2.0.0:verify (integration-test) @ maven-javadoc-plugin ---
[windows-jdk10] [INFO] -------------------------------------------------
[windows-jdk10] [INFO] Build Summary:
[windows-jdk10] [INFO]   Passed: 33, Failed: 3, Errors: 0, Skipped: 0
[windows-jdk10] [INFO] -------------------------------------------------
[windows-jdk10] [WARNING] The following builds failed:
[windows-jdk10] [WARNING] *  detectLinks\pom.xml
[windows-jdk10] [WARNING] *  MJAVADOC-257\pom.xml
[windows-jdk10] [WARNING] *  MJAVADOC-497\pom.xml
[windows-jdk10] [INFO] -------------------------------------------------
[windows-jdk10] [WARNING] Ignoring that 3 builds failed.
[windows-jdk10] [INFO] ------------------------------------------------------------------------
[windows-jdk10] [INFO] BUILD SUCCESS
[windows-jdk10] [INFO] ------------------------------------------------------------------------
[windows-jdk10] [INFO] Total time: 07:25 min
[windows-jdk10] [INFO] Finished at: 2018-07-16T04:25:15Z
[windows-jdk10] [INFO] Final Memory: 50M/174M
[windows-jdk10] [INFO] ------------------------------------------------------------------------
[windows-jdk10] [INFO] [jenkins-event-spy] Generated F:\jenkins\jenkins-slave\workspace\javadoc-plugin_MJAVADOC-516-Z27AS7O3YE3KP4HN2X3EMP56QPDDJR4P5EBKM2B5MKLXDNLXZ3DA@tmp\withMaven254943ba\maven-spy-20180716-041749-8387284965727009343037.log
[Pipeline] [windows-jdk10] }
[Pipeline] [windows-jdk10] // dir
[windows-jdk9] [INFO] run script verify.bsh
[windows-jdk9] [INFO] ..SUCCESS (18.1 s)
[windows-jdk9] [INFO] Building: MJAVADOC-262\pom.xml
[windows-jdk9] [INFO] run script verify.bsh
[windows-jdk9] [INFO] ..SUCCESS (9.3 s)
[windows-jdk9] [INFO] Building: MJAVADOC-275\pom.xml
[windows-jdk9] [INFO] ..SUCCESS (18.5 s)
[windows-jdk9] [INFO] Building: MJAVADOC-278\pom.xml
[windows-jdk9] [INFO] run script verify.bsh
[windows-jdk9] [INFO] ..SUCCESS (11.2 s)
[windows-jdk9] [INFO] Building: MJAVADOC-320\pom.xml
[windows-jdk9] [INFO] run script verify.bsh
[windows-jdk9] [INFO] ..SUCCESS (15.3 s)
[windows-jdk9] [INFO] Building: MJAVADOC-325\pom.xml
[windows-jdk9] [INFO] run script verify.bsh
[windows-jdk9] [INFO] ..SUCCESS (11.1 s)
[windows-jdk9] [INFO] Building: MJAVADOC-365\pom.xml
[windows-jdk9] [INFO] run script verify.bsh
[windows-jdk9] [INFO] ..SUCCESS (10.3 s)
[windows-jdk9] [INFO] Building: MJAVADOC-369\pom.xml
[Pipeline] [windows-jdk10] }
[windows-jdk10] [withMaven] invokerPublisher - Archive invoker results for Maven artifact MavenArtifact{org.apache.maven.plugins:maven-javadoc-plugin::3.0.1-SNAPSHOT(version: 3.0.1-SNAPSHOT, snapshot:false) } generated by PluginInvocation{org.apache.maven.plugins:maven-invoker-plugin:2.0.0@integration-test  integration-test}: m\target\invoker-reports\*.xml
[windows-jdk10] performing MavenInvokerRecorder, reportsFilenamePattern:'**/m\target\invoker-reports/BUILD*.xml', invokerBuildDir:'**/m\target\it'
[windows-jdk10] Found reports:[f:\jenkins\jenkins-slave\workspace\javadoc-plugin_MJAVADOC-516-Z27AS7O3YE3KP4HN2X3EMP56QPDDJR4P5EBKM2B5MKLXDNLXZ3DA\m\target\invoker-reports\BUILD-MJAVADOC-110.xml, f:\jenkins\jenkins-slave\workspace\javadoc-plugin_MJAVADOC-516-Z27AS7O3YE3KP4HN2X3EMP56QPDDJR4P5EBKM2B5MKLXDNLXZ3DA\m\target\invoker-reports\BUILD-MJAVADOC-126.xml, f:\jenkins\jenkins-slave\workspace\javadoc-plugin_MJAVADOC-516-Z27AS7O3YE3KP4HN2X3EMP56QPDDJR4P5EBKM2B5MKLXDNLXZ3DA\m\target\invoker-reports\BUILD-MJAVADOC-137.xml, f:\jenkins\jenkins-slave\workspace\javadoc-plugin_MJAVADOC-516-Z27AS7O3YE3KP4HN2X3EMP56QPDDJR4P5EBKM2B5MKLXDNLXZ3DA\m\target\invoker-reports\BUILD-MJAVADOC-172.xml, f:\jenkins\jenkins-slave\workspace\javadoc-plugin_MJAVADOC-516-Z27AS7O3YE3KP4HN2X3EMP56QPDDJR4P5EBKM2B5MKLXDNLXZ3DA\m\target\invoker-reports\BUILD-MJAVADOC-180.xml, f:\jenkins\jenkins-slave\workspace\javadoc-plugin_MJAVADOC-516-Z27AS7O3YE3KP4HN2X3EMP56QPDDJR4P5EBKM2B5MKLXDNLXZ3DA\m\target\invoker-reports\BUILD-MJAVADOC-194.xml, f:\jenkins\jenkins-slave\workspace\javadoc-plugin_MJAVADOC-516-Z27AS7O3YE3KP4HN2X3EMP56QPDDJR4P5EBKM2B5MKLXDNLXZ3DA\m\target\invoker-reports\BUILD-MJAVADOC-250.xml, f:\jenkins\jenkins-slave\workspace\javadoc-plugin_MJAVADOC-516-Z27AS7O3YE3KP4HN2X3EMP56QPDDJR4P5EBKM2B5MKLXDNLXZ3DA\m\target\invoker-reports\BUILD-MJAVADOC-257.xml, f:\jenkins\jenkins-slave\workspace\javadoc-plugin_MJAVADOC-516-Z27AS7O3YE3KP4HN2X3EMP56QPDDJR4P5EBKM2B5MKLXDNLXZ3DA\m\target\invoker-reports\BUILD-MJAVADOC-259.xml, f:\jenkins\jenkins-slave\workspace\javadoc-plugin_MJAVADOC-516-Z27AS7O3YE3KP4HN2X3EMP56QPDDJR4P5EBKM2B5MKLXDNLXZ3DA\m\target\invoker-reports\BUILD-MJAVADOC-262.xml, f:\jenkins\jenkins-slave\workspace\javadoc-plugin_MJAVADOC-516-Z27AS7O3YE3KP4HN2X3EMP56QPDDJR4P5EBKM2B5MKLXDNLXZ3DA\m\target\invoker-reports\BUILD-MJAVADOC-275.xml, f:\jenkins\jenkins-slave\workspace\javadoc-plugin_MJAVADOC-516-Z27AS7O3YE3KP4HN2X3EMP56QPDDJR4P5EBKM2B5MKLXDNLXZ3DA\m\target\invoker-reports\BUILD-MJAVADOC-278.xml, f:\jenkins\jenkins-slave\workspace\javadoc-plugin_MJAVADOC-516-Z27AS7O3YE3KP4HN2X3EMP56QPDDJR4P5EBKM2B5MKLXDNLXZ3DA\m\target\invoker-reports\BUILD-MJAVADOC-320.xml, f:\jenkins\jenkins-slave\workspace\javadoc-plugin_MJAVADOC-516-Z27AS7O3YE3KP4HN2X3EMP56QPDDJR4P5EBKM2B5MKLXDNLXZ3DA\m\target\invoker-reports\BUILD-MJAVADOC-325.xml, f:\jenkins\jenkins-slave\workspace\javadoc-plugin_MJAVADOC-516-Z27AS7O3YE3KP4HN2X3EMP56QPDDJR4P5EBKM2B5MKLXDNLXZ3DA\m\target\invoker-reports\BUILD-MJAVADOC-365.xml, f:\jenkins\jenkins-slave\workspace\javadoc-plugin_MJAVADOC-516-Z27AS7O3YE3KP4HN2X3EMP56QPDDJR4P5EBKM2B5MKLXDNLXZ3DA\m\target\invoker-reports\BUILD-MJAVADOC-369.xml, f:\jenkins\jenkins-slave\workspace\javadoc-plugin_MJAVADOC-516-Z27AS7O3YE3KP4HN2X3EMP56QPDDJR4P5EBKM2B5MKLXDNLXZ3DA\m\target\invoker-reports\BUILD-MJAVADOC-384.xml, f:\jenkins\jenkins-slave\workspace\javadoc-plugin_MJAVADOC-516-Z27AS7O3YE3KP4HN2X3EMP56QPDDJR4P5EBKM2B5MKLXDNLXZ3DA\m\target\invoker-reports\BUILD-MJAVADOC-407.xml, f:\jenkins\jenkins-slave\workspace\javadoc-plugin_MJAVADOC-516-Z27AS7O3YE3KP4HN2X3EMP56QPDDJR4P5EBKM2B5MKLXDNLXZ3DA\m\target\invoker-reports\BUILD-MJAVADOC-414.xml, f:\jenkins\jenkins-slave\workspace\javadoc-plugin_MJAVADOC-516-Z27AS7O3YE3KP4HN2X3EMP56QPDDJR4P5EBKM2B5MKLXDNLXZ3DA\m\target\invoker-reports\BUILD-MJAVADOC-427.xml, f:\jenkins\jenkins-slave\workspace\javadoc-plugin_MJAVADOC-516-Z27AS7O3YE3KP4HN2X3EMP56QPDDJR4P5EBKM2B5MKLXDNLXZ3DA\m\target\invoker-reports\BUILD-MJAVADOC-437.xml, f:\jenkins\jenkins-slave\workspace\javadoc-plugin_MJAVADOC-516-Z27AS7O3YE3KP4HN2X3EMP56QPDDJR4P5EBKM2B5MKLXDNLXZ3DA\m\target\invoker-reports\BUILD-MJAVADOC-494_aggregate-repositories.xml, f:\jenkins\jenkins-slave\workspace\javadoc-plugin_MJAVADOC-516-Z27AS7O3YE3KP4HN2X3EMP56QPDDJR4P5EBKM2B5MKLXDNLXZ3DA\m\target\invoker-reports\BUILD-MJAVADOC-497.xml, f:\jenkins\jenkins-slave\workspace\javadoc-plugin_MJAVADOC-516-Z27AS7O3YE3KP4HN2X3EMP56QPDDJR4P5EBKM2B5MKLXDNLXZ3DA\m\target\invoker-reports\BUILD-MJAVADOC-498_aggr_modulepath.xml, f:\jenkins\jenkins-slave\workspace\javadoc-plugin_MJAVADOC-516-Z27AS7O3YE3KP4HN2X3EMP56QPDDJR4P5EBKM2B5MKLXDNLXZ3DA\m\target\invoker-reports\BUILD-MJAVADOC-498_mm_modulepath.xml, f:\jenkins\jenkins-slave\workspace\javadoc-plugin_MJAVADOC-516-Z27AS7O3YE3KP4HN2X3EMP56QPDDJR4P5EBKM2B5MKLXDNLXZ3DA\m\target\invoker-reports\BUILD-MJAVADOC-498_modulepath.xml, f:\jenkins\jenkins-slave\workspace\javadoc-plugin_MJAVADOC-516-Z27AS7O3YE3KP4HN2X3EMP56QPDDJR4P5EBKM2B5MKLXDNLXZ3DA\m\target\invoker-reports\BUILD-MJAVADOC-508.xml, f:\jenkins\jenkins-slave\workspace\javadoc-plugin_MJAVADOC-516-Z27AS7O3YE3KP4HN2X3EMP56QPDDJR4P5EBKM2B5MKLXDNLXZ3DA\m\target\invoker-reports\BUILD-additional-dependencies-non-aggregate.xml, f:\jenkins\jenkins-slave\workspace\javadoc-plugin_MJAVADOC-516-Z27AS7O3YE3KP4HN2X3EMP56QPDDJR4P5EBKM2B5MKLXDNLXZ3DA\m\target\invoker-reports\BUILD-additional-dependencies.xml, f:\jenkins\jenkins-slave\workspace\javadoc-plugin_MJAVADOC-516-Z27AS7O3YE3KP4HN2X3EMP56QPDDJR4P5EBKM2B5MKLXDNLXZ3DA\m\target\invoker-reports\BUILD-dependencySource-1.xml, f:\jenkins\jenkins-slave\workspace\javadoc-plugin_MJAVADOC-516-Z27AS7O3YE3KP4HN2X3EMP56QPDDJR4P5EBKM2B5MKLXDNLXZ3DA\m\target\invoker-reports\BUILD-dependencySource-2.xml, f:\jenkins\jenkins-slave\workspace\javadoc-plugin_MJAVADOC-516-Z27AS7O3YE3KP4HN2X3EMP56QPDDJR4P5EBKM2B5MKLXDNLXZ3DA\m\target\invoker-reports\BUILD-dependencySource-3.xml, f:\jenkins\jenkins-slave\workspace\javadoc-plugin_MJAVADOC-516-Z27AS7O3YE3KP4HN2X3EMP56QPDDJR4P5EBKM2B5MKLXDNLXZ3DA\m\target\invoker-reports\BUILD-dependencySource-4.xml, f:\jenkins\jenkins-slave\workspace\javadoc-plugin_MJAVADOC-516-Z27AS7O3YE3KP4HN2X3EMP56QPDDJR4P5EBKM2B5MKLXDNLXZ3DA\m\target\invoker-reports\BUILD-detectLinks.xml, f:\jenkins\jenkins-slave\workspace\javadoc-plugin_MJAVADOC-516-Z27AS7O3YE3KP4HN2X3EMP56QPDDJR4P5EBKM2B5MKLXDNLXZ3DA\m\target\invoker-reports\BUILD-javadoc-fix.xml, f:\jenkins\jenkins-slave\workspace\javadoc-plugin_MJAVADOC-516-Z27AS7O3YE3KP4HN2X3EMP56QPDDJR4P5EBKM2B5MKLXDNLXZ3DA\m\target\invoker-reports\BUILD-site-failOnError.xml]
[windows-jdk10] Found logs:[f:\jenkins\jenkins-slave\workspace\javadoc-plugin_MJAVADOC-516-Z27AS7O3YE3KP4HN2X3EMP56QPDDJR4P5EBKM2B5MKLXDNLXZ3DA\m\target\it\MJAVADOC-110\build.log, f:\jenkins\jenkins-slave\workspace\javadoc-plugin_MJAVADOC-516-Z27AS7O3YE3KP4HN2X3EMP56QPDDJR4P5EBKM2B5MKLXDNLXZ3DA\m\target\it\MJAVADOC-126\build.log, f:\jenkins\jenkins-slave\workspace\javadoc-plugin_MJAVADOC-516-Z27AS7O3YE3KP4HN2X3EMP56QPDDJR4P5EBKM2B5MKLXDNLXZ3DA\m\target\it\MJAVADOC-137\build.log, f:\jenkins\jenkins-slave\workspace\javadoc-plugin_MJAVADOC-516-Z27AS7O3YE3KP4HN2X3EMP56QPDDJR4P5EBKM2B5MKLXDNLXZ3DA\m\target\it\MJAVADOC-172\build.log, f:\jenkins\jenkins-slave\workspace\javadoc-plugin_MJAVADOC-516-Z27AS7O3YE3KP4HN2X3EMP56QPDDJR4P5EBKM2B5MKLXDNLXZ3DA\m\target\it\MJAVADOC-180\build.log, f:\jenkins\jenkins-slave\workspace\javadoc-plugin_MJAVADOC-516-Z27AS7O3YE3KP4HN2X3EMP56QPDDJR4P5EBKM2B5MKLXDNLXZ3DA\m\target\it\MJAVADOC-194\build.log, f:\jenkins\jenkins-slave\workspace\javadoc-plugin_MJAVADOC-516-Z27AS7O3YE3KP4HN2X3EMP56QPDDJR4P5EBKM2B5MKLXDNLXZ3DA\m\target\it\MJAVADOC-250\build.log, f:\jenkins\jenkins-slave\workspace\javadoc-plugin_MJAVADOC-516-Z27AS7O3YE3KP4HN2X3EMP56QPDDJR4P5EBKM2B5MKLXDNLXZ3DA\m\target\it\MJAVADOC-257\build.log, f:\jenkins\jenkins-slave\workspace\javadoc-plugin_MJAVADOC-516-Z27AS7O3YE3KP4HN2X3EMP56QPDDJR4P5EBKM2B5MKLXDNLXZ3DA\m\target\it\MJAVADOC-259\build.log, f:\jenkins\jenkins-slave\workspace\javadoc-plugin_MJAVADOC-516-Z27AS7O3YE3KP4HN2X3EMP56QPDDJR4P5EBKM2B5MKLXDNLXZ3DA\m\target\it\MJAVADOC-262\build.log, f:\jenkins\jenkins-slave\workspace\javadoc-plugin_MJAVADOC-516-Z27AS7O3YE3KP4HN2X3EMP56QPDDJR4P5EBKM2B5MKLXDNLXZ3DA\m\target\it\MJAVADOC-275\build.log, f:\jenkins\jenkins-slave\workspace\javadoc-plugin_MJAVADOC-516-Z27AS7O3YE3KP4HN2X3EMP56QPDDJR4P5EBKM2B5MKLXDNLXZ3DA\m\target\it\MJAVADOC-278\build.log, f:\jenkins\jenkins-slave\workspace\javadoc-plugin_MJAVADOC-516-Z27AS7O3YE3KP4HN2X3EMP56QPDDJR4P5EBKM2B5MKLXDNLXZ3DA\m\target\it\MJAVADOC-320\build.log, f:\jenkins\jenkins-slave\workspace\javadoc-plugin_MJAVADOC-516-Z27AS7O3YE3KP4HN2X3EMP56QPDDJR4P5EBKM2B5MKLXDNLXZ3DA\m\target\it\MJAVADOC-325\build.log, f:\jenkins\jenkins-slave\workspace\javadoc-plugin_MJAVADOC-516-Z27AS7O3YE3KP4HN2X3EMP56QPDDJR4P5EBKM2B5MKLXDNLXZ3DA\m\target\it\MJAVADOC-365\build.log, f:\jenkins\jenkins-slave\workspace\javadoc-plugin_MJAVADOC-516-Z27AS7O3YE3KP4HN2X3EMP56QPDDJR4P5EBKM2B5MKLXDNLXZ3DA\m\target\it\MJAVADOC-369\build.log, f:\jenkins\jenkins-slave\workspace\javadoc-plugin_MJAVADOC-516-Z27AS7O3YE3KP4HN2X3EMP56QPDDJR4P5EBKM2B5MKLXDNLXZ3DA\m\target\it\MJAVADOC-384\build.log, f:\jenkins\jenkins-slave\workspace\javadoc-plugin_MJAVADOC-516-Z27AS7O3YE3KP4HN2X3EMP56QPDDJR4P5EBKM2B5MKLXDNLXZ3DA\m\target\it\MJAVADOC-407\build.log, f:\jenkins\jenkins-slave\workspace\javadoc-plugin_MJAVADOC-516-Z27AS7O3YE3KP4HN2X3EMP56QPDDJR4P5EBKM2B5MKLXDNLXZ3DA\m\target\it\MJAVADOC-414\build.log, f:\jenkins\jenkins-slave\workspace\javadoc-plugin_MJAVADOC-516-Z27AS7O3YE3KP4HN2X3EMP56QPDDJR4P5EBKM2B5MKLXDNLXZ3DA\m\target\it\MJAVADOC-427\build.log, f:\jenkins\jenkins-slave\workspace\javadoc-plugin_MJAVADOC-516-Z27AS7O3YE3KP4HN2X3EMP56QPDDJR4P5EBKM2B5MKLXDNLXZ3DA\m\target\it\MJAVADOC-437\build.log, f:\jenkins\jenkins-slave\workspace\javadoc-plugin_MJAVADOC-516-Z27AS7O3YE3KP4HN2X3EMP56QPDDJR4P5EBKM2B5MKLXDNLXZ3DA\m\target\it\MJAVADOC-494_aggregate-repositories\build.log, f:\jenkins\jenkins-slave\workspace\javadoc-plugin_MJAVADOC-516-Z27AS7O3YE3KP4HN2X3EMP56QPDDJR4P5EBKM2B5MKLXDNLXZ3DA\m\target\it\MJAVADOC-497\build.log, f:\jenkins\jenkins-slave\workspace\javadoc-plugin_MJAVADOC-516-Z27AS7O3YE3KP4HN2X3EMP56QPDDJR4P5EBKM2B5MKLXDNLXZ3DA\m\target\it\MJAVADOC-498_aggr_modulepath\build.log, f:\jenkins\jenkins-slave\workspace\javadoc-plugin_MJAVADOC-516-Z27AS7O3YE3KP4HN2X3EMP56QPDDJR4P5EBKM2B5MKLXDNLXZ3DA\m\target\it\MJAVADOC-498_mm_modulepath\build.log, f:\jenkins\jenkins-slave\workspace\javadoc-plugin_MJAVADOC-516-Z27AS7O3YE3KP4HN2X3EMP56QPDDJR4P5EBKM2B5MKLXDNLXZ3DA\m\target\it\MJAVADOC-498_modulepath\build.log, f:\jenkins\jenkins-slave\workspace\javadoc-plugin_MJAVADOC-516-Z27AS7O3YE3KP4HN2X3EMP56QPDDJR4P5EBKM2B5MKLXDNLXZ3DA\m\target\it\MJAVADOC-508\build.log, f:\jenkins\jenkins-slave\workspace\javadoc-plugin_MJAVADOC-516-Z27AS7O3YE3KP4HN2X3EMP56QPDDJR4P5EBKM2B5MKLXDNLXZ3DA\m\target\it\additional-dependencies-non-aggregate\build.log, f:\jenkins\jenkins-slave\workspace\javadoc-plugin_MJAVADOC-516-Z27AS7O3YE3KP4HN2X3EMP56QPDDJR4P5EBKM2B5MKLXDNLXZ3DA\m\target\it\additional-dependencies\build.log, f:\jenkins\jenkins-slave\workspace\javadoc-plugin_MJAVADOC-516-Z27AS7O3YE3KP4HN2X3EMP56QPDDJR4P5EBKM2B5MKLXDNLXZ3DA\m\target\it\dependencySource-1\build.log, f:\jenkins\jenkins-slave\workspace\javadoc-plugin_MJAVADOC-516-Z27AS7O3YE3KP4HN2X3EMP56QPDDJR4P5EBKM2B5MKLXDNLXZ3DA\m\target\it\dependencySource-2\build.log, f:\jenkins\jenkins-slave\workspace\javadoc-plugin_MJAVADOC-516-Z27AS7O3YE3KP4HN2X3EMP56QPDDJR4P5EBKM2B5MKLXDNLXZ3DA\m\target\it\dependencySource-3\build.log, f:\jenkins\jenkins-slave\workspace\javadoc-plugin_MJAVADOC-516-Z27AS7O3YE3KP4HN2X3EMP56QPDDJR4P5EBKM2B5MKLXDNLXZ3DA\m\target\it\dependencySource-4\build.log, f:\jenkins\jenkins-slave\workspace\javadoc-plugin_MJAVADOC-516-Z27AS7O3YE3KP4HN2X3EMP56QPDDJR4P5EBKM2B5MKLXDNLXZ3DA\m\target\it\detectLinks\build.log, f:\jenkins\jenkins-slave\workspace\javadoc-plugin_MJAVADOC-516-Z27AS7O3YE3KP4HN2X3EMP56QPDDJR4P5EBKM2B5MKLXDNLXZ3DA\m\target\it\javadoc-fix\build.log, f:\jenkins\jenkins-slave\workspace\javadoc-plugin_MJAVADOC-516-Z27AS7O3YE3KP4HN2X3EMP56QPDDJR4P5EBKM2B5MKLXDNLXZ3DA\m\target\it\site-failOnError\build.log]
[windows-jdk10] Finished parsing Maven Invoker results (found 36)
[windows-jdk10] [withMaven] junitPublisher - Archive test results for Maven artifact org.apache.maven.plugins:maven-javadoc-plugin:3.0.1-SNAPSHOT generated by maven-surefire-plugin:test (default-test): m\target\surefire-reports\*.xml
[windows-jdk10] Recording test results
[Pipeline] [windows-jdk10] // withMaven
[Pipeline] [windows-jdk10] }
[Pipeline] [windows-jdk10] // stage
[windows-jdk9] [INFO] run script verify.bsh
[windows-jdk9] [INFO] ..SUCCESS (19.7 s)
[windows-jdk9] [INFO] Building: MJAVADOC-384\pom.xml
[Pipeline] [windows-jdk10] }
[Pipeline] [windows-jdk10] // node
[Pipeline] [windows-jdk10] }
[windows-jdk9] [INFO] run script verify.bsh
[windows-jdk9] [INFO] ..SUCCESS (10.1 s)
[windows-jdk9] [INFO] Building: MJAVADOC-407\pom.xml
[windows-jdk9] [INFO] run script verify.bsh
[windows-jdk9] [INFO] ..SUCCESS (12.6 s)
[windows-jdk9] [INFO] Building: MJAVADOC-414\pom.xml
[windows-jdk9] [INFO] run script verify.bsh
[windows-jdk9] [INFO] ..SUCCESS (12.0 s)
[windows-jdk9] [INFO] Building: MJAVADOC-427\pom.xml
[windows-jdk9] [INFO] run script verify.groovy
[windows-jdk9] WARNING: An illegal reflective access operation has occurred
[windows-jdk9] WARNING: Illegal reflective access by org.codehaus.groovy.reflection.CachedClass$3$1 (file:/f:/jenkins/jenkins-slave/workspace/javadoc-plugin_MJAVADOC-516-Z27AS7O3YE3KP4HN2X3EMP56QPDDJR4P5EBKM2B5MKLXDNLXZ3DA@2/.repository/org/codehaus/groovy/groovy/2.0.1/groovy-2.0.1.jar) to method java.lang.Object.finalize()
[windows-jdk9] WARNING: Please consider reporting this to the maintainers of org.codehaus.groovy.reflection.CachedClass$3$1
[windows-jdk9] WARNING: Use --illegal-access=warn to enable warnings of further illegal reflective access operations
[windows-jdk9] WARNING: All illegal access operations will be denied in a future release
[windows-jdk9] [INFO] ..SUCCESS (11.5 s)
[windows-jdk9] [INFO] Building: MJAVADOC-437\pom.xml
[windows-jdk9] [INFO] run script verify.bsh
[windows-jdk9] [INFO] ..SUCCESS (11.7 s)
[windows-jdk9] [INFO] Building: MJAVADOC-494_aggregate-repositories\pom.xml
[windows-jdk9] [INFO] ..SUCCESS (11.8 s)
[windows-jdk9] [INFO] Building: MJAVADOC-497\pom.xml
[windows-jdk9] [INFO] run script verify.bsh
[windows-jdk9] [INFO] ..SUCCESS (11.9 s)
[windows-jdk9] [INFO] Building: MJAVADOC-498_aggr_modulepath\pom.xml
[windows-jdk9] [INFO] ..SUCCESS (29.4 s)
[windows-jdk9] [INFO] Building: MJAVADOC-498_mm_modulepath\pom.xml
[windows-jdk9] [INFO] ..SUCCESS (14.9 s)
[windows-jdk9] [INFO] Building: MJAVADOC-498_modulepath\pom.xml
[windows-jdk9] [INFO] run script verify.groovy
[windows-jdk9] [INFO] ..SUCCESS (18.0 s)
[windows-jdk9] [INFO] Building: MJAVADOC-508\pom.xml
[windows-jdk9] [INFO] ..SUCCESS (9.3 s)
[windows-jdk9] [INFO] Building: site-failOnError\pom.xml
[windows-jdk9] [INFO] ..SUCCESS (14.4 s)
[windows-jdk9] [INFO] 
[windows-jdk9] [INFO] --- mrm-maven-plugin:1.1.0:stop (repository) @ maven-javadoc-plugin ---
[windows-jdk9] [INFO] Stopping Mock Repository Manager on http://localhost:50164
[windows-jdk9] [INFO] Stopped SocketConnector@0.0.0.0:50164
[windows-jdk9] [INFO] Mock Repository Manager http://localhost:50164 is stopped.
[windows-jdk9] [INFO] 
[windows-jdk9] [INFO] --- mrm-maven-plugin:1.1.0:stop (3rdparty) @ maven-javadoc-plugin ---
[windows-jdk9] [INFO] Stopping Mock Repository Manager on http://localhost:50165
[windows-jdk9] [INFO] Stopped SocketConnector@0.0.0.0:50165
[windows-jdk9] [INFO] Mock Repository Manager http://localhost:50165 is stopped.
[windows-jdk9] [INFO] 
[windows-jdk9] [INFO] --- maven-checkstyle-plugin:2.15:check (checkstyle-check) @ maven-javadoc-plugin ---
[windows-jdk9] [INFO] Downloading: https://repo.maven.apache.org/maven2/org/apache/maven/shared/maven-shared-resources/2/maven-shared-resources-2.pom
[windows-jdk9] [INFO] Downloaded: https://repo.maven.apache.org/maven2/org/apache/maven/shared/maven-shared-resources/2/maven-shared-resources-2.pom (3.0 kB at 328 kB/s)
[windows-jdk9] [INFO] Downloading: https://repo.maven.apache.org/maven2/org/codehaus/plexus/plexus-utils/3.0.10/plexus-utils-3.0.10.pom
[windows-jdk9] [INFO] Downloaded: https://repo.maven.apache.org/maven2/org/codehaus/plexus/plexus-utils/3.0.10/plexus-utils-3.0.10.pom (3.1 kB at 393 kB/s)
[windows-jdk9] [INFO] Downloading: https://repo.maven.apache.org/maven2/org/apache/maven/doxia/doxia-integration-tools/1.6/doxia-integration-tools-1.6.pom
[windows-jdk9] [INFO] Downloaded: https://repo.maven.apache.org/maven2/org/apache/maven/doxia/doxia-integration-tools/1.6/doxia-integration-tools-1.6.pom (7.0 kB at 994 kB/s)
[windows-jdk9] [INFO] Downloading: https://repo.maven.apache.org/maven2/org/apache/maven/doxia/doxia-tools/3/doxia-tools-3.pom
[windows-jdk9] [INFO] Downloaded: https://repo.maven.apache.org/maven2/org/apache/maven/doxia/doxia-tools/3/doxia-tools-3.pom (9.9 kB at 1.2 MB/s)
[windows-jdk9] [INFO] Downloading: https://repo.maven.apache.org/maven2/org/apache/maven/doxia/doxia-logging-api/1.6/doxia-logging-api-1.6.pom
[windows-jdk9] [INFO] Downloaded: https://repo.maven.apache.org/maven2/org/apache/maven/doxia/doxia-logging-api/1.6/doxia-logging-api-1.6.pom (1.5 kB at 219 kB/s)
[windows-jdk9] [INFO] Downloading: https://repo.maven.apache.org/maven2/org/apache/maven/doxia/doxia/1.6/doxia-1.6.pom
[windows-jdk9] [INFO] Downloaded: https://repo.maven.apache.org/maven2/org/apache/maven/doxia/doxia/1.6/doxia-1.6.pom (19 kB at 1.7 MB/s)
[windows-jdk9] [INFO] Downloading: https://repo.maven.apache.org/maven2/org/apache/maven/doxia/doxia-decoration-model/1.6/doxia-decoration-model-1.6.pom
[windows-jdk9] [INFO] Downloaded: https://repo.maven.apache.org/maven2/org/apache/maven/doxia/doxia-decoration-model/1.6/doxia-decoration-model-1.6.pom (3.0 kB at 428 kB/s)
[windows-jdk9] [INFO] Downloading: https://repo.maven.apache.org/maven2/org/apache/maven/doxia/doxia-sitetools/1.6/doxia-sitetools-1.6.pom
[windows-jdk9] [INFO] Downloaded: https://repo.maven.apache.org/maven2/org/apache/maven/doxia/doxia-sitetools/1.6/doxia-sitetools-1.6.pom (18 kB at 1.4 MB/s)
[windows-jdk9] [INFO] Downloading: https://repo.maven.apache.org/maven2/org/codehaus/plexus/plexus-resources/1.0.1/plexus-resources-1.0.1.pom
[windows-jdk9] [INFO] Downloaded: https://repo.maven.apache.org/maven2/org/codehaus/plexus/plexus-resources/1.0.1/plexus-resources-1.0.1.pom (1.3 kB at 165 kB/s)
[windows-jdk9] [INFO] Downloading: https://repo.maven.apache.org/maven2/com/puppycrawl/tools/checkstyle/6.1.1/checkstyle-6.1.1.pom
[windows-jdk9] [INFO] Downloaded: https://repo.maven.apache.org/maven2/com/puppycrawl/tools/checkstyle/6.1.1/checkstyle-6.1.1.pom (30 kB at 3.0 MB/s)
[windows-jdk9] [INFO] Downloading: https://repo.maven.apache.org/maven2/org/sonatype/oss/oss-parent/7/oss-parent-7.pom
[windows-jdk9] [INFO] Downloaded: https://repo.maven.apache.org/maven2/org/sonatype/oss/oss-parent/7/oss-parent-7.pom (4.8 kB at 804 kB/s)
[windows-jdk9] [INFO] Downloading: https://repo.maven.apache.org/maven2/org/antlr/antlr4-runtime/4.3/antlr4-runtime-4.3.pom
[windows-jdk9] [INFO] Downloaded: https://repo.maven.apache.org/maven2/org/antlr/antlr4-runtime/4.3/antlr4-runtime-4.3.pom (4.8 kB at 684 kB/s)
[windows-jdk9] [INFO] Downloading: https://repo.maven.apache.org/maven2/org/antlr/antlr4-master/4.3/antlr4-master-4.3.pom
[windows-jdk9] [INFO] Downloaded: https://repo.maven.apache.org/maven2/org/antlr/antlr4-master/4.3/antlr4-master-4.3.pom (7.9 kB at 1.1 MB/s)
[windows-jdk9] [INFO] Downloading: https://repo.maven.apache.org/maven2/org/abego/treelayout/org.abego.treelayout.core/1.0.1/org.abego.treelayout.core-1.0.1.pom
[windows-jdk9] [INFO] Downloaded: https://repo.maven.apache.org/maven2/org/abego/treelayout/org.abego.treelayout.core/1.0.1/org.abego.treelayout.core-1.0.1.pom (3.1 kB at 388 kB/s)
[windows-jdk9] [INFO] Downloading: https://repo.maven.apache.org/maven2/org/antlr/antlr4-annotations/4.3/antlr4-annotations-4.3.pom
[windows-jdk9] [INFO] Downloaded: https://repo.maven.apache.org/maven2/org/antlr/antlr4-annotations/4.3/antlr4-annotations-4.3.pom (1.3 kB at 159 kB/s)
[windows-jdk9] [INFO] Downloading: https://repo.maven.apache.org/maven2/commons-beanutils/commons-beanutils-core/1.8.3/commons-beanutils-core-1.8.3.pom
[windows-jdk9] [INFO] Downloaded: https://repo.maven.apache.org/maven2/commons-beanutils/commons-beanutils-core/1.8.3/commons-beanutils-core-1.8.3.pom (1.6 kB at 182 kB/s)
[windows-jdk9] [INFO] Downloading: https://repo.maven.apache.org/maven2/com/google/guava/guava/18.0/guava-18.0.pom
[windows-jdk9] [INFO] Downloaded: https://repo.maven.apache.org/maven2/com/google/guava/guava/18.0/guava-18.0.pom (5.7 kB at 708 kB/s)
[windows-jdk9] [INFO] Downloading: https://repo.maven.apache.org/maven2/com/google/guava/guava-parent/18.0/guava-parent-18.0.pom
[windows-jdk9] [INFO] Downloaded: https://repo.maven.apache.org/maven2/com/google/guava/guava-parent/18.0/guava-parent-18.0.pom (7.7 kB at 961 kB/s)
[windows-jdk9] [INFO] Downloading: https://repo.maven.apache.org/maven2/org/codehaus/plexus/plexus-resources/1.0.1/plexus-resources-1.0.1.jar
[windows-jdk9] [INFO] Downloading: https://repo.maven.apache.org/maven2/com/puppycrawl/tools/checkstyle/6.1.1/checkstyle-6.1.1.jar
[windows-jdk9] [INFO] Downloading: https://repo.maven.apache.org/maven2/org/apache/maven/shared/maven-shared-resources/2/maven-shared-resources-2.jar
[windows-jdk9] [INFO] Downloading: https://repo.maven.apache.org/maven2/org/antlr/antlr4-runtime/4.3/antlr4-runtime-4.3.jar
[windows-jdk9] [INFO] Downloading: https://repo.maven.apache.org/maven2/org/apache/maven/doxia/doxia-integration-tools/1.6/doxia-integration-tools-1.6.jar
[windows-jdk9] [INFO] Downloaded: https://repo.maven.apache.org/maven2/org/apache/maven/doxia/doxia-integration-tools/1.6/doxia-integration-tools-1.6.jar (45 kB at 1.3 MB/s)
[windows-jdk9] [INFO] Downloading: https://repo.maven.apache.org/maven2/org/abego/treelayout/org.abego.treelayout.core/1.0.1/org.abego.treelayout.core-1.0.1.jar
[windows-jdk9] [INFO] Downloaded: https://repo.maven.apache.org/maven2/org/codehaus/plexus/plexus-resources/1.0.1/plexus-resources-1.0.1.jar (22 kB at 547 kB/s)
[windows-jdk9] [INFO] Downloading: https://repo.maven.apache.org/maven2/org/antlr/antlr4-annotations/4.3/antlr4-annotations-4.3.jar
[windows-jdk9] [INFO] Downloaded: https://repo.maven.apache.org/maven2/org/abego/treelayout/org.abego.treelayout.core/1.0.1/org.abego.treelayout.core-1.0.1.jar (26 kB at 622 kB/s)
[windows-jdk9] [INFO] Downloading: https://repo.maven.apache.org/maven2/commons-beanutils/commons-beanutils-core/1.8.3/commons-beanutils-core-1.8.3.jar
[windows-jdk9] [INFO] Downloaded: https://repo.maven.apache.org/maven2/org/apache/maven/shared/maven-shared-resources/2/maven-shared-resources-2.jar (13 kB at 278 kB/s)
[windows-jdk9] [INFO] Downloading: https://repo.maven.apache.org/maven2/com/google/guava/guava/18.0/guava-18.0.jar
[windows-jdk9] [INFO] Downloaded: https://repo.maven.apache.org/maven2/org/antlr/antlr4-runtime/4.3/antlr4-runtime-4.3.jar (345 kB at 7.7 MB/s)
[windows-jdk9] [INFO] Downloading: https://repo.maven.apache.org/maven2/commons-lang/commons-lang/2.1/commons-lang-2.1.jar
[windows-jdk9] [INFO] Downloaded: https://repo.maven.apache.org/maven2/org/antlr/antlr4-annotations/4.3/antlr4-annotations-4.3.jar (10 kB at 202 kB/s)
[windows-jdk9] [INFO] Downloaded: https://repo.maven.apache.org/maven2/commons-lang/commons-lang/2.1/commons-lang-2.1.jar (208 kB at 2.1 MB/s)
[windows-jdk9] [INFO] Downloaded: https://repo.maven.apache.org/maven2/commons-beanutils/commons-beanutils-core/1.8.3/commons-beanutils-core-1.8.3.jar (207 kB at 1.6 MB/s)
[windows-jdk9] [INFO] Downloaded: https://repo.maven.apache.org/maven2/com/puppycrawl/tools/checkstyle/6.1.1/checkstyle-6.1.1.jar (1.0 MB at 6.3 MB/s)
[windows-jdk9] [INFO] Downloaded: https://repo.maven.apache.org/maven2/com/google/guava/guava/18.0/guava-18.0.jar (2.3 MB at 12 MB/s)
[windows-jdk9] [INFO] There are 4 errors reported by Checkstyle 6.1.1 with config/maven_checks.xml ruleset.
[windows-jdk9] [INFO] Ignored 4 errors, 0 violation remaining.
[windows-jdk9] [INFO] 
[windows-jdk9] [INFO] --- maven-invoker-plugin:2.0.0:verify (integration-test) @ maven-javadoc-plugin ---
[windows-jdk9] [INFO] -------------------------------------------------
[windows-jdk9] [INFO] Build Summary:
[windows-jdk9] [INFO]   Passed: 35, Failed: 1, Errors: 0, Skipped: 0
[windows-jdk9] [INFO] -------------------------------------------------
[windows-jdk9] [WARNING] The following builds failed:
[windows-jdk9] [WARNING] *  detectLinks\pom.xml
[windows-jdk9] [INFO] -------------------------------------------------
[windows-jdk9] [WARNING] Ignoring that 1 build failed.
[windows-jdk9] [INFO] ------------------------------------------------------------------------
[windows-jdk9] [INFO] BUILD SUCCESS
[windows-jdk9] [INFO] ------------------------------------------------------------------------
[windows-jdk9] [INFO] Total time: 12:20 min
[windows-jdk9] [INFO] Finished at: 2018-07-16T04:29:50Z
[windows-jdk9] [INFO] Final Memory: 51M/170M
[windows-jdk9] [INFO] ------------------------------------------------------------------------
[windows-jdk9] [INFO] [jenkins-event-spy] Generated F:\jenkins\jenkins-slave\workspace\javadoc-plugin_MJAVADOC-516-Z27AS7O3YE3KP4HN2X3EMP56QPDDJR4P5EBKM2B5MKLXDNLXZ3DA@2@tmp\withMavenb9fe18f9\maven-spy-20180716-041729-9776340355787826681959.log
[Pipeline] [windows-jdk9] }
[Pipeline] [windows-jdk9] // dir
[Pipeline] [windows-jdk9] }
[windows-jdk9] [withMaven] invokerPublisher - Archive invoker results for Maven artifact MavenArtifact{org.apache.maven.plugins:maven-javadoc-plugin::3.0.1-SNAPSHOT(version: 3.0.1-SNAPSHOT, snapshot:false) } generated by PluginInvocation{org.apache.maven.plugins:maven-invoker-plugin:2.0.0@integration-test  integration-test}: m\target\invoker-reports\*.xml
[windows-jdk9] performing MavenInvokerRecorder, reportsFilenamePattern:'**/m\target\invoker-reports/BUILD*.xml', invokerBuildDir:'**/m\target\it'
[windows-jdk9] Found reports:[f:\jenkins\jenkins-slave\workspace\javadoc-plugin_MJAVADOC-516-Z27AS7O3YE3KP4HN2X3EMP56QPDDJR4P5EBKM2B5MKLXDNLXZ3DA@2\m\target\invoker-reports\BUILD-MJAVADOC-110.xml, f:\jenkins\jenkins-slave\workspace\javadoc-plugin_MJAVADOC-516-Z27AS7O3YE3KP4HN2X3EMP56QPDDJR4P5EBKM2B5MKLXDNLXZ3DA@2\m\target\invoker-reports\BUILD-MJAVADOC-126.xml, f:\jenkins\jenkins-slave\workspace\javadoc-plugin_MJAVADOC-516-Z27AS7O3YE3KP4HN2X3EMP56QPDDJR4P5EBKM2B5MKLXDNLXZ3DA@2\m\target\invoker-reports\BUILD-MJAVADOC-137.xml, f:\jenkins\jenkins-slave\workspace\javadoc-plugin_MJAVADOC-516-Z27AS7O3YE3KP4HN2X3EMP56QPDDJR4P5EBKM2B5MKLXDNLXZ3DA@2\m\target\invoker-reports\BUILD-MJAVADOC-172.xml, f:\jenkins\jenkins-slave\workspace\javadoc-plugin_MJAVADOC-516-Z27AS7O3YE3KP4HN2X3EMP56QPDDJR4P5EBKM2B5MKLXDNLXZ3DA@2\m\target\invoker-reports\BUILD-MJAVADOC-180.xml, f:\jenkins\jenkins-slave\workspace\javadoc-plugin_MJAVADOC-516-Z27AS7O3YE3KP4HN2X3EMP56QPDDJR4P5EBKM2B5MKLXDNLXZ3DA@2\m\target\invoker-reports\BUILD-MJAVADOC-194.xml, f:\jenkins\jenkins-slave\workspace\javadoc-plugin_MJAVADOC-516-Z27AS7O3YE3KP4HN2X3EMP56QPDDJR4P5EBKM2B5MKLXDNLXZ3DA@2\m\target\invoker-reports\BUILD-MJAVADOC-250.xml, f:\jenkins\jenkins-slave\workspace\javadoc-plugin_MJAVADOC-516-Z27AS7O3YE3KP4HN2X3EMP56QPDDJR4P5EBKM2B5MKLXDNLXZ3DA@2\m\target\invoker-reports\BUILD-MJAVADOC-257.xml, f:\jenkins\jenkins-slave\workspace\javadoc-plugin_MJAVADOC-516-Z27AS7O3YE3KP4HN2X3EMP56QPDDJR4P5EBKM2B5MKLXDNLXZ3DA@2\m\target\invoker-reports\BUILD-MJAVADOC-259.xml, f:\jenkins\jenkins-slave\workspace\javadoc-plugin_MJAVADOC-516-Z27AS7O3YE3KP4HN2X3EMP56QPDDJR4P5EBKM2B5MKLXDNLXZ3DA@2\m\target\invoker-reports\BUILD-MJAVADOC-262.xml, f:\jenkins\jenkins-slave\workspace\javadoc-plugin_MJAVADOC-516-Z27AS7O3YE3KP4HN2X3EMP56QPDDJR4P5EBKM2B5MKLXDNLXZ3DA@2\m\target\invoker-reports\BUILD-MJAVADOC-275.xml, f:\jenkins\jenkins-slave\workspace\javadoc-plugin_MJAVADOC-516-Z27AS7O3YE3KP4HN2X3EMP56QPDDJR4P5EBKM2B5MKLXDNLXZ3DA@2\m\target\invoker-reports\BUILD-MJAVADOC-278.xml, f:\jenkins\jenkins-slave\workspace\javadoc-plugin_MJAVADOC-516-Z27AS7O3YE3KP4HN2X3EMP56QPDDJR4P5EBKM2B5MKLXDNLXZ3DA@2\m\target\invoker-reports\BUILD-MJAVADOC-320.xml, f:\jenkins\jenkins-slave\workspace\javadoc-plugin_MJAVADOC-516-Z27AS7O3YE3KP4HN2X3EMP56QPDDJR4P5EBKM2B5MKLXDNLXZ3DA@2\m\target\invoker-reports\BUILD-MJAVADOC-325.xml, f:\jenkins\jenkins-slave\workspace\javadoc-plugin_MJAVADOC-516-Z27AS7O3YE3KP4HN2X3EMP56QPDDJR4P5EBKM2B5MKLXDNLXZ3DA@2\m\target\invoker-reports\BUILD-MJAVADOC-365.xml, f:\jenkins\jenkins-slave\workspace\javadoc-plugin_MJAVADOC-516-Z27AS7O3YE3KP4HN2X3EMP56QPDDJR4P5EBKM2B5MKLXDNLXZ3DA@2\m\target\invoker-reports\BUILD-MJAVADOC-369.xml, f:\jenkins\jenkins-slave\workspace\javadoc-plugin_MJAVADOC-516-Z27AS7O3YE3KP4HN2X3EMP56QPDDJR4P5EBKM2B5MKLXDNLXZ3DA@2\m\target\invoker-reports\BUILD-MJAVADOC-384.xml, f:\jenkins\jenkins-slave\workspace\javadoc-plugin_MJAVADOC-516-Z27AS7O3YE3KP4HN2X3EMP56QPDDJR4P5EBKM2B5MKLXDNLXZ3DA@2\m\target\invoker-reports\BUILD-MJAVADOC-407.xml, f:\jenkins\jenkins-slave\workspace\javadoc-plugin_MJAVADOC-516-Z27AS7O3YE3KP4HN2X3EMP56QPDDJR4P5EBKM2B5MKLXDNLXZ3DA@2\m\target\invoker-reports\BUILD-MJAVADOC-414.xml, f:\jenkins\jenkins-slave\workspace\javadoc-plugin_MJAVADOC-516-Z27AS7O3YE3KP4HN2X3EMP56QPDDJR4P5EBKM2B5MKLXDNLXZ3DA@2\m\target\invoker-reports\BUILD-MJAVADOC-427.xml, f:\jenkins\jenkins-slave\workspace\javadoc-plugin_MJAVADOC-516-Z27AS7O3YE3KP4HN2X3EMP56QPDDJR4P5EBKM2B5MKLXDNLXZ3DA@2\m\target\invoker-reports\BUILD-MJAVADOC-437.xml, f:\jenkins\jenkins-slave\workspace\javadoc-plugin_MJAVADOC-516-Z27AS7O3YE3KP4HN2X3EMP56QPDDJR4P5EBKM2B5MKLXDNLXZ3DA@2\m\target\invoker-reports\BUILD-MJAVADOC-494_aggregate-repositories.xml, f:\jenkins\jenkins-slave\workspace\javadoc-plugin_MJAVADOC-516-Z27AS7O3YE3KP4HN2X3EMP56QPDDJR4P5EBKM2B5MKLXDNLXZ3DA@2\m\target\invoker-reports\BUILD-MJAVADOC-497.xml, f:\jenkins\jenkins-slave\workspace\javadoc-plugin_MJAVADOC-516-Z27AS7O3YE3KP4HN2X3EMP56QPDDJR4P5EBKM2B5MKLXDNLXZ3DA@2\m\target\invoker-reports\BUILD-MJAVADOC-498_aggr_modulepath.xml, f:\jenkins\jenkins-slave\workspace\javadoc-plugin_MJAVADOC-516-Z27AS7O3YE3KP4HN2X3EMP56QPDDJR4P5EBKM2B5MKLXDNLXZ3DA@2\m\target\invoker-reports\BUILD-MJAVADOC-498_mm_modulepath.xml, f:\jenkins\jenkins-slave\workspace\javadoc-plugin_MJAVADOC-516-Z27AS7O3YE3KP4HN2X3EMP56QPDDJR4P5EBKM2B5MKLXDNLXZ3DA@2\m\target\invoker-reports\BUILD-MJAVADOC-498_modulepath.xml, f:\jenkins\jenkins-slave\workspace\javadoc-plugin_MJAVADOC-516-Z27AS7O3YE3KP4HN2X3EMP56QPDDJR4P5EBKM2B5MKLXDNLXZ3DA@2\m\target\invoker-reports\BUILD-MJAVADOC-508.xml, f:\jenkins\jenkins-slave\workspace\javadoc-plugin_MJAVADOC-516-Z27AS7O3YE3KP4HN2X3EMP56QPDDJR4P5EBKM2B5MKLXDNLXZ3DA@2\m\target\invoker-reports\BUILD-additional-dependencies-non-aggregate.xml, f:\jenkins\jenkins-slave\workspace\javadoc-plugin_MJAVADOC-516-Z27AS7O3YE3KP4HN2X3EMP56QPDDJR4P5EBKM2B5MKLXDNLXZ3DA@2\m\target\invoker-reports\BUILD-additional-dependencies.xml, f:\jenkins\jenkins-slave\workspace\javadoc-plugin_MJAVADOC-516-Z27AS7O3YE3KP4HN2X3EMP56QPDDJR4P5EBKM2B5MKLXDNLXZ3DA@2\m\target\invoker-reports\BUILD-dependencySource-1.xml, f:\jenkins\jenkins-slave\workspace\javadoc-plugin_MJAVADOC-516-Z27AS7O3YE3KP4HN2X3EMP56QPDDJR4P5EBKM2B5MKLXDNLXZ3DA@2\m\target\invoker-reports\BUILD-dependencySource-2.xml, f:\jenkins\jenkins-slave\workspace\javadoc-plugin_MJAVADOC-516-Z27AS7O3YE3KP4HN2X3EMP56QPDDJR4P5EBKM2B5MKLXDNLXZ3DA@2\m\target\invoker-reports\BUILD-dependencySource-3.xml, f:\jenkins\jenkins-slave\workspace\javadoc-plugin_MJAVADOC-516-Z27AS7O3YE3KP4HN2X3EMP56QPDDJR4P5EBKM2B5MKLXDNLXZ3DA@2\m\target\invoker-reports\BUILD-dependencySource-4.xml, f:\jenkins\jenkins-slave\workspace\javadoc-plugin_MJAVADOC-516-Z27AS7O3YE3KP4HN2X3EMP56QPDDJR4P5EBKM2B5MKLXDNLXZ3DA@2\m\target\invoker-reports\BUILD-detectLinks.xml, f:\jenkins\jenkins-slave\workspace\javadoc-plugin_MJAVADOC-516-Z27AS7O3YE3KP4HN2X3EMP56QPDDJR4P5EBKM2B5MKLXDNLXZ3DA@2\m\target\invoker-reports\BUILD-javadoc-fix.xml, f:\jenkins\jenkins-slave\workspace\javadoc-plugin_MJAVADOC-516-Z27AS7O3YE3KP4HN2X3EMP56QPDDJR4P5EBKM2B5MKLXDNLXZ3DA@2\m\target\invoker-reports\BUILD-site-failOnError.xml]
[windows-jdk9] Found logs:[f:\jenkins\jenkins-slave\workspace\javadoc-plugin_MJAVADOC-516-Z27AS7O3YE3KP4HN2X3EMP56QPDDJR4P5EBKM2B5MKLXDNLXZ3DA@2\m\target\it\MJAVADOC-110\build.log, f:\jenkins\jenkins-slave\workspace\javadoc-plugin_MJAVADOC-516-Z27AS7O3YE3KP4HN2X3EMP56QPDDJR4P5EBKM2B5MKLXDNLXZ3DA@2\m\target\it\MJAVADOC-126\build.log, f:\jenkins\jenkins-slave\workspace\javadoc-plugin_MJAVADOC-516-Z27AS7O3YE3KP4HN2X3EMP56QPDDJR4P5EBKM2B5MKLXDNLXZ3DA@2\m\target\it\MJAVADOC-137\build.log, f:\jenkins\jenkins-slave\workspace\javadoc-plugin_MJAVADOC-516-Z27AS7O3YE3KP4HN2X3EMP56QPDDJR4P5EBKM2B5MKLXDNLXZ3DA@2\m\target\it\MJAVADOC-172\build.log, f:\jenkins\jenkins-slave\workspace\javadoc-plugin_MJAVADOC-516-Z27AS7O3YE3KP4HN2X3EMP56QPDDJR4P5EBKM2B5MKLXDNLXZ3DA@2\m\target\it\MJAVADOC-180\build.log, f:\jenkins\jenkins-slave\workspace\javadoc-plugin_MJAVADOC-516-Z27AS7O3YE3KP4HN2X3EMP56QPDDJR4P5EBKM2B5MKLXDNLXZ3DA@2\m\target\it\MJAVADOC-194\build.log, f:\jenkins\jenkins-slave\workspace\javadoc-plugin_MJAVADOC-516-Z27AS7O3YE3KP4HN2X3EMP56QPDDJR4P5EBKM2B5MKLXDNLXZ3DA@2\m\target\it\MJAVADOC-250\build.log, f:\jenkins\jenkins-slave\workspace\javadoc-plugin_MJAVADOC-516-Z27AS7O3YE3KP4HN2X3EMP56QPDDJR4P5EBKM2B5MKLXDNLXZ3DA@2\m\target\it\MJAVADOC-257\build.log, f:\jenkins\jenkins-slave\workspace\javadoc-plugin_MJAVADOC-516-Z27AS7O3YE3KP4HN2X3EMP56QPDDJR4P5EBKM2B5MKLXDNLXZ3DA@2\m\target\it\MJAVADOC-259\build.log, f:\jenkins\jenkins-slave\workspace\javadoc-plugin_MJAVADOC-516-Z27AS7O3YE3KP4HN2X3EMP56QPDDJR4P5EBKM2B5MKLXDNLXZ3DA@2\m\target\it\MJAVADOC-262\build.log, f:\jenkins\jenkins-slave\workspace\javadoc-plugin_MJAVADOC-516-Z27AS7O3YE3KP4HN2X3EMP56QPDDJR4P5EBKM2B5MKLXDNLXZ3DA@2\m\target\it\MJAVADOC-275\build.log, f:\jenkins\jenkins-slave\workspace\javadoc-plugin_MJAVADOC-516-Z27AS7O3YE3KP4HN2X3EMP56QPDDJR4P5EBKM2B5MKLXDNLXZ3DA@2\m\target\it\MJAVADOC-278\build.log, f:\jenkins\jenkins-slave\workspace\javadoc-plugin_MJAVADOC-516-Z27AS7O3YE3KP4HN2X3EMP56QPDDJR4P5EBKM2B5MKLXDNLXZ3DA@2\m\target\it\MJAVADOC-320\build.log, f:\jenkins\jenkins-slave\workspace\javadoc-plugin_MJAVADOC-516-Z27AS7O3YE3KP4HN2X3EMP56QPDDJR4P5EBKM2B5MKLXDNLXZ3DA@2\m\target\it\MJAVADOC-325\build.log, f:\jenkins\jenkins-slave\workspace\javadoc-plugin_MJAVADOC-516-Z27AS7O3YE3KP4HN2X3EMP56QPDDJR4P5EBKM2B5MKLXDNLXZ3DA@2\m\target\it\MJAVADOC-365\build.log, f:\jenkins\jenkins-slave\workspace\javadoc-plugin_MJAVADOC-516-Z27AS7O3YE3KP4HN2X3EMP56QPDDJR4P5EBKM2B5MKLXDNLXZ3DA@2\m\target\it\MJAVADOC-369\build.log, f:\jenkins\jenkins-slave\workspace\javadoc-plugin_MJAVADOC-516-Z27AS7O3YE3KP4HN2X3EMP56QPDDJR4P5EBKM2B5MKLXDNLXZ3DA@2\m\target\it\MJAVADOC-384\build.log, f:\jenkins\jenkins-slave\workspace\javadoc-plugin_MJAVADOC-516-Z27AS7O3YE3KP4HN2X3EMP56QPDDJR4P5EBKM2B5MKLXDNLXZ3DA@2\m\target\it\MJAVADOC-407\build.log, f:\jenkins\jenkins-slave\workspace\javadoc-plugin_MJAVADOC-516-Z27AS7O3YE3KP4HN2X3EMP56QPDDJR4P5EBKM2B5MKLXDNLXZ3DA@2\m\target\it\MJAVADOC-414\build.log, f:\jenkins\jenkins-slave\workspace\javadoc-plugin_MJAVADOC-516-Z27AS7O3YE3KP4HN2X3EMP56QPDDJR4P5EBKM2B5MKLXDNLXZ3DA@2\m\target\it\MJAVADOC-427\build.log, f:\jenkins\jenkins-slave\workspace\javadoc-plugin_MJAVADOC-516-Z27AS7O3YE3KP4HN2X3EMP56QPDDJR4P5EBKM2B5MKLXDNLXZ3DA@2\m\target\it\MJAVADOC-437\build.log, f:\jenkins\jenkins-slave\workspace\javadoc-plugin_MJAVADOC-516-Z27AS7O3YE3KP4HN2X3EMP56QPDDJR4P5EBKM2B5MKLXDNLXZ3DA@2\m\target\it\MJAVADOC-494_aggregate-repositories\build.log, f:\jenkins\jenkins-slave\workspace\javadoc-plugin_MJAVADOC-516-Z27AS7O3YE3KP4HN2X3EMP56QPDDJR4P5EBKM2B5MKLXDNLXZ3DA@2\m\target\it\MJAVADOC-497\build.log, f:\jenkins\jenkins-slave\workspace\javadoc-plugin_MJAVADOC-516-Z27AS7O3YE3KP4HN2X3EMP56QPDDJR4P5EBKM2B5MKLXDNLXZ3DA@2\m\target\it\MJAVADOC-498_aggr_modulepath\build.log, f:\jenkins\jenkins-slave\workspace\javadoc-plugin_MJAVADOC-516-Z27AS7O3YE3KP4HN2X3EMP56QPDDJR4P5EBKM2B5MKLXDNLXZ3DA@2\m\target\it\MJAVADOC-498_mm_modulepath\build.log, f:\jenkins\jenkins-slave\workspace\javadoc-plugin_MJAVADOC-516-Z27AS7O3YE3KP4HN2X3EMP56QPDDJR4P5EBKM2B5MKLXDNLXZ3DA@2\m\target\it\MJAVADOC-498_modulepath\build.log, f:\jenkins\jenkins-slave\workspace\javadoc-plugin_MJAVADOC-516-Z27AS7O3YE3KP4HN2X3EMP56QPDDJR4P5EBKM2B5MKLXDNLXZ3DA@2\m\target\it\MJAVADOC-508\build.log, f:\jenkins\jenkins-slave\workspace\javadoc-plugin_MJAVADOC-516-Z27AS7O3YE3KP4HN2X3EMP56QPDDJR4P5EBKM2B5MKLXDNLXZ3DA@2\m\target\it\additional-dependencies-non-aggregate\build.log, f:\jenkins\jenkins-slave\workspace\javadoc-plugin_MJAVADOC-516-Z27AS7O3YE3KP4HN2X3EMP56QPDDJR4P5EBKM2B5MKLXDNLXZ3DA@2\m\target\it\additional-dependencies\build.log, f:\jenkins\jenkins-slave\workspace\javadoc-plugin_MJAVADOC-516-Z27AS7O3YE3KP4HN2X3EMP56QPDDJR4P5EBKM2B5MKLXDNLXZ3DA@2\m\target\it\dependencySource-1\build.log, f:\jenkins\jenkins-slave\workspace\javadoc-plugin_MJAVADOC-516-Z27AS7O3YE3KP4HN2X3EMP56QPDDJR4P5EBKM2B5MKLXDNLXZ3DA@2\m\target\it\dependencySource-2\build.log, f:\jenkins\jenkins-slave\workspace\javadoc-plugin_MJAVADOC-516-Z27AS7O3YE3KP4HN2X3EMP56QPDDJR4P5EBKM2B5MKLXDNLXZ3DA@2\m\target\it\dependencySource-3\build.log, f:\jenkins\jenkins-slave\workspace\javadoc-plugin_MJAVADOC-516-Z27AS7O3YE3KP4HN2X3EMP56QPDDJR4P5EBKM2B5MKLXDNLXZ3DA@2\m\target\it\dependencySource-4\build.log, f:\jenkins\jenkins-slave\workspace\javadoc-plugin_MJAVADOC-516-Z27AS7O3YE3KP4HN2X3EMP56QPDDJR4P5EBKM2B5MKLXDNLXZ3DA@2\m\target\it\detectLinks\build.log, f:\jenkins\jenkins-slave\workspace\javadoc-plugin_MJAVADOC-516-Z27AS7O3YE3KP4HN2X3EMP56QPDDJR4P5EBKM2B5MKLXDNLXZ3DA@2\m\target\it\javadoc-fix\build.log, f:\jenkins\jenkins-slave\workspace\javadoc-plugin_MJAVADOC-516-Z27AS7O3YE3KP4HN2X3EMP56QPDDJR4P5EBKM2B5MKLXDNLXZ3DA@2\m\target\it\site-failOnError\build.log]
[windows-jdk9] Finished parsing Maven Invoker results (found 36)
[windows-jdk9] [withMaven] junitPublisher - Archive test results for Maven artifact org.apache.maven.plugins:maven-javadoc-plugin:3.0.1-SNAPSHOT generated by maven-surefire-plugin:test (default-test): m\target\surefire-reports\*.xml
[windows-jdk9] Recording test results
[Pipeline] [windows-jdk9] // withMaven
[Pipeline] [windows-jdk9] }
[Pipeline] [windows-jdk9] // stage
[Pipeline] [windows-jdk9] }
[Pipeline] [windows-jdk9] // node
[Pipeline] [windows-jdk9] }
[Pipeline] // parallel
[Pipeline] stage
[Pipeline] { (Notifications)
[Pipeline] echo
Build result: FAILURE
[Pipeline] jiraIssueSelector
Mime
  • Unnamed multipart/mixed (inline, None, 0 bytes)
View raw message