maven-notifications mailing list archives

Site index · List index
Message view « Date » · « Thread »
Top « Date » · « Thread »
From Apache Jenkins Server <jenk...@builds.apache.org>
Subject Build unstable in Jenkins: Maven TLP » maven-javadoc-plugin » MJAVADOC-521 #10
Date Tue, 03 Jul 2018 04:24:26 GMT
See https://builds.apache.org/job/maven-box/job/maven-javadoc-plugin/job/MJAVADOC-521/10/

Changes:

* Add Java 11-ea
* Add jdkForMaven and mavenForJdk methods Use reqexp for version matching
* regex in switch/case are full match, not partial match
* Update JDKs
* Looks like the API has changed.
* Try to fix it.
* auto deploy if we are currently on master branch
* revert as it seems to fail on jenkins asf
* revert this one as well
* enable TLS 1.2 for Java 7
* TLSv1.x being deactivated since June. So only TLSv1.2 is valid for
* Add asfMavenTlpPlgnBuild to run plugins with multiple Maven versions
* Add maven version to stageId
* Add removeFromCollection() due to RejectedAccessException on
* Scripts not permitted to use method java.util.Collection stream
* Pass 'first'
* Ensure at least minimum required Java version is used
* builds.a.o doesn't have a Maven 3.1.x
* Pass 'failfast'
* Pass 'failingFast'
* Set https.protocols for Java7
* Make failingFast global variable
* Introduce a shared taskContext to keep track of failures
* Make taskContext accessible for try-catch
* Ensure tasks on the same Jenkins instance don't block each others
* dir('m') was used twice
* Also run site goal
* Remove unused parameter
* Disable site plan, doesn't work with multimodules

24 tests failed.
FAILED:  org.apache.maven.plugins.javadoc.FixJavadocMojoTest.testFix

Error Message:
Error when invoking Maven, consult the invoker log file: f:\jenkins\jenkins-slave\workspace\javadoc-plugin_MJAVADOC-521-4VCCRI6KPRH73A3RWPEXQVQHXBYIUVYDLQPEN3Z2IPPUYMQWLG3Q\m\target\invoker\FixJavadocMojoTest1634305865.txt

Stack Trace:
org.apache.maven.shared.invoker.MavenInvocationException: Error when invoking Maven, consult the invoker log file: f:\jenkins\jenkins-slave\workspace\javadoc-plugin_MJAVADOC-521-4VCCRI6KPRH73A3RWPEXQVQHXBYIUVYDLQPEN3Z2IPPUYMQWLG3Q\m\target\invoker\FixJavadocMojoTest1634305865.txt
	at org.apache.maven.plugins.javadoc.FixJavadocMojoTest.invokeCompileGoal(FixJavadocMojoTest.java:660)
	at org.apache.maven.plugins.javadoc.FixJavadocMojoTest.executeMojoAndTest(FixJavadocMojoTest.java:619)
	at org.apache.maven.plugins.javadoc.FixJavadocMojoTest.testFix(FixJavadocMojoTest.java:141)


FAILED:  org.apache.maven.plugins.javadoc.FixJavadocMojoTest.testFixJdk5

Error Message:
Error when invoking Maven, consult the invoker log file: f:\jenkins\jenkins-slave\workspace\javadoc-plugin_MJAVADOC-521-4VCCRI6KPRH73A3RWPEXQVQHXBYIUVYDLQPEN3Z2IPPUYMQWLG3Q\m\target\invoker\FixJavadocMojoTest568411827.txt

Stack Trace:
org.apache.maven.shared.invoker.MavenInvocationException: Error when invoking Maven, consult the invoker log file: f:\jenkins\jenkins-slave\workspace\javadoc-plugin_MJAVADOC-521-4VCCRI6KPRH73A3RWPEXQVQHXBYIUVYDLQPEN3Z2IPPUYMQWLG3Q\m\target\invoker\FixJavadocMojoTest568411827.txt
	at org.apache.maven.plugins.javadoc.FixJavadocMojoTest.invokeCompileGoal(FixJavadocMojoTest.java:660)
	at org.apache.maven.plugins.javadoc.FixJavadocMojoTest.executeMojoAndTest(FixJavadocMojoTest.java:619)
	at org.apache.maven.plugins.javadoc.FixJavadocMojoTest.testFixJdk5(FixJavadocMojoTest.java:159)


FAILED:  org.apache.maven.plugins.javadoc.FixJavadocMojoTest.testFixJdk6

Error Message:
Error when invoking Maven, consult the invoker log file: f:\jenkins\jenkins-slave\workspace\javadoc-plugin_MJAVADOC-521-4VCCRI6KPRH73A3RWPEXQVQHXBYIUVYDLQPEN3Z2IPPUYMQWLG3Q\m\target\invoker\FixJavadocMojoTest935394771.txt

Stack Trace:
org.apache.maven.shared.invoker.MavenInvocationException: Error when invoking Maven, consult the invoker log file: f:\jenkins\jenkins-slave\workspace\javadoc-plugin_MJAVADOC-521-4VCCRI6KPRH73A3RWPEXQVQHXBYIUVYDLQPEN3Z2IPPUYMQWLG3Q\m\target\invoker\FixJavadocMojoTest935394771.txt
	at org.apache.maven.plugins.javadoc.FixJavadocMojoTest.invokeCompileGoal(FixJavadocMojoTest.java:660)
	at org.apache.maven.plugins.javadoc.FixJavadocMojoTest.executeMojoAndTest(FixJavadocMojoTest.java:619)
	at org.apache.maven.plugins.javadoc.FixJavadocMojoTest.testFixJdk6(FixJavadocMojoTest.java:170)


FAILED:  org.apache.maven.plugins.javadoc.FixJavadocMojoTest.testFix

Error Message:
Error when invoking Maven, consult the invoker log file: /home/jenkins/jenkins-slave/workspace/javadoc-plugin_MJAVADOC-521-4VCCRI6KPRH73A3RWPEXQVQHXBYIUVYDLQPEN3Z2IPPUYMQWLG3Q/m/target/invoker/FixJavadocMojoTest914037780.txt

Stack Trace:
org.apache.maven.shared.invoker.MavenInvocationException: Error when invoking Maven, consult the invoker log file: /home/jenkins/jenkins-slave/workspace/javadoc-plugin_MJAVADOC-521-4VCCRI6KPRH73A3RWPEXQVQHXBYIUVYDLQPEN3Z2IPPUYMQWLG3Q/m/target/invoker/FixJavadocMojoTest914037780.txt
	at org.apache.maven.plugins.javadoc.FixJavadocMojoTest.invokeCompileGoal(FixJavadocMojoTest.java:660)
	at org.apache.maven.plugins.javadoc.FixJavadocMojoTest.executeMojoAndTest(FixJavadocMojoTest.java:619)
	at org.apache.maven.plugins.javadoc.FixJavadocMojoTest.testFix(FixJavadocMojoTest.java:141)


FAILED:  org.apache.maven.plugins.javadoc.FixJavadocMojoTest.testFixJdk5

Error Message:
Error when invoking Maven, consult the invoker log file: /home/jenkins/jenkins-slave/workspace/javadoc-plugin_MJAVADOC-521-4VCCRI6KPRH73A3RWPEXQVQHXBYIUVYDLQPEN3Z2IPPUYMQWLG3Q/m/target/invoker/FixJavadocMojoTest1331564181.txt

Stack Trace:
org.apache.maven.shared.invoker.MavenInvocationException: Error when invoking Maven, consult the invoker log file: /home/jenkins/jenkins-slave/workspace/javadoc-plugin_MJAVADOC-521-4VCCRI6KPRH73A3RWPEXQVQHXBYIUVYDLQPEN3Z2IPPUYMQWLG3Q/m/target/invoker/FixJavadocMojoTest1331564181.txt
	at org.apache.maven.plugins.javadoc.FixJavadocMojoTest.invokeCompileGoal(FixJavadocMojoTest.java:660)
	at org.apache.maven.plugins.javadoc.FixJavadocMojoTest.executeMojoAndTest(FixJavadocMojoTest.java:619)
	at org.apache.maven.plugins.javadoc.FixJavadocMojoTest.testFixJdk5(FixJavadocMojoTest.java:159)


FAILED:  org.apache.maven.plugins.javadoc.FixJavadocMojoTest.testFixJdk6

Error Message:
Error when invoking Maven, consult the invoker log file: /home/jenkins/jenkins-slave/workspace/javadoc-plugin_MJAVADOC-521-4VCCRI6KPRH73A3RWPEXQVQHXBYIUVYDLQPEN3Z2IPPUYMQWLG3Q/m/target/invoker/FixJavadocMojoTest1693903502.txt

Stack Trace:
org.apache.maven.shared.invoker.MavenInvocationException: Error when invoking Maven, consult the invoker log file: /home/jenkins/jenkins-slave/workspace/javadoc-plugin_MJAVADOC-521-4VCCRI6KPRH73A3RWPEXQVQHXBYIUVYDLQPEN3Z2IPPUYMQWLG3Q/m/target/invoker/FixJavadocMojoTest1693903502.txt
	at org.apache.maven.plugins.javadoc.FixJavadocMojoTest.invokeCompileGoal(FixJavadocMojoTest.java:660)
	at org.apache.maven.plugins.javadoc.FixJavadocMojoTest.executeMojoAndTest(FixJavadocMojoTest.java:619)
	at org.apache.maven.plugins.javadoc.FixJavadocMojoTest.testFixJdk6(FixJavadocMojoTest.java:170)


FAILED:  org.apache.maven.plugins.javadoc.FixJavadocMojoTest.testFix

Error Message:
null

Stack Trace:
java.lang.NullPointerException
	at org.apache.maven.plugins.javadoc.FixJavadocMojoTest.executeMojoAndTest(FixJavadocMojoTest.java:622)
	at org.apache.maven.plugins.javadoc.FixJavadocMojoTest.testFix(FixJavadocMojoTest.java:141)


FAILED:  org.apache.maven.plugins.javadoc.FixJavadocMojoTest.testRemoveUnknownExceptions

Error Message:
null

Stack Trace:
java.lang.NullPointerException
	at org.apache.maven.plugins.javadoc.FixJavadocMojoTest.testRemoveUnknownExceptions(FixJavadocMojoTest.java:576)


FAILED:  org.apache.maven.plugins.javadoc.FixJavadocMojoTest.testFix

Error Message:
null

Stack Trace:
java.lang.NullPointerException
	at org.apache.maven.plugins.javadoc.FixJavadocMojoTest.executeMojoAndTest(FixJavadocMojoTest.java:622)
	at org.apache.maven.plugins.javadoc.FixJavadocMojoTest.testFix(FixJavadocMojoTest.java:141)


FAILED:  org.apache.maven.plugins.javadoc.FixJavadocMojoTest.testRemoveUnknownExceptions

Error Message:
null

Stack Trace:
java.lang.NullPointerException
	at org.apache.maven.plugins.javadoc.FixJavadocMojoTest.testRemoveUnknownExceptions(FixJavadocMojoTest.java:576)


FAILED:  org.apache.maven.plugins.javadoc.JavadocReportTest.testTagletArtifacts

Error Message:
expected:<20> but was:<0>

Stack Trace:
junit.framework.AssertionFailedError: expected:<20> but was:<0>
	at org.apache.maven.plugins.javadoc.JavadocReportTest.testTagletArtifacts(JavadocReportTest.java:1044)


FAILED:  org.apache.maven.plugins.javadoc.JavadocReportTest.testTaglets

Error Message:
An error has occurred in Javadoc report generation: 
Exit code: 1 - Picked up JAVA_TOOL_OPTIONS: -Dmaven.ext.class.path="f:\jenkins\jenkins-slave\workspace\javadoc-plugin_MJAVADOC-521-4VCCRI6KPRH73A3RWPEXQVQHXBYIUVYDLQPEN3Z2IPPUYMQWLG3Q@tmp\withMaven090bf7a3\pipeline-maven-spy.jar" -Dorg.jenkinsci.plugins.pipeline.maven.reportsFolder="f:\jenkins\jenkins-slave\workspace\javadoc-plugin_MJAVADOC-521-4VCCRI6KPRH73A3RWPEXQVQHXBYIUVYDLQPEN3Z2IPPUYMQWLG3Q@tmp\withMaven090bf7a3" 
javadoc: error - An internal exception has occurred. 
 (java.lang.NoClassDefFoundError: com/sun/tools/doclets/Taglet)
Please file a bug against the javadoc tool via the Java bug reporting page
(http://bugreport.java.com) after checking the Bug Database (http://bugs.java.com)
for duplicates. Include error messages and the following diagnostic in your report. Thank you.
java.lang.NoClassDefFoundError: com/sun/tools/doclets/Taglet
 at java.base/java.lang.ClassLoader.defineClass1(Native Method)
 at java.base/java.lang.ClassLoader.defineClass(ClassLoader.java:1009)
 at java.base/java.security.SecureClassLoader.defineClass(SecureClassLoader.java:174)
 at java.base/java.net.URLClassLoader.defineClass(URLClassLoader.java:545)
 at java.base/java.net.URLClassLoader.access$100(URLClassLoader.java:83)
 at java.base/java.net.URLClassLoader$1.run(URLClassLoader.java:453)
 at java.base/java.net.URLClassLoader$1.run(URLClassLoader.java:447)
 at java.base/java.security.AccessController.doPrivileged(Native Method)
 at java.base/java.net.URLClassLoader.findClass(URLClassLoader.java:446)
 at java.base/java.lang.ClassLoader.loadClass(ClassLoader.java:566)
 at java.base/java.lang.ClassLoader.loadClass(ClassLoader.java:499)
 at java.base/java.lang.ClassLoader.defineClass1(Native Method)
 at java.base/java.lang.ClassLoader.defineClass(ClassLoader.java:1009)
 at java.base/java.security.SecureClassLoader.defineClass(SecureClassLoader.java:174)
 at java.base/java.net.URLClassLoader.defineClass(URLClassLoader.java:545)
 at java.base/java.net.URLClassLoader.access$100(URLClassLoader.java:83)
 at java.base/java.net.URLClassLoader$1.run(URLClassLoader.java:453)
 at java.base/java.net.URLClassLoader$1.run(URLClassLoader.java:447)
 at java.base/java.security.AccessController.doPrivileged(Native Method)
 at java.base/java.net.URLClassLoader.findClass(URLClassLoader.java:446)
 at java.base/java.lang.ClassLoader.loadClass(ClassLoader.java:566)
 at java.base/java.lang.ClassLoader.loadClass(ClassLoader.java:499)
 at jdk.javadoc/jdk.javadoc.internal.doclets.toolkit.taglets.TagletManager.addCustomTag(TagletManager.java:262)
 at jdk.javadoc/jdk.javadoc.internal.doclets.toolkit.BaseConfiguration.initTagletManager(BaseConfiguration.java:786)
 at jdk.javadoc/jdk.javadoc.internal.doclets.toolkit.BaseConfiguration.finishOptionSettings0(BaseConfiguration.java:726)
 at jdk.javadoc/jdk.javadoc.internal.doclets.formats.html.HtmlConfiguration.finishOptionSettings0(HtmlConfiguration.java:867)
 at jdk.javadoc/jdk.javadoc.internal.doclets.toolkit.BaseConfiguration.setOptions(BaseConfiguration.java:747)
 at jdk.javadoc/jdk.javadoc.internal.doclets.toolkit.AbstractDoclet.startGeneration(AbstractDoclet.java:204)
 at jdk.javadoc/jdk.javadoc.internal.doclets.toolkit.AbstractDoclet.run(AbstractDoclet.java:117)
 at jdk.javadoc/jdk.javadoc.doclet.StandardDoclet.run(StandardDoclet.java:72)
 at jdk.javadoc/jdk.javadoc.internal.tool.Start.parseAndExecute(Start.java:581)
 at jdk.javadoc/jdk.javadoc.internal.tool.Start.begin(Start.java:430)
 at jdk.javadoc/jdk.javadoc.internal.tool.Start.begin(Start.java:343)
 at jdk.javadoc/jdk.javadoc.internal.tool.Main.execute(Main.java:63)
 at jdk.javadoc/jdk.javadoc.internal.tool.Main.main(Main.java:52)
Caused by: java.lang.ClassNotFoundException: com.sun.tools.doclets.Taglet
 at java.base/java.net.URLClassLoader.findClass(URLClassLoader.java:466)
 at java.base/java.lang.ClassLoader.loadClass(ClassLoader.java:566)
 at java.base/java.lang.ClassLoader.loadClass(ClassLoader.java:499)
 ... 35 more

Command line was: f:\jenkins\tools\java\latest10\bin\javadoc.exe @options @argfile

Refer to the generated Javadoc files in 'f:\jenkins\jenkins-slave\workspace\javadoc-plugin_MJAVADOC-521-4VCCRI6KPRH73A3RWPEXQVQHXBYIUVYDLQPEN3Z2IPPUYMQWLG3Q\m\target\test\unit\taglet-test\target\site\apidocs' dir.


Stack Trace:
org.apache.maven.plugin.MojoExecutionException: 
An error has occurred in Javadoc report generation: 
Exit code: 1 - Picked up JAVA_TOOL_OPTIONS: -Dmaven.ext.class.path="f:\jenkins\jenkins-slave\workspace\javadoc-plugin_MJAVADOC-521-4VCCRI6KPRH73A3RWPEXQVQHXBYIUVYDLQPEN3Z2IPPUYMQWLG3Q@tmp\withMaven090bf7a3\pipeline-maven-spy.jar" -Dorg.jenkinsci.plugins.pipeline.maven.reportsFolder="f:\jenkins\jenkins-slave\workspace\javadoc-plugin_MJAVADOC-521-4VCCRI6KPRH73A3RWPEXQVQHXBYIUVYDLQPEN3Z2IPPUYMQWLG3Q@tmp\withMaven090bf7a3" 
javadoc: error - An internal exception has occurred. 
	(java.lang.NoClassDefFoundError: com/sun/tools/doclets/Taglet)
Please file a bug against the javadoc tool via the Java bug reporting page
(http://bugreport.java.com) after checking the Bug Database (http://bugs.java.com)
for duplicates. Include error messages and the following diagnostic in your report. Thank you.
java.lang.NoClassDefFoundError: com/sun/tools/doclets/Taglet
	at java.base/java.lang.ClassLoader.defineClass1(Native Method)
	at java.base/java.lang.ClassLoader.defineClass(ClassLoader.java:1009)
	at java.base/java.security.SecureClassLoader.defineClass(SecureClassLoader.java:174)
	at java.base/java.net.URLClassLoader.defineClass(URLClassLoader.java:545)
	at java.base/java.net.URLClassLoader.access$100(URLClassLoader.java:83)
	at java.base/java.net.URLClassLoader$1.run(URLClassLoader.java:453)
	at java.base/java.net.URLClassLoader$1.run(URLClassLoader.java:447)
	at java.base/java.security.AccessController.doPrivileged(Native Method)
	at java.base/java.net.URLClassLoader.findClass(URLClassLoader.java:446)
	at java.base/java.lang.ClassLoader.loadClass(ClassLoader.java:566)
	at java.base/java.lang.ClassLoader.loadClass(ClassLoader.java:499)
	at java.base/java.lang.ClassLoader.defineClass1(Native Method)
	at java.base/java.lang.ClassLoader.defineClass(ClassLoader.java:1009)
	at java.base/java.security.SecureClassLoader.defineClass(SecureClassLoader.java:174)
	at java.base/java.net.URLClassLoader.defineClass(URLClassLoader.java:545)
	at java.base/java.net.URLClassLoader.access$100(URLClassLoader.java:83)
	at java.base/java.net.URLClassLoader$1.run(URLClassLoader.java:453)
	at java.base/java.net.URLClassLoader$1.run(URLClassLoader.java:447)
	at java.base/java.security.AccessController.doPrivileged(Native Method)
	at java.base/java.net.URLClassLoader.findClass(URLClassLoader.java:446)
	at java.base/java.lang.ClassLoader.loadClass(ClassLoader.java:566)
	at java.base/java.lang.ClassLoader.loadClass(ClassLoader.java:499)
	at jdk.javadoc/jdk.javadoc.internal.doclets.toolkit.taglets.TagletManager.addCustomTag(TagletManager.java:262)
	at jdk.javadoc/jdk.javadoc.internal.doclets.toolkit.BaseConfiguration.initTagletManager(BaseConfiguration.java:786)
	at jdk.javadoc/jdk.javadoc.internal.doclets.toolkit.BaseConfiguration.finishOptionSettings0(BaseConfiguration.java:726)
	at jdk.javadoc/jdk.javadoc.internal.doclets.formats.html.HtmlConfiguration.finishOptionSettings0(HtmlConfiguration.java:867)
	at jdk.javadoc/jdk.javadoc.internal.doclets.toolkit.BaseConfiguration.setOptions(BaseConfiguration.java:747)
	at jdk.javadoc/jdk.javadoc.internal.doclets.toolkit.AbstractDoclet.startGeneration(AbstractDoclet.java:204)
	at jdk.javadoc/jdk.javadoc.internal.doclets.toolkit.AbstractDoclet.run(AbstractDoclet.java:117)
	at jdk.javadoc/jdk.javadoc.doclet.StandardDoclet.run(StandardDoclet.java:72)
	at jdk.javadoc/jdk.javadoc.internal.tool.Start.parseAndExecute(Start.java:581)
	at jdk.javadoc/jdk.javadoc.internal.tool.Start.begin(Start.java:430)
	at jdk.javadoc/jdk.javadoc.internal.tool.Start.begin(Start.java:343)
	at jdk.javadoc/jdk.javadoc.internal.tool.Main.execute(Main.java:63)
	at jdk.javadoc/jdk.javadoc.internal.tool.Main.main(Main.java:52)
Caused by: java.lang.ClassNotFoundException: com.sun.tools.doclets.Taglet
	at java.base/java.net.URLClassLoader.findClass(URLClassLoader.java:466)
	at java.base/java.lang.ClassLoader.loadClass(ClassLoader.java:566)
	at java.base/java.lang.ClassLoader.loadClass(ClassLoader.java:499)
	... 35 more

Command line was: f:\jenkins\tools\java\latest10\bin\javadoc.exe @options @argfile

Refer to the generated Javadoc files in 'f:\jenkins\jenkins-slave\workspace\javadoc-plugin_MJAVADOC-521-4VCCRI6KPRH73A3RWPEXQVQHXBYIUVYDLQPEN3Z2IPPUYMQWLG3Q\m\target\test\unit\taglet-test\target\site\apidocs' dir.

	at org.apache.maven.plugins.javadoc.JavadocReportTest.testTaglets(JavadocReportTest.java:559)
Caused by: org.apache.maven.reporting.MavenReportException: 

Exit code: 1 - Picked up JAVA_TOOL_OPTIONS: -Dmaven.ext.class.path="f:\jenkins\jenkins-slave\workspace\javadoc-plugin_MJAVADOC-521-4VCCRI6KPRH73A3RWPEXQVQHXBYIUVYDLQPEN3Z2IPPUYMQWLG3Q@tmp\withMaven090bf7a3\pipeline-maven-spy.jar" -Dorg.jenkinsci.plugins.pipeline.maven.reportsFolder="f:\jenkins\jenkins-slave\workspace\javadoc-plugin_MJAVADOC-521-4VCCRI6KPRH73A3RWPEXQVQHXBYIUVYDLQPEN3Z2IPPUYMQWLG3Q@tmp\withMaven090bf7a3" 
javadoc: error - An internal exception has occurred. 
	(java.lang.NoClassDefFoundError: com/sun/tools/doclets/Taglet)
Please file a bug against the javadoc tool via the Java bug reporting page
(http://bugreport.java.com) after checking the Bug Database (http://bugs.java.com)
for duplicates. Include error messages and the following diagnostic in your report. Thank you.
java.lang.NoClassDefFoundError: com/sun/tools/doclets/Taglet
	at java.base/java.lang.ClassLoader.defineClass1(Native Method)
	at java.base/java.lang.ClassLoader.defineClass(ClassLoader.java:1009)
	at java.base/java.security.SecureClassLoader.defineClass(SecureClassLoader.java:174)
	at java.base/java.net.URLClassLoader.defineClass(URLClassLoader.java:545)
	at java.base/java.net.URLClassLoader.access$100(URLClassLoader.java:83)
	at java.base/java.net.URLClassLoader$1.run(URLClassLoader.java:453)
	at java.base/java.net.URLClassLoader$1.run(URLClassLoader.java:447)
	at java.base/java.security.AccessController.doPrivileged(Native Method)
	at java.base/java.net.URLClassLoader.findClass(URLClassLoader.java:446)
	at java.base/java.lang.ClassLoader.loadClass(ClassLoader.java:566)
	at java.base/java.lang.ClassLoader.loadClass(ClassLoader.java:499)
	at java.base/java.lang.ClassLoader.defineClass1(Native Method)
	at java.base/java.lang.ClassLoader.defineClass(ClassLoader.java:1009)
	at java.base/java.security.SecureClassLoader.defineClass(SecureClassLoader.java:174)
	at java.base/java.net.URLClassLoader.defineClass(URLClassLoader.java:545)
	at java.base/java.net.URLClassLoader.access$100(URLClassLoader.java:83)
	at java.base/java.net.URLClassLoader$1.run(URLClassLoader.java:453)
	at java.base/java.net.URLClassLoader$1.run(URLClassLoader.java:447)
	at java.base/java.security.AccessController.doPrivileged(Native Method)
	at java.base/java.net.URLClassLoader.findClass(URLClassLoader.java:446)
	at java.base/java.lang.ClassLoader.loadClass(ClassLoader.java:566)
	at java.base/java.lang.ClassLoader.loadClass(ClassLoader.java:499)
	at jdk.javadoc/jdk.javadoc.internal.doclets.toolkit.taglets.TagletManager.addCustomTag(TagletManager.java:262)
	at jdk.javadoc/jdk.javadoc.internal.doclets.toolkit.BaseConfiguration.initTagletManager(BaseConfiguration.java:786)
	at jdk.javadoc/jdk.javadoc.internal.doclets.toolkit.BaseConfiguration.finishOptionSettings0(BaseConfiguration.java:726)
	at jdk.javadoc/jdk.javadoc.internal.doclets.formats.html.HtmlConfiguration.finishOptionSettings0(HtmlConfiguration.java:867)
	at jdk.javadoc/jdk.javadoc.internal.doclets.toolkit.BaseConfiguration.setOptions(BaseConfiguration.java:747)
	at jdk.javadoc/jdk.javadoc.internal.doclets.toolkit.AbstractDoclet.startGeneration(AbstractDoclet.java:204)
	at jdk.javadoc/jdk.javadoc.internal.doclets.toolkit.AbstractDoclet.run(AbstractDoclet.java:117)
	at jdk.javadoc/jdk.javadoc.doclet.StandardDoclet.run(StandardDoclet.java:72)
	at jdk.javadoc/jdk.javadoc.internal.tool.Start.parseAndExecute(Start.java:581)
	at jdk.javadoc/jdk.javadoc.internal.tool.Start.begin(Start.java:430)
	at jdk.javadoc/jdk.javadoc.internal.tool.Start.begin(Start.java:343)
	at jdk.javadoc/jdk.javadoc.internal.tool.Main.execute(Main.java:63)
	at jdk.javadoc/jdk.javadoc.internal.tool.Main.main(Main.java:52)
Caused by: java.lang.ClassNotFoundException: com.sun.tools.doclets.Taglet
	at java.base/java.net.URLClassLoader.findClass(URLClassLoader.java:466)
	at java.base/java.lang.ClassLoader.loadClass(ClassLoader.java:566)
	at java.base/java.lang.ClassLoader.loadClass(ClassLoader.java:499)
	... 35 more

Command line was: f:\jenkins\tools\java\latest10\bin\javadoc.exe @options @argfile

Refer to the generated Javadoc files in 'f:\jenkins\jenkins-slave\workspace\javadoc-plugin_MJAVADOC-521-4VCCRI6KPRH73A3RWPEXQVQHXBYIUVYDLQPEN3Z2IPPUYMQWLG3Q\m\target\test\unit\taglet-test\target\site\apidocs' dir.

	at org.apache.maven.plugins.javadoc.JavadocReportTest.testTaglets(JavadocReportTest.java:559)


FAILED:  org.apache.maven.plugins.javadoc.JavadocReportTest.testJavadocResources

Error Message:
null

Stack Trace:
junit.framework.AssertionFailedError
	at org.apache.maven.plugins.javadoc.JavadocReportTest.testJavadocResources(JavadocReportTest.java:673)


FAILED:  org.apache.maven.plugins.javadoc.JavadocReportTest.testQuotedPath

Error Message:
null

Stack Trace:
junit.framework.AssertionFailedError
	at org.apache.maven.plugins.javadoc.JavadocReportTest.testQuotedPath(JavadocReportTest.java:498)


FAILED:  org.apache.maven.plugins.javadoc.JavadocReportTest.testDefaultConfiguration

Error Message:
null

Stack Trace:
junit.framework.AssertionFailedError
	at org.apache.maven.plugins.javadoc.JavadocReportTest.testDefaultConfiguration(JavadocReportTest.java:240)


FAILED:  org.apache.maven.plugins.javadoc.JavadocReportTest.testDocfiles

Error Message:
null

Stack Trace:
junit.framework.AssertionFailedError
	at org.apache.maven.plugins.javadoc.JavadocReportTest.testDocfiles(JavadocReportTest.java:330)


FAILED:  org.apache.maven.plugins.javadoc.JavadocReportTest.testStylesheetfile

Error Message:
null

Stack Trace:
junit.framework.AssertionFailedError
	at org.apache.maven.plugins.javadoc.JavadocReportTest.testStylesheetfile(JavadocReportTest.java:1115)


FAILED:  org.apache.maven.plugins.javadoc.JavadocReportTest.testTagletArtifacts

Error Message:
expected:<20> but was:<0>

Stack Trace:
junit.framework.AssertionFailedError: expected:<20> but was:<0>
	at org.apache.maven.plugins.javadoc.JavadocReportTest.testTagletArtifacts(JavadocReportTest.java:1044)


FAILED:  org.apache.maven.plugins.javadoc.JavadocReportTest.testTaglets

Error Message:
An error has occurred in Javadoc report generation: 
Exit code: 1 - Picked up JAVA_TOOL_OPTIONS: -Dmaven.ext.class.path="/home/jenkins/jenkins-slave/workspace/javadoc-plugin_MJAVADOC-521-4VCCRI6KPRH73A3RWPEXQVQHXBYIUVYDLQPEN3Z2IPPUYMQWLG3Q@2@tmp/withMavenf35dd854/pipeline-maven-spy.jar" -Dorg.jenkinsci.plugins.pipeline.maven.reportsFolder="/home/jenkins/jenkins-slave/workspace/javadoc-plugin_MJAVADOC-521-4VCCRI6KPRH73A3RWPEXQVQHXBYIUVYDLQPEN3Z2IPPUYMQWLG3Q@2@tmp/withMavenf35dd854" 
javadoc: error - An internal exception has occurred. 
 (java.lang.NoClassDefFoundError: com/sun/tools/doclets/Taglet)
Please file a bug against the javadoc tool via the Java bug reporting page
(http://bugreport.java.com) after checking the Bug Database (http://bugs.java.com)
for duplicates. Include error messages and the following diagnostic in your report. Thank you.
java.lang.NoClassDefFoundError: com/sun/tools/doclets/Taglet
 at java.base/java.lang.ClassLoader.defineClass1(Native Method)
 at java.base/java.lang.ClassLoader.defineClass(ClassLoader.java:1009)
 at java.base/java.security.SecureClassLoader.defineClass(SecureClassLoader.java:174)
 at java.base/java.net.URLClassLoader.defineClass(URLClassLoader.java:545)
 at java.base/java.net.URLClassLoader.access$100(URLClassLoader.java:83)
 at java.base/java.net.URLClassLoader$1.run(URLClassLoader.java:453)
 at java.base/java.net.URLClassLoader$1.run(URLClassLoader.java:447)
 at java.base/java.security.AccessController.doPrivileged(Native Method)
 at java.base/java.net.URLClassLoader.findClass(URLClassLoader.java:446)
 at java.base/java.lang.ClassLoader.loadClass(ClassLoader.java:566)
 at java.base/java.lang.ClassLoader.loadClass(ClassLoader.java:499)
 at java.base/java.lang.ClassLoader.defineClass1(Native Method)
 at java.base/java.lang.ClassLoader.defineClass(ClassLoader.java:1009)
 at java.base/java.security.SecureClassLoader.defineClass(SecureClassLoader.java:174)
 at java.base/java.net.URLClassLoader.defineClass(URLClassLoader.java:545)
 at java.base/java.net.URLClassLoader.access$100(URLClassLoader.java:83)
 at java.base/java.net.URLClassLoader$1.run(URLClassLoader.java:453)
 at java.base/java.net.URLClassLoader$1.run(URLClassLoader.java:447)
 at java.base/java.security.AccessController.doPrivileged(Native Method)
 at java.base/java.net.URLClassLoader.findClass(URLClassLoader.java:446)
 at java.base/java.lang.ClassLoader.loadClass(ClassLoader.java:566)
 at java.base/java.lang.ClassLoader.loadClass(ClassLoader.java:499)
 at jdk.javadoc/jdk.javadoc.internal.doclets.toolkit.taglets.TagletManager.addCustomTag(TagletManager.java:262)
 at jdk.javadoc/jdk.javadoc.internal.doclets.toolkit.BaseConfiguration.initTagletManager(BaseConfiguration.java:786)
 at jdk.javadoc/jdk.javadoc.internal.doclets.toolkit.BaseConfiguration.finishOptionSettings0(BaseConfiguration.java:726)
 at jdk.javadoc/jdk.javadoc.internal.doclets.formats.html.HtmlConfiguration.finishOptionSettings0(HtmlConfiguration.java:867)
 at jdk.javadoc/jdk.javadoc.internal.doclets.toolkit.BaseConfiguration.setOptions(BaseConfiguration.java:747)
 at jdk.javadoc/jdk.javadoc.internal.doclets.toolkit.AbstractDoclet.startGeneration(AbstractDoclet.java:204)
 at jdk.javadoc/jdk.javadoc.internal.doclets.toolkit.AbstractDoclet.run(AbstractDoclet.java:117)
 at jdk.javadoc/jdk.javadoc.doclet.StandardDoclet.run(StandardDoclet.java:72)
 at jdk.javadoc/jdk.javadoc.internal.tool.Start.parseAndExecute(Start.java:581)
 at jdk.javadoc/jdk.javadoc.internal.tool.Start.begin(Start.java:430)
 at jdk.javadoc/jdk.javadoc.internal.tool.Start.begin(Start.java:343)
 at jdk.javadoc/jdk.javadoc.internal.tool.Main.execute(Main.java:63)
 at jdk.javadoc/jdk.javadoc.internal.tool.Main.main(Main.java:52)
Caused by: java.lang.ClassNotFoundException: com.sun.tools.doclets.Taglet
 at java.base/java.net.URLClassLoader.findClass(URLClassLoader.java:466)
 at java.base/java.lang.ClassLoader.loadClass(ClassLoader.java:566)
 at java.base/java.lang.ClassLoader.loadClass(ClassLoader.java:499)
 ... 35 more

Command line was: /home/jenkins/tools/java/latest10/bin/javadoc @options @argfile

Refer to the generated Javadoc files in '/home/jenkins/jenkins-slave/workspace/javadoc-plugin_MJAVADOC-521-4VCCRI6KPRH73A3RWPEXQVQHXBYIUVYDLQPEN3Z2IPPUYMQWLG3Q@2/m/target/test/unit/taglet-test/target/site/apidocs' dir.


Stack Trace:
org.apache.maven.plugin.MojoExecutionException: 
An error has occurred in Javadoc report generation: 
Exit code: 1 - Picked up JAVA_TOOL_OPTIONS: -Dmaven.ext.class.path="/home/jenkins/jenkins-slave/workspace/javadoc-plugin_MJAVADOC-521-4VCCRI6KPRH73A3RWPEXQVQHXBYIUVYDLQPEN3Z2IPPUYMQWLG3Q@2@tmp/withMavenf35dd854/pipeline-maven-spy.jar" -Dorg.jenkinsci.plugins.pipeline.maven.reportsFolder="/home/jenkins/jenkins-slave/workspace/javadoc-plugin_MJAVADOC-521-4VCCRI6KPRH73A3RWPEXQVQHXBYIUVYDLQPEN3Z2IPPUYMQWLG3Q@2@tmp/withMavenf35dd854" 
javadoc: error - An internal exception has occurred. 
	(java.lang.NoClassDefFoundError: com/sun/tools/doclets/Taglet)
Please file a bug against the javadoc tool via the Java bug reporting page
(http://bugreport.java.com) after checking the Bug Database (http://bugs.java.com)
for duplicates. Include error messages and the following diagnostic in your report. Thank you.
java.lang.NoClassDefFoundError: com/sun/tools/doclets/Taglet
	at java.base/java.lang.ClassLoader.defineClass1(Native Method)
	at java.base/java.lang.ClassLoader.defineClass(ClassLoader.java:1009)
	at java.base/java.security.SecureClassLoader.defineClass(SecureClassLoader.java:174)
	at java.base/java.net.URLClassLoader.defineClass(URLClassLoader.java:545)
	at java.base/java.net.URLClassLoader.access$100(URLClassLoader.java:83)
	at java.base/java.net.URLClassLoader$1.run(URLClassLoader.java:453)
	at java.base/java.net.URLClassLoader$1.run(URLClassLoader.java:447)
	at java.base/java.security.AccessController.doPrivileged(Native Method)
	at java.base/java.net.URLClassLoader.findClass(URLClassLoader.java:446)
	at java.base/java.lang.ClassLoader.loadClass(ClassLoader.java:566)
	at java.base/java.lang.ClassLoader.loadClass(ClassLoader.java:499)
	at java.base/java.lang.ClassLoader.defineClass1(Native Method)
	at java.base/java.lang.ClassLoader.defineClass(ClassLoader.java:1009)
	at java.base/java.security.SecureClassLoader.defineClass(SecureClassLoader.java:174)
	at java.base/java.net.URLClassLoader.defineClass(URLClassLoader.java:545)
	at java.base/java.net.URLClassLoader.access$100(URLClassLoader.java:83)
	at java.base/java.net.URLClassLoader$1.run(URLClassLoader.java:453)
	at java.base/java.net.URLClassLoader$1.run(URLClassLoader.java:447)
	at java.base/java.security.AccessController.doPrivileged(Native Method)
	at java.base/java.net.URLClassLoader.findClass(URLClassLoader.java:446)
	at java.base/java.lang.ClassLoader.loadClass(ClassLoader.java:566)
	at java.base/java.lang.ClassLoader.loadClass(ClassLoader.java:499)
	at jdk.javadoc/jdk.javadoc.internal.doclets.toolkit.taglets.TagletManager.addCustomTag(TagletManager.java:262)
	at jdk.javadoc/jdk.javadoc.internal.doclets.toolkit.BaseConfiguration.initTagletManager(BaseConfiguration.java:786)
	at jdk.javadoc/jdk.javadoc.internal.doclets.toolkit.BaseConfiguration.finishOptionSettings0(BaseConfiguration.java:726)
	at jdk.javadoc/jdk.javadoc.internal.doclets.formats.html.HtmlConfiguration.finishOptionSettings0(HtmlConfiguration.java:867)
	at jdk.javadoc/jdk.javadoc.internal.doclets.toolkit.BaseConfiguration.setOptions(BaseConfiguration.java:747)
	at jdk.javadoc/jdk.javadoc.internal.doclets.toolkit.AbstractDoclet.startGeneration(AbstractDoclet.java:204)
	at jdk.javadoc/jdk.javadoc.internal.doclets.toolkit.AbstractDoclet.run(AbstractDoclet.java:117)
	at jdk.javadoc/jdk.javadoc.doclet.StandardDoclet.run(StandardDoclet.java:72)
	at jdk.javadoc/jdk.javadoc.internal.tool.Start.parseAndExecute(Start.java:581)
	at jdk.javadoc/jdk.javadoc.internal.tool.Start.begin(Start.java:430)
	at jdk.javadoc/jdk.javadoc.internal.tool.Start.begin(Start.java:343)
	at jdk.javadoc/jdk.javadoc.internal.tool.Main.execute(Main.java:63)
	at jdk.javadoc/jdk.javadoc.internal.tool.Main.main(Main.java:52)
Caused by: java.lang.ClassNotFoundException: com.sun.tools.doclets.Taglet
	at java.base/java.net.URLClassLoader.findClass(URLClassLoader.java:466)
	at java.base/java.lang.ClassLoader.loadClass(ClassLoader.java:566)
	at java.base/java.lang.ClassLoader.loadClass(ClassLoader.java:499)
	... 35 more

Command line was: /home/jenkins/tools/java/latest10/bin/javadoc @options @argfile

Refer to the generated Javadoc files in '/home/jenkins/jenkins-slave/workspace/javadoc-plugin_MJAVADOC-521-4VCCRI6KPRH73A3RWPEXQVQHXBYIUVYDLQPEN3Z2IPPUYMQWLG3Q@2/m/target/test/unit/taglet-test/target/site/apidocs' dir.

	at org.apache.maven.plugins.javadoc.JavadocReportTest.testTaglets(JavadocReportTest.java:559)
Caused by: org.apache.maven.reporting.MavenReportException: 

Exit code: 1 - Picked up JAVA_TOOL_OPTIONS: -Dmaven.ext.class.path="/home/jenkins/jenkins-slave/workspace/javadoc-plugin_MJAVADOC-521-4VCCRI6KPRH73A3RWPEXQVQHXBYIUVYDLQPEN3Z2IPPUYMQWLG3Q@2@tmp/withMavenf35dd854/pipeline-maven-spy.jar" -Dorg.jenkinsci.plugins.pipeline.maven.reportsFolder="/home/jenkins/jenkins-slave/workspace/javadoc-plugin_MJAVADOC-521-4VCCRI6KPRH73A3RWPEXQVQHXBYIUVYDLQPEN3Z2IPPUYMQWLG3Q@2@tmp/withMavenf35dd854" 
javadoc: error - An internal exception has occurred. 
	(java.lang.NoClassDefFoundError: com/sun/tools/doclets/Taglet)
Please file a bug against the javadoc tool via the Java bug reporting page
(http://bugreport.java.com) after checking the Bug Database (http://bugs.java.com)
for duplicates. Include error messages and the following diagnostic in your report. Thank you.
java.lang.NoClassDefFoundError: com/sun/tools/doclets/Taglet
	at java.base/java.lang.ClassLoader.defineClass1(Native Method)
	at java.base/java.lang.ClassLoader.defineClass(ClassLoader.java:1009)
	at java.base/java.security.SecureClassLoader.defineClass(SecureClassLoader.java:174)
	at java.base/java.net.URLClassLoader.defineClass(URLClassLoader.java:545)
	at java.base/java.net.URLClassLoader.access$100(URLClassLoader.java:83)
	at java.base/java.net.URLClassLoader$1.run(URLClassLoader.java:453)
	at java.base/java.net.URLClassLoader$1.run(URLClassLoader.java:447)
	at java.base/java.security.AccessController.doPrivileged(Native Method)
	at java.base/java.net.URLClassLoader.findClass(URLClassLoader.java:446)
	at java.base/java.lang.ClassLoader.loadClass(ClassLoader.java:566)
	at java.base/java.lang.ClassLoader.loadClass(ClassLoader.java:499)
	at java.base/java.lang.ClassLoader.defineClass1(Native Method)
	at java.base/java.lang.ClassLoader.defineClass(ClassLoader.java:1009)
	at java.base/java.security.SecureClassLoader.defineClass(SecureClassLoader.java:174)
	at java.base/java.net.URLClassLoader.defineClass(URLClassLoader.java:545)
	at java.base/java.net.URLClassLoader.access$100(URLClassLoader.java:83)
	at java.base/java.net.URLClassLoader$1.run(URLClassLoader.java:453)
	at java.base/java.net.URLClassLoader$1.run(URLClassLoader.java:447)
	at java.base/java.security.AccessController.doPrivileged(Native Method)
	at java.base/java.net.URLClassLoader.findClass(URLClassLoader.java:446)
	at java.base/java.lang.ClassLoader.loadClass(ClassLoader.java:566)
	at java.base/java.lang.ClassLoader.loadClass(ClassLoader.java:499)
	at jdk.javadoc/jdk.javadoc.internal.doclets.toolkit.taglets.TagletManager.addCustomTag(TagletManager.java:262)
	at jdk.javadoc/jdk.javadoc.internal.doclets.toolkit.BaseConfiguration.initTagletManager(BaseConfiguration.java:786)
	at jdk.javadoc/jdk.javadoc.internal.doclets.toolkit.BaseConfiguration.finishOptionSettings0(BaseConfiguration.java:726)
	at jdk.javadoc/jdk.javadoc.internal.doclets.formats.html.HtmlConfiguration.finishOptionSettings0(HtmlConfiguration.java:867)
	at jdk.javadoc/jdk.javadoc.internal.doclets.toolkit.BaseConfiguration.setOptions(BaseConfiguration.java:747)
	at jdk.javadoc/jdk.javadoc.internal.doclets.toolkit.AbstractDoclet.startGeneration(AbstractDoclet.java:204)
	at jdk.javadoc/jdk.javadoc.internal.doclets.toolkit.AbstractDoclet.run(AbstractDoclet.java:117)
	at jdk.javadoc/jdk.javadoc.doclet.StandardDoclet.run(StandardDoclet.java:72)
	at jdk.javadoc/jdk.javadoc.internal.tool.Start.parseAndExecute(Start.java:581)
	at jdk.javadoc/jdk.javadoc.internal.tool.Start.begin(Start.java:430)
	at jdk.javadoc/jdk.javadoc.internal.tool.Start.begin(Start.java:343)
	at jdk.javadoc/jdk.javadoc.internal.tool.Main.execute(Main.java:63)
	at jdk.javadoc/jdk.javadoc.internal.tool.Main.main(Main.java:52)
Caused by: java.lang.ClassNotFoundException: com.sun.tools.doclets.Taglet
	at java.base/java.net.URLClassLoader.findClass(URLClassLoader.java:466)
	at java.base/java.lang.ClassLoader.loadClass(ClassLoader.java:566)
	at java.base/java.lang.ClassLoader.loadClass(ClassLoader.java:499)
	... 35 more

Command line was: /home/jenkins/tools/java/latest10/bin/javadoc @options @argfile

Refer to the generated Javadoc files in '/home/jenkins/jenkins-slave/workspace/javadoc-plugin_MJAVADOC-521-4VCCRI6KPRH73A3RWPEXQVQHXBYIUVYDLQPEN3Z2IPPUYMQWLG3Q@2/m/target/test/unit/taglet-test/target/site/apidocs' dir.

	at org.apache.maven.plugins.javadoc.JavadocReportTest.testTaglets(JavadocReportTest.java:559)


FAILED:  org.apache.maven.plugins.javadoc.JavadocReportTest.testJavadocResources

Error Message:
null

Stack Trace:
junit.framework.AssertionFailedError
	at org.apache.maven.plugins.javadoc.JavadocReportTest.testJavadocResources(JavadocReportTest.java:673)


FAILED:  org.apache.maven.plugins.javadoc.JavadocReportTest.testQuotedPath

Error Message:
null

Stack Trace:
junit.framework.AssertionFailedError
	at org.apache.maven.plugins.javadoc.JavadocReportTest.testQuotedPath(JavadocReportTest.java:498)


FAILED:  org.apache.maven.plugins.javadoc.JavadocReportTest.testDefaultConfiguration

Error Message:
null

Stack Trace:
junit.framework.AssertionFailedError
	at org.apache.maven.plugins.javadoc.JavadocReportTest.testDefaultConfiguration(JavadocReportTest.java:240)


FAILED:  org.apache.maven.plugins.javadoc.JavadocReportTest.testDocfiles

Error Message:
null

Stack Trace:
junit.framework.AssertionFailedError
	at org.apache.maven.plugins.javadoc.JavadocReportTest.testDocfiles(JavadocReportTest.java:330)


FAILED:  org.apache.maven.plugins.javadoc.JavadocReportTest.testStylesheetfile

Error Message:
null

Stack Trace:
junit.framework.AssertionFailedError
	at org.apache.maven.plugins.javadoc.JavadocReportTest.testStylesheetfile(JavadocReportTest.java:1115)




Build log:
[...truncated 3.00 MB...]
[linux-jdk9] [INFO] run post-build script verify.bsh
[linux-jdk9] [INFO]           MJAVADOC-365/pom.xml ............................. SUCCESS (4.7 s)
[linux-jdk9] [INFO] Building: MJAVADOC-407/pom.xml
[linux-jdk10] [INFO] run post-build script verify.bsh
[linux-jdk10] [INFO]           MJAVADOC-180/pom.xml ............................. SUCCESS (6.2 s)
[linux-jdk10] [INFO] Building: MJAVADOC-437/pom.xml
[linux-jdk9] [INFO] run post-build script verify.bsh
[linux-jdk9] [INFO]           MJAVADOC-407/pom.xml ............................. SUCCESS (6.6 s)
[linux-jdk9] [INFO] Building: MJAVADOC-508/pom.xml
[linux-jdk10] [INFO] run post-build script verify.bsh
[linux-jdk10] [INFO]           MJAVADOC-437/pom.xml ............................. SUCCESS (6.2 s)
[linux-jdk10] [INFO] Building: MJAVADOC-407/pom.xml
[linux-jdk9] [INFO]           MJAVADOC-508/pom.xml ............................. SUCCESS (4.8 s)
[linux-jdk9] [INFO] Building: dependencySource-2/pom.xml
[linux-jdk10] [INFO] run post-build script verify.bsh
[linux-jdk10] [INFO]           MJAVADOC-407/pom.xml ............................. SUCCESS (7.7 s)
[linux-jdk10] [INFO] Building: MJAVADOC-172/pom.xml
[linux-jdk10] [INFO] run post-build script verify.bsh
[linux-jdk10] [INFO]           MJAVADOC-172/pom.xml ............................. SUCCESS (5.8 s)
[linux-jdk10] [INFO] Building: MJAVADOC-384/pom.xml
[linux-jdk9] [INFO] run post-build script verify.bsh
[linux-jdk9] [INFO]           dependencySource-2/pom.xml ....................... SUCCESS (12.8 s)
[linux-jdk9] [INFO] Building: dependencySource-4/pom.xml
[linux-jdk10] [INFO] run post-build script verify.bsh
[linux-jdk10] [INFO]           MJAVADOC-384/pom.xml ............................. SUCCESS (4.8 s)
[linux-jdk10] [INFO] Building: MJAVADOC-508/pom.xml
[linux-jdk10] [INFO]           MJAVADOC-508/pom.xml ............................. SUCCESS (5.0 s)
[linux-jdk10] [INFO] Building: MJAVADOC-498_mm_modulepath/pom.xml
[linux-jdk9] [INFO] run post-build script verify.bsh
[linux-jdk9] [INFO]           dependencySource-4/pom.xml ....................... SUCCESS (13.6 s)
[linux-jdk9] [INFO] Building: MJAVADOC-414/pom.xml
[linux-jdk10] [INFO]           MJAVADOC-498_mm_modulepath/pom.xml ............... SUCCESS (7.9 s)
[linux-jdk10] [INFO] Building: additional-dependencies/pom.xml
[linux-jdk9] [INFO] run post-build script verify.bsh
[linux-jdk9] [INFO]           MJAVADOC-414/pom.xml ............................. SUCCESS (6.0 s)
[linux-jdk9] [INFO] 
[linux-jdk9] [INFO] --- mrm-maven-plugin:1.1.0:stop (repository) @ maven-javadoc-plugin ---
[linux-jdk9] [INFO] Stopping Mock Repository Manager on http://localhost:42260
[linux-jdk9] [INFO] Stopped SocketConnector@0.0.0.0:42260
[linux-jdk9] [INFO] Mock Repository Manager http://localhost:42260 is stopped.
[linux-jdk9] [INFO] 
[linux-jdk9] [INFO] --- mrm-maven-plugin:1.1.0:stop (3rdparty) @ maven-javadoc-plugin ---
[linux-jdk9] [INFO] Stopping Mock Repository Manager on http://localhost:35868
[linux-jdk9] [INFO] Stopped SocketConnector@0.0.0.0:35868
[linux-jdk9] [INFO] Mock Repository Manager http://localhost:35868 is stopped.
[linux-jdk9] [INFO] 
[linux-jdk9] [INFO] --- maven-checkstyle-plugin:3.0.0:check (checkstyle-check) @ maven-javadoc-plugin ---
[linux-jdk9] [INFO] Downloading from central: https://repo.maven.apache.org/maven2/javax/xml/bind/jaxb-api/2.3.0/jaxb-api-2.3.0.pom
[linux-jdk9] [INFO] Downloaded from central: https://repo.maven.apache.org/maven2/javax/xml/bind/jaxb-api/2.3.0/jaxb-api-2.3.0.pom (23 kB at 920 kB/s)
[linux-jdk9] [INFO] Downloading from central: https://repo.maven.apache.org/maven2/javax/xml/bind/jaxb-api-parent/2.3.0/jaxb-api-parent-2.3.0.pom
[linux-jdk9] [INFO] Downloaded from central: https://repo.maven.apache.org/maven2/javax/xml/bind/jaxb-api-parent/2.3.0/jaxb-api-parent-2.3.0.pom (5.6 kB at 332 kB/s)
[linux-jdk9] [INFO] Downloading from central: https://repo.maven.apache.org/maven2/net/java/jvnet-parent/5/jvnet-parent-5.pom
[linux-jdk9] [INFO] Downloaded from central: https://repo.maven.apache.org/maven2/net/java/jvnet-parent/5/jvnet-parent-5.pom (8.9 kB at 521 kB/s)
[linux-jdk9] [INFO] Downloading from central: https://repo.maven.apache.org/maven2/javax/xml/bind/jaxb-api/2.3.0/jaxb-api-2.3.0.jar
[linux-jdk9] [INFO] Downloaded from central: https://repo.maven.apache.org/maven2/javax/xml/bind/jaxb-api/2.3.0/jaxb-api-2.3.0.jar (126 kB at 4.3 MB/s)
[linux-jdk9] [INFO] There are 4 errors reported by Checkstyle 6.18 with config/maven_checks.xml ruleset.
[linux-jdk9] [INFO] Ignored 4 errors, 0 violation remaining.
[linux-jdk9] [INFO] 
[linux-jdk9] [INFO] --- maven-invoker-plugin:3.0.1:verify (integration-test) @ maven-javadoc-plugin ---
[linux-jdk9] [INFO] -------------------------------------------------
[linux-jdk9] [INFO] Build Summary:
[linux-jdk9] [INFO]   Passed: 36, Failed: 0, Errors: 0, Skipped: 0
[linux-jdk9] [INFO] -------------------------------------------------
[linux-jdk9] [INFO] ------------------------------------------------------------------------
[linux-jdk9] [INFO] BUILD SUCCESS
[linux-jdk9] [INFO] ------------------------------------------------------------------------
[linux-jdk9] [INFO] Total time: 07:13 min
[linux-jdk9] [INFO] Finished at: 2018-07-03T04:21:57Z
[linux-jdk9] [INFO] Final Memory: 77M/252M
[linux-jdk9] [INFO] ------------------------------------------------------------------------
[linux-jdk9] [INFO] [jenkins-event-spy] Generated /home/jenkins/jenkins-slave/workspace/javadoc-plugin_MJAVADOC-521-4VCCRI6KPRH73A3RWPEXQVQHXBYIUVYDLQPEN3Z2IPPUYMQWLG3Q@tmp/withMavend28eafeb/maven-spy-20180703-041444-45712559203778425094554.log
[Pipeline] [linux-jdk9] }
[Pipeline] [linux-jdk9] // dir
[linux-jdk10] [INFO] run post-build script verify.bsh
[linux-jdk10] [INFO]           additional-dependencies/pom.xml .................. SUCCESS (22.3 s)
[linux-jdk10] [INFO] Building: detectLinks/pom.xml
[Pipeline] [linux-jdk9] }
[linux-jdk10] [INFO] run post-build script verify.bsh
[linux-jdk10] [INFO]           detectLinks/pom.xml .............................. FAILED (12.6 s)
[linux-jdk10] [INFO]   The post-build script returned false.
[linux-jdk10] [INFO] Building: MJAVADOC-259/pom.xml
[linux-jdk9] [withMaven] invokerPublisher - Archive invoker results for Maven artifact MavenArtifact{org.apache.maven.plugins:maven-javadoc-plugin::3.0.1-SNAPSHOT(version: 3.0.1-SNAPSHOT, snapshot:false) } generated by PluginInvocation{org.apache.maven.plugins:maven-invoker-plugin:3.0.1@integration-test  integration-test}: m/target/invoker-reports/*.xml
[linux-jdk9] performing MavenInvokerRecorder, reportsFilenamePattern:'**/m/target/invoker-reports/BUILD*.xml', invokerBuildDir:'**/m/target/it'
[linux-jdk9] Found reports:[/home/jenkins/jenkins-slave/workspace/javadoc-plugin_MJAVADOC-521-4VCCRI6KPRH73A3RWPEXQVQHXBYIUVYDLQPEN3Z2IPPUYMQWLG3Q/m/target/invoker-reports/BUILD-MJAVADOC-110.xml, /home/jenkins/jenkins-slave/workspace/javadoc-plugin_MJAVADOC-521-4VCCRI6KPRH73A3RWPEXQVQHXBYIUVYDLQPEN3Z2IPPUYMQWLG3Q/m/target/invoker-reports/BUILD-MJAVADOC-126.xml, /home/jenkins/jenkins-slave/workspace/javadoc-plugin_MJAVADOC-521-4VCCRI6KPRH73A3RWPEXQVQHXBYIUVYDLQPEN3Z2IPPUYMQWLG3Q/m/target/invoker-reports/BUILD-MJAVADOC-137.xml, /home/jenkins/jenkins-slave/workspace/javadoc-plugin_MJAVADOC-521-4VCCRI6KPRH73A3RWPEXQVQHXBYIUVYDLQPEN3Z2IPPUYMQWLG3Q/m/target/invoker-reports/BUILD-MJAVADOC-172.xml, /home/jenkins/jenkins-slave/workspace/javadoc-plugin_MJAVADOC-521-4VCCRI6KPRH73A3RWPEXQVQHXBYIUVYDLQPEN3Z2IPPUYMQWLG3Q/m/target/invoker-reports/BUILD-MJAVADOC-180.xml, /home/jenkins/jenkins-slave/workspace/javadoc-plugin_MJAVADOC-521-4VCCRI6KPRH73A3RWPEXQVQHXBYIUVYDLQPEN3Z2IPPUYMQWLG3Q/m/target/invoker-reports/BUILD-MJAVADOC-194.xml, /home/jenkins/jenkins-slave/workspace/javadoc-plugin_MJAVADOC-521-4VCCRI6KPRH73A3RWPEXQVQHXBYIUVYDLQPEN3Z2IPPUYMQWLG3Q/m/target/invoker-reports/BUILD-MJAVADOC-250.xml, /home/jenkins/jenkins-slave/workspace/javadoc-plugin_MJAVADOC-521-4VCCRI6KPRH73A3RWPEXQVQHXBYIUVYDLQPEN3Z2IPPUYMQWLG3Q/m/target/invoker-reports/BUILD-MJAVADOC-257.xml, /home/jenkins/jenkins-slave/workspace/javadoc-plugin_MJAVADOC-521-4VCCRI6KPRH73A3RWPEXQVQHXBYIUVYDLQPEN3Z2IPPUYMQWLG3Q/m/target/invoker-reports/BUILD-MJAVADOC-259.xml, /home/jenkins/jenkins-slave/workspace/javadoc-plugin_MJAVADOC-521-4VCCRI6KPRH73A3RWPEXQVQHXBYIUVYDLQPEN3Z2IPPUYMQWLG3Q/m/target/invoker-reports/BUILD-MJAVADOC-262.xml, /home/jenkins/jenkins-slave/workspace/javadoc-plugin_MJAVADOC-521-4VCCRI6KPRH73A3RWPEXQVQHXBYIUVYDLQPEN3Z2IPPUYMQWLG3Q/m/target/invoker-reports/BUILD-MJAVADOC-275.xml, /home/jenkins/jenkins-slave/workspace/javadoc-plugin_MJAVADOC-521-4VCCRI6KPRH73A3RWPEXQVQHXBYIUVYDLQPEN3Z2IPPUYMQWLG3Q/m/target/invoker-reports/BUILD-MJAVADOC-278.xml, /home/jenkins/jenkins-slave/workspace/javadoc-plugin_MJAVADOC-521-4VCCRI6KPRH73A3RWPEXQVQHXBYIUVYDLQPEN3Z2IPPUYMQWLG3Q/m/target/invoker-reports/BUILD-MJAVADOC-320.xml, /home/jenkins/jenkins-slave/workspace/javadoc-plugin_MJAVADOC-521-4VCCRI6KPRH73A3RWPEXQVQHXBYIUVYDLQPEN3Z2IPPUYMQWLG3Q/m/target/invoker-reports/BUILD-MJAVADOC-325.xml, /home/jenkins/jenkins-slave/workspace/javadoc-plugin_MJAVADOC-521-4VCCRI6KPRH73A3RWPEXQVQHXBYIUVYDLQPEN3Z2IPPUYMQWLG3Q/m/target/invoker-reports/BUILD-MJAVADOC-365.xml, /home/jenkins/jenkins-slave/workspace/javadoc-plugin_MJAVADOC-521-4VCCRI6KPRH73A3RWPEXQVQHXBYIUVYDLQPEN3Z2IPPUYMQWLG3Q/m/target/invoker-reports/BUILD-MJAVADOC-369.xml, /home/jenkins/jenkins-slave/workspace/javadoc-plugin_MJAVADOC-521-4VCCRI6KPRH73A3RWPEXQVQHXBYIUVYDLQPEN3Z2IPPUYMQWLG3Q/m/target/invoker-reports/BUILD-MJAVADOC-384.xml, /home/jenkins/jenkins-slave/workspace/javadoc-plugin_MJAVADOC-521-4VCCRI6KPRH73A3RWPEXQVQHXBYIUVYDLQPEN3Z2IPPUYMQWLG3Q/m/target/invoker-reports/BUILD-MJAVADOC-407.xml, /home/jenkins/jenkins-slave/workspace/javadoc-plugin_MJAVADOC-521-4VCCRI6KPRH73A3RWPEXQVQHXBYIUVYDLQPEN3Z2IPPUYMQWLG3Q/m/target/invoker-reports/BUILD-MJAVADOC-414.xml, /home/jenkins/jenkins-slave/workspace/javadoc-plugin_MJAVADOC-521-4VCCRI6KPRH73A3RWPEXQVQHXBYIUVYDLQPEN3Z2IPPUYMQWLG3Q/m/target/invoker-reports/BUILD-MJAVADOC-427.xml, /home/jenkins/jenkins-slave/workspace/javadoc-plugin_MJAVADOC-521-4VCCRI6KPRH73A3RWPEXQVQHXBYIUVYDLQPEN3Z2IPPUYMQWLG3Q/m/target/invoker-reports/BUILD-MJAVADOC-437.xml, /home/jenkins/jenkins-slave/workspace/javadoc-plugin_MJAVADOC-521-4VCCRI6KPRH73A3RWPEXQVQHXBYIUVYDLQPEN3Z2IPPUYMQWLG3Q/m/target/invoker-reports/BUILD-MJAVADOC-494_aggregate-repositories.xml, /home/jenkins/jenkins-slave/workspace/javadoc-plugin_MJAVADOC-521-4VCCRI6KPRH73A3RWPEXQVQHXBYIUVYDLQPEN3Z2IPPUYMQWLG3Q/m/target/invoker-reports/BUILD-MJAVADOC-497.xml, /home/jenkins/jenkins-slave/workspace/javadoc-plugin_MJAVADOC-521-4VCCRI6KPRH73A3RWPEXQVQHXBYIUVYDLQPEN3Z2IPPUYMQWLG3Q/m/target/invoker-reports/BUILD-MJAVADOC-498_aggr_modulepath.xml, /home/jenkins/jenkins-slave/workspace/javadoc-plugin_MJAVADOC-521-4VCCRI6KPRH73A3RWPEXQVQHXBYIUVYDLQPEN3Z2IPPUYMQWLG3Q/m/target/invoker-reports/BUILD-MJAVADOC-498_mm_modulepath.xml, /home/jenkins/jenkins-slave/workspace/javadoc-plugin_MJAVADOC-521-4VCCRI6KPRH73A3RWPEXQVQHXBYIUVYDLQPEN3Z2IPPUYMQWLG3Q/m/target/invoker-reports/BUILD-MJAVADOC-498_modulepath.xml, /home/jenkins/jenkins-slave/workspace/javadoc-plugin_MJAVADOC-521-4VCCRI6KPRH73A3RWPEXQVQHXBYIUVYDLQPEN3Z2IPPUYMQWLG3Q/m/target/invoker-reports/BUILD-MJAVADOC-508.xml, /home/jenkins/jenkins-slave/workspace/javadoc-plugin_MJAVADOC-521-4VCCRI6KPRH73A3RWPEXQVQHXBYIUVYDLQPEN3Z2IPPUYMQWLG3Q/m/target/invoker-reports/BUILD-additional-dependencies-non-aggregate.xml, /home/jenkins/jenkins-slave/workspace/javadoc-plugin_MJAVADOC-521-4VCCRI6KPRH73A3RWPEXQVQHXBYIUVYDLQPEN3Z2IPPUYMQWLG3Q/m/target/invoker-reports/BUILD-additional-dependencies.xml, /home/jenkins/jenkins-slave/workspace/javadoc-plugin_MJAVADOC-521-4VCCRI6KPRH73A3RWPEXQVQHXBYIUVYDLQPEN3Z2IPPUYMQWLG3Q/m/target/invoker-reports/BUILD-dependencySource-1.xml, /home/jenkins/jenkins-slave/workspace/javadoc-plugin_MJAVADOC-521-4VCCRI6KPRH73A3RWPEXQVQHXBYIUVYDLQPEN3Z2IPPUYMQWLG3Q/m/target/invoker-reports/BUILD-dependencySource-2.xml, /home/jenkins/jenkins-slave/workspace/javadoc-plugin_MJAVADOC-521-4VCCRI6KPRH73A3RWPEXQVQHXBYIUVYDLQPEN3Z2IPPUYMQWLG3Q/m/target/invoker-reports/BUILD-dependencySource-3.xml, /home/jenkins/jenkins-slave/workspace/javadoc-plugin_MJAVADOC-521-4VCCRI6KPRH73A3RWPEXQVQHXBYIUVYDLQPEN3Z2IPPUYMQWLG3Q/m/target/invoker-reports/BUILD-dependencySource-4.xml, /home/jenkins/jenkins-slave/workspace/javadoc-plugin_MJAVADOC-521-4VCCRI6KPRH73A3RWPEXQVQHXBYIUVYDLQPEN3Z2IPPUYMQWLG3Q/m/target/invoker-reports/BUILD-detectLinks.xml, /home/jenkins/jenkins-slave/workspace/javadoc-plugin_MJAVADOC-521-4VCCRI6KPRH73A3RWPEXQVQHXBYIUVYDLQPEN3Z2IPPUYMQWLG3Q/m/target/invoker-reports/BUILD-javadoc-fix.xml, /home/jenkins/jenkins-slave/workspace/javadoc-plugin_MJAVADOC-521-4VCCRI6KPRH73A3RWPEXQVQHXBYIUVYDLQPEN3Z2IPPUYMQWLG3Q/m/target/invoker-reports/BUILD-site-failOnError.xml]
[linux-jdk9] Found logs:[/home/jenkins/jenkins-slave/workspace/javadoc-plugin_MJAVADOC-521-4VCCRI6KPRH73A3RWPEXQVQHXBYIUVYDLQPEN3Z2IPPUYMQWLG3Q/m/target/it/MJAVADOC-110/build.log, /home/jenkins/jenkins-slave/workspace/javadoc-plugin_MJAVADOC-521-4VCCRI6KPRH73A3RWPEXQVQHXBYIUVYDLQPEN3Z2IPPUYMQWLG3Q/m/target/it/MJAVADOC-126/build.log, /home/jenkins/jenkins-slave/workspace/javadoc-plugin_MJAVADOC-521-4VCCRI6KPRH73A3RWPEXQVQHXBYIUVYDLQPEN3Z2IPPUYMQWLG3Q/m/target/it/MJAVADOC-137/build.log, /home/jenkins/jenkins-slave/workspace/javadoc-plugin_MJAVADOC-521-4VCCRI6KPRH73A3RWPEXQVQHXBYIUVYDLQPEN3Z2IPPUYMQWLG3Q/m/target/it/MJAVADOC-172/build.log, /home/jenkins/jenkins-slave/workspace/javadoc-plugin_MJAVADOC-521-4VCCRI6KPRH73A3RWPEXQVQHXBYIUVYDLQPEN3Z2IPPUYMQWLG3Q/m/target/it/MJAVADOC-180/build.log, /home/jenkins/jenkins-slave/workspace/javadoc-plugin_MJAVADOC-521-4VCCRI6KPRH73A3RWPEXQVQHXBYIUVYDLQPEN3Z2IPPUYMQWLG3Q/m/target/it/MJAVADOC-194/build.log, /home/jenkins/jenkins-slave/workspace/javadoc-plugin_MJAVADOC-521-4VCCRI6KPRH73A3RWPEXQVQHXBYIUVYDLQPEN3Z2IPPUYMQWLG3Q/m/target/it/MJAVADOC-250/build.log, /home/jenkins/jenkins-slave/workspace/javadoc-plugin_MJAVADOC-521-4VCCRI6KPRH73A3RWPEXQVQHXBYIUVYDLQPEN3Z2IPPUYMQWLG3Q/m/target/it/MJAVADOC-257/build.log, /home/jenkins/jenkins-slave/workspace/javadoc-plugin_MJAVADOC-521-4VCCRI6KPRH73A3RWPEXQVQHXBYIUVYDLQPEN3Z2IPPUYMQWLG3Q/m/target/it/MJAVADOC-259/build.log, /home/jenkins/jenkins-slave/workspace/javadoc-plugin_MJAVADOC-521-4VCCRI6KPRH73A3RWPEXQVQHXBYIUVYDLQPEN3Z2IPPUYMQWLG3Q/m/target/it/MJAVADOC-262/build.log, /home/jenkins/jenkins-slave/workspace/javadoc-plugin_MJAVADOC-521-4VCCRI6KPRH73A3RWPEXQVQHXBYIUVYDLQPEN3Z2IPPUYMQWLG3Q/m/target/it/MJAVADOC-275/build.log, /home/jenkins/jenkins-slave/workspace/javadoc-plugin_MJAVADOC-521-4VCCRI6KPRH73A3RWPEXQVQHXBYIUVYDLQPEN3Z2IPPUYMQWLG3Q/m/target/it/MJAVADOC-278/build.log, /home/jenkins/jenkins-slave/workspace/javadoc-plugin_MJAVADOC-521-4VCCRI6KPRH73A3RWPEXQVQHXBYIUVYDLQPEN3Z2IPPUYMQWLG3Q/m/target/it/MJAVADOC-320/build.log, /home/jenkins/jenkins-slave/workspace/javadoc-plugin_MJAVADOC-521-4VCCRI6KPRH73A3RWPEXQVQHXBYIUVYDLQPEN3Z2IPPUYMQWLG3Q/m/target/it/MJAVADOC-325/build.log, /home/jenkins/jenkins-slave/workspace/javadoc-plugin_MJAVADOC-521-4VCCRI6KPRH73A3RWPEXQVQHXBYIUVYDLQPEN3Z2IPPUYMQWLG3Q/m/target/it/MJAVADOC-365/build.log, /home/jenkins/jenkins-slave/workspace/javadoc-plugin_MJAVADOC-521-4VCCRI6KPRH73A3RWPEXQVQHXBYIUVYDLQPEN3Z2IPPUYMQWLG3Q/m/target/it/MJAVADOC-369/build.log, /home/jenkins/jenkins-slave/workspace/javadoc-plugin_MJAVADOC-521-4VCCRI6KPRH73A3RWPEXQVQHXBYIUVYDLQPEN3Z2IPPUYMQWLG3Q/m/target/it/MJAVADOC-384/build.log, /home/jenkins/jenkins-slave/workspace/javadoc-plugin_MJAVADOC-521-4VCCRI6KPRH73A3RWPEXQVQHXBYIUVYDLQPEN3Z2IPPUYMQWLG3Q/m/target/it/MJAVADOC-407/build.log, /home/jenkins/jenkins-slave/workspace/javadoc-plugin_MJAVADOC-521-4VCCRI6KPRH73A3RWPEXQVQHXBYIUVYDLQPEN3Z2IPPUYMQWLG3Q/m/target/it/MJAVADOC-414/build.log, /home/jenkins/jenkins-slave/workspace/javadoc-plugin_MJAVADOC-521-4VCCRI6KPRH73A3RWPEXQVQHXBYIUVYDLQPEN3Z2IPPUYMQWLG3Q/m/target/it/MJAVADOC-427/build.log, /home/jenkins/jenkins-slave/workspace/javadoc-plugin_MJAVADOC-521-4VCCRI6KPRH73A3RWPEXQVQHXBYIUVYDLQPEN3Z2IPPUYMQWLG3Q/m/target/it/MJAVADOC-437/build.log, /home/jenkins/jenkins-slave/workspace/javadoc-plugin_MJAVADOC-521-4VCCRI6KPRH73A3RWPEXQVQHXBYIUVYDLQPEN3Z2IPPUYMQWLG3Q/m/target/it/MJAVADOC-494_aggregate-repositories/build.log, /home/jenkins/jenkins-slave/workspace/javadoc-plugin_MJAVADOC-521-4VCCRI6KPRH73A3RWPEXQVQHXBYIUVYDLQPEN3Z2IPPUYMQWLG3Q/m/target/it/MJAVADOC-497/build.log, /home/jenkins/jenkins-slave/workspace/javadoc-plugin_MJAVADOC-521-4VCCRI6KPRH73A3RWPEXQVQHXBYIUVYDLQPEN3Z2IPPUYMQWLG3Q/m/target/it/MJAVADOC-498_aggr_modulepath/build.log, /home/jenkins/jenkins-slave/workspace/javadoc-plugin_MJAVADOC-521-4VCCRI6KPRH73A3RWPEXQVQHXBYIUVYDLQPEN3Z2IPPUYMQWLG3Q/m/target/it/MJAVADOC-498_mm_modulepath/build.log, /home/jenkins/jenkins-slave/workspace/javadoc-plugin_MJAVADOC-521-4VCCRI6KPRH73A3RWPEXQVQHXBYIUVYDLQPEN3Z2IPPUYMQWLG3Q/m/target/it/MJAVADOC-498_modulepath/build.log, /home/jenkins/jenkins-slave/workspace/javadoc-plugin_MJAVADOC-521-4VCCRI6KPRH73A3RWPEXQVQHXBYIUVYDLQPEN3Z2IPPUYMQWLG3Q/m/target/it/MJAVADOC-508/build.log, /home/jenkins/jenkins-slave/workspace/javadoc-plugin_MJAVADOC-521-4VCCRI6KPRH73A3RWPEXQVQHXBYIUVYDLQPEN3Z2IPPUYMQWLG3Q/m/target/it/additional-dependencies-non-aggregate/build.log, /home/jenkins/jenkins-slave/workspace/javadoc-plugin_MJAVADOC-521-4VCCRI6KPRH73A3RWPEXQVQHXBYIUVYDLQPEN3Z2IPPUYMQWLG3Q/m/target/it/additional-dependencies/build.log, /home/jenkins/jenkins-slave/workspace/javadoc-plugin_MJAVADOC-521-4VCCRI6KPRH73A3RWPEXQVQHXBYIUVYDLQPEN3Z2IPPUYMQWLG3Q/m/target/it/dependencySource-1/build.log, /home/jenkins/jenkins-slave/workspace/javadoc-plugin_MJAVADOC-521-4VCCRI6KPRH73A3RWPEXQVQHXBYIUVYDLQPEN3Z2IPPUYMQWLG3Q/m/target/it/dependencySource-2/build.log, /home/jenkins/jenkins-slave/workspace/javadoc-plugin_MJAVADOC-521-4VCCRI6KPRH73A3RWPEXQVQHXBYIUVYDLQPEN3Z2IPPUYMQWLG3Q/m/target/it/dependencySource-3/build.log, /home/jenkins/jenkins-slave/workspace/javadoc-plugin_MJAVADOC-521-4VCCRI6KPRH73A3RWPEXQVQHXBYIUVYDLQPEN3Z2IPPUYMQWLG3Q/m/target/it/dependencySource-4/build.log, /home/jenkins/jenkins-slave/workspace/javadoc-plugin_MJAVADOC-521-4VCCRI6KPRH73A3RWPEXQVQHXBYIUVYDLQPEN3Z2IPPUYMQWLG3Q/m/target/it/detectLinks/build.log, /home/jenkins/jenkins-slave/workspace/javadoc-plugin_MJAVADOC-521-4VCCRI6KPRH73A3RWPEXQVQHXBYIUVYDLQPEN3Z2IPPUYMQWLG3Q/m/target/it/javadoc-fix/build.log, /home/jenkins/jenkins-slave/workspace/javadoc-plugin_MJAVADOC-521-4VCCRI6KPRH73A3RWPEXQVQHXBYIUVYDLQPEN3Z2IPPUYMQWLG3Q/m/target/it/site-failOnError/build.log]
[linux-jdk9] Finished parsing Maven Invoker results (found 36)
[linux-jdk9] [withMaven] junitPublisher - Archive test results for Maven artifact org.apache.maven.plugins:maven-javadoc-plugin:3.0.1-SNAPSHOT generated by maven-surefire-plugin:test (default-test): m/target/surefire-reports/*.xml
[linux-jdk9] Recording test results
[Pipeline] [linux-jdk9] // withMaven
[Pipeline] [linux-jdk9] }
[Pipeline] [linux-jdk9] // stage
[Pipeline] [linux-jdk9] }
[Pipeline] [linux-jdk9] // node
[Pipeline] [linux-jdk9] }
[linux-jdk10] [INFO] run post-build script verify.bsh
[linux-jdk10] [INFO]           MJAVADOC-259/pom.xml ............................. SUCCESS (8.8 s)
[linux-jdk10] [INFO] Building: MJAVADOC-262/pom.xml
[linux-jdk10] [INFO] run post-build script verify.bsh
[linux-jdk10] [INFO]           MJAVADOC-262/pom.xml ............................. SUCCESS (4.7 s)
[linux-jdk10] [INFO] Building: MJAVADOC-427/pom.xml
[linux-jdk10] [INFO] run post-build script verify.groovy
[linux-jdk10] [INFO]           MJAVADOC-427/pom.xml ............................. SUCCESS (12.1 s)
[linux-jdk10] [INFO] Building: MJAVADOC-365/pom.xml
[linux-jdk10] [INFO] run post-build script verify.bsh
[linux-jdk10] [INFO]           MJAVADOC-365/pom.xml ............................. SUCCESS (5.3 s)
[linux-jdk10] [INFO] Building: MJAVADOC-110/pom.xml
[linux-jdk10] [INFO] run post-build script verify.bsh
[linux-jdk10] [INFO]           MJAVADOC-110/pom.xml ............................. SUCCESS (5.6 s)
[linux-jdk10] [INFO] Building: dependencySource-3/pom.xml
[linux-jdk10] [INFO] run post-build script verify.bsh
[linux-jdk10] [INFO]           dependencySource-3/pom.xml ....................... SUCCESS (17.3 s)
[linux-jdk10] [INFO] Building: MJAVADOC-278/pom.xml
[linux-jdk10] [INFO] run post-build script verify.bsh
[linux-jdk10] [INFO]           MJAVADOC-278/pom.xml ............................. SUCCESS (5.6 s)
[linux-jdk10] [INFO] Building: MJAVADOC-369/pom.xml
[linux-jdk10] [INFO] run post-build script verify.bsh
[linux-jdk10] [INFO]           MJAVADOC-369/pom.xml ............................. SUCCESS (10.9 s)
[linux-jdk10] [INFO] Building: MJAVADOC-257/pom.xml
[linux-jdk10] [INFO] run post-build script verify.bsh
[linux-jdk10] [INFO]           MJAVADOC-257/pom.xml ............................. FAILED (10.9 s)
[linux-jdk10] [INFO]   The build exited with code 1. See /home/jenkins/jenkins-slave/workspace/javadoc-plugin_MJAVADOC-521-4VCCRI6KPRH73A3RWPEXQVQHXBYIUVYDLQPEN3Z2IPPUYMQWLG3Q@2/m/target/it/MJAVADOC-257/build.log for details.
[linux-jdk10] [INFO] Building: MJAVADOC-250/pom.xml
[linux-jdk10] [INFO] run post-build script verify.bsh
[linux-jdk10] [INFO]           MJAVADOC-250/pom.xml ............................. SUCCESS (8.1 s)
[linux-jdk10] [INFO] 
[linux-jdk10] [INFO] --- mrm-maven-plugin:1.1.0:stop (repository) @ maven-javadoc-plugin ---
[linux-jdk10] [INFO] Stopping Mock Repository Manager on http://localhost:39265
[linux-jdk10] [INFO] Stopped SocketConnector@0.0.0.0:39265
[linux-jdk10] [INFO] Mock Repository Manager http://localhost:39265 is stopped.
[linux-jdk10] [INFO] 
[linux-jdk10] [INFO] --- mrm-maven-plugin:1.1.0:stop (3rdparty) @ maven-javadoc-plugin ---
[linux-jdk10] [INFO] Stopping Mock Repository Manager on http://localhost:42959
[linux-jdk10] [INFO] Stopped SocketConnector@0.0.0.0:42959
[linux-jdk10] [INFO] Mock Repository Manager http://localhost:42959 is stopped.
[linux-jdk10] [INFO] 
[linux-jdk10] [INFO] --- maven-checkstyle-plugin:3.0.0:check (checkstyle-check) @ maven-javadoc-plugin ---
[linux-jdk10] [INFO] Downloading from central: https://repo.maven.apache.org/maven2/org/apache/maven/shared/maven-shared-resources/2/maven-shared-resources-2.pom
[linux-jdk10] [INFO] Downloaded from central: https://repo.maven.apache.org/maven2/org/apache/maven/shared/maven-shared-resources/2/maven-shared-resources-2.pom (3.0 kB at 185 kB/s)
[linux-jdk10] [INFO] Downloading from central: https://repo.maven.apache.org/maven2/org/codehaus/plexus/plexus-utils/3.0.10/plexus-utils-3.0.10.pom
[linux-jdk10] [INFO] Downloaded from central: https://repo.maven.apache.org/maven2/org/codehaus/plexus/plexus-utils/3.0.10/plexus-utils-3.0.10.pom (3.1 kB at 262 kB/s)
[linux-jdk10] [INFO] Downloading from central: https://repo.maven.apache.org/maven2/org/codehaus/plexus/plexus/3.3/plexus-3.3.pom
[linux-jdk10] [INFO] Downloaded from central: https://repo.maven.apache.org/maven2/org/codehaus/plexus/plexus/3.3/plexus-3.3.pom (20 kB at 1.7 MB/s)
[linux-jdk10] [INFO] Downloading from central: https://repo.maven.apache.org/maven2/org/apache/maven/doxia/doxia-integration-tools/1.6/doxia-integration-tools-1.6.pom
[linux-jdk10] [INFO] Downloaded from central: https://repo.maven.apache.org/maven2/org/apache/maven/doxia/doxia-integration-tools/1.6/doxia-integration-tools-1.6.pom (7.0 kB at 580 kB/s)
[linux-jdk10] [INFO] Downloading from central: https://repo.maven.apache.org/maven2/org/apache/maven/doxia/doxia-tools/3/doxia-tools-3.pom
[linux-jdk10] [INFO] Downloaded from central: https://repo.maven.apache.org/maven2/org/apache/maven/doxia/doxia-tools/3/doxia-tools-3.pom (9.9 kB at 827 kB/s)
[linux-jdk10] [INFO] Downloading from central: https://repo.maven.apache.org/maven2/org/codehaus/plexus/plexus-resources/1.1.0/plexus-resources-1.1.0.pom
[linux-jdk10] [INFO] Downloaded from central: https://repo.maven.apache.org/maven2/org/codehaus/plexus/plexus-resources/1.1.0/plexus-resources-1.1.0.pom (3.2 kB at 187 kB/s)
[linux-jdk10] [INFO] Downloading from central: https://repo.maven.apache.org/maven2/com/puppycrawl/tools/checkstyle/6.18/checkstyle-6.18.pom
[linux-jdk10] [INFO] Downloaded from central: https://repo.maven.apache.org/maven2/com/puppycrawl/tools/checkstyle/6.18/checkstyle-6.18.pom (71 kB at 4.7 MB/s)
[linux-jdk10] [INFO] Downloading from central: https://repo.maven.apache.org/maven2/antlr/antlr/2.7.7/antlr-2.7.7.pom
[linux-jdk10] [INFO] Downloaded from central: https://repo.maven.apache.org/maven2/antlr/antlr/2.7.7/antlr-2.7.7.pom (632 B at 57 kB/s)
[linux-jdk10] [INFO] Downloading from central: https://repo.maven.apache.org/maven2/org/antlr/antlr4-runtime/4.5.3/antlr4-runtime-4.5.3.pom
[linux-jdk10] [INFO] Downloaded from central: https://repo.maven.apache.org/maven2/org/antlr/antlr4-runtime/4.5.3/antlr4-runtime-4.5.3.pom (2.3 kB at 231 kB/s)
[linux-jdk10] [INFO] Downloading from central: https://repo.maven.apache.org/maven2/org/antlr/antlr4-master/4.5.3/antlr4-master-4.5.3.pom
[linux-jdk10] [INFO] Downloaded from central: https://repo.maven.apache.org/maven2/org/antlr/antlr4-master/4.5.3/antlr4-master-4.5.3.pom (3.7 kB at 335 kB/s)
[linux-jdk10] [INFO] Downloading from central: https://repo.maven.apache.org/maven2/commons-beanutils/commons-beanutils/1.9.2/commons-beanutils-1.9.2.pom
[linux-jdk10] [INFO] Downloaded from central: https://repo.maven.apache.org/maven2/commons-beanutils/commons-beanutils/1.9.2/commons-beanutils-1.9.2.pom (14 kB at 1.2 MB/s)
[linux-jdk10] [INFO] Downloading from central: https://repo.maven.apache.org/maven2/org/apache/commons/commons-parent/33/commons-parent-33.pom
[linux-jdk10] [INFO] Downloaded from central: https://repo.maven.apache.org/maven2/org/apache/commons/commons-parent/33/commons-parent-33.pom (53 kB at 2.5 MB/s)
[linux-jdk10] [INFO] Downloading from central: https://repo.maven.apache.org/maven2/commons-cli/commons-cli/1.3.1/commons-cli-1.3.1.pom
[linux-jdk10] [INFO] Downloaded from central: https://repo.maven.apache.org/maven2/commons-cli/commons-cli/1.3.1/commons-cli-1.3.1.pom (10 kB at 945 kB/s)
[linux-jdk10] [INFO] Downloading from central: https://repo.maven.apache.org/maven2/com/google/guava/guava/19.0/guava-19.0.pom
[linux-jdk10] [INFO] Downloaded from central: https://repo.maven.apache.org/maven2/com/google/guava/guava/19.0/guava-19.0.pom (6.8 kB at 617 kB/s)
[linux-jdk10] [INFO] Downloading from central: https://repo.maven.apache.org/maven2/com/google/guava/guava-parent/19.0/guava-parent-19.0.pom
[linux-jdk10] [INFO] Downloaded from central: https://repo.maven.apache.org/maven2/com/google/guava/guava-parent/19.0/guava-parent-19.0.pom (9.9 kB at 898 kB/s)
[linux-jdk10] [INFO] Downloading from central: https://repo.maven.apache.org/maven2/org/sonatype/oss/oss-parent/7/oss-parent-7.pom
[linux-jdk10] [INFO] Downloaded from central: https://repo.maven.apache.org/maven2/org/sonatype/oss/oss-parent/7/oss-parent-7.pom (4.8 kB at 439 kB/s)
[linux-jdk10] [INFO] Downloading from central: https://repo.maven.apache.org/maven2/javax/xml/bind/jaxb-api/2.3.0/jaxb-api-2.3.0.pom
[linux-jdk10] [INFO] Downloaded from central: https://repo.maven.apache.org/maven2/javax/xml/bind/jaxb-api/2.3.0/jaxb-api-2.3.0.pom (23 kB at 1.6 MB/s)
[linux-jdk10] [INFO] Downloading from central: https://repo.maven.apache.org/maven2/javax/xml/bind/jaxb-api-parent/2.3.0/jaxb-api-parent-2.3.0.pom
[linux-jdk10] [INFO] Downloaded from central: https://repo.maven.apache.org/maven2/javax/xml/bind/jaxb-api-parent/2.3.0/jaxb-api-parent-2.3.0.pom (5.6 kB at 434 kB/s)
[linux-jdk10] [INFO] Downloading from central: https://repo.maven.apache.org/maven2/net/java/jvnet-parent/5/jvnet-parent-5.pom
[linux-jdk10] [INFO] Downloaded from central: https://repo.maven.apache.org/maven2/net/java/jvnet-parent/5/jvnet-parent-5.pom (8.9 kB at 521 kB/s)
[linux-jdk10] [INFO] Downloading from central: https://repo.maven.apache.org/maven2/org/apache/maven/shared/maven-shared-resources/2/maven-shared-resources-2.jar
[linux-jdk10] [INFO] Downloading from central: https://repo.maven.apache.org/maven2/org/apache/maven/doxia/doxia-core/1.2/doxia-core-1.2.jar
[linux-jdk10] [INFO] Downloading from central: https://repo.maven.apache.org/maven2/commons-digester/commons-digester/1.6/commons-digester-1.6.jar
[linux-jdk10] [INFO] Downloading from central: https://repo.maven.apache.org/maven2/commons-logging/commons-logging/1.0.4/commons-logging-1.0.4.jar
[linux-jdk10] [INFO] Downloading from central: https://repo.maven.apache.org/maven2/org/apache/maven/doxia/doxia-integration-tools/1.6/doxia-integration-tools-1.6.jar
[linux-jdk10] [INFO] Downloaded from central: https://repo.maven.apache.org/maven2/org/apache/maven/shared/maven-shared-resources/2/maven-shared-resources-2.jar (13 kB at 933 kB/s)
[linux-jdk10] [INFO] Downloading from central: https://repo.maven.apache.org/maven2/commons-io/commons-io/1.4/commons-io-1.4.jar
[linux-jdk10] [INFO] Downloaded from central: https://repo.maven.apache.org/maven2/commons-logging/commons-logging/1.0.4/commons-logging-1.0.4.jar (38 kB at 2.2 MB/s)
[linux-jdk10] [INFO] Downloading from central: https://repo.maven.apache.org/maven2/org/codehaus/plexus/plexus-resources/1.1.0/plexus-resources-1.1.0.jar
[linux-jdk10] [INFO] Downloaded from central: https://repo.maven.apache.org/maven2/org/apache/maven/doxia/doxia-core/1.2/doxia-core-1.2.jar (154 kB at 8.1 MB/s)
[linux-jdk10] [INFO] Downloading from central: https://repo.maven.apache.org/maven2/com/puppycrawl/tools/checkstyle/6.18/checkstyle-6.18.jar
[linux-jdk10] [INFO] Downloaded from central: https://repo.maven.apache.org/maven2/commons-digester/commons-digester/1.6/commons-digester-1.6.jar (168 kB at 9.4 MB/s)
[linux-jdk10] [INFO] Downloading from central: https://repo.maven.apache.org/maven2/antlr/antlr/2.7.7/antlr-2.7.7.jar
[linux-jdk10] [INFO] Downloaded from central: https://repo.maven.apache.org/maven2/org/apache/maven/doxia/doxia-integration-tools/1.6/doxia-integration-tools-1.6.jar (45 kB at 2.6 MB/s)
[linux-jdk10] [INFO] Downloading from central: https://repo.maven.apache.org/maven2/org/antlr/antlr4-runtime/4.5.3/antlr4-runtime-4.5.3.jar
[linux-jdk10] [INFO] Downloaded from central: https://repo.maven.apache.org/maven2/org/codehaus/plexus/plexus-resources/1.1.0/plexus-resources-1.1.0.jar (23 kB at 800 kB/s)
[linux-jdk10] [INFO] Downloading from central: https://repo.maven.apache.org/maven2/commons-beanutils/commons-beanutils/1.9.2/commons-beanutils-1.9.2.jar
[linux-jdk10] [INFO] Downloaded from central: https://repo.maven.apache.org/maven2/commons-io/commons-io/1.4/commons-io-1.4.jar (109 kB at 3.5 MB/s)
[linux-jdk10] [INFO] Downloading from central: https://repo.maven.apache.org/maven2/commons-cli/commons-cli/1.3.1/commons-cli-1.3.1.jar
[linux-jdk10] [INFO] Downloaded from central: https://repo.maven.apache.org/maven2/org/antlr/antlr4-runtime/4.5.3/antlr4-runtime-4.5.3.jar (302 kB at 8.0 MB/s)
[linux-jdk10] [INFO] Downloading from central: https://repo.maven.apache.org/maven2/com/google/guava/guava/19.0/guava-19.0.jar
[linux-jdk10] [INFO] Downloaded from central: https://repo.maven.apache.org/maven2/antlr/antlr/2.7.7/antlr-2.7.7.jar (445 kB at 11 MB/s)
[linux-jdk10] [INFO] Downloading from central: https://repo.maven.apache.org/maven2/commons-lang/commons-lang/2.1/commons-lang-2.1.jar
[linux-jdk10] [INFO] Downloaded from central: https://repo.maven.apache.org/maven2/commons-cli/commons-cli/1.3.1/commons-cli-1.3.1.jar (53 kB at 1.1 MB/s)
[linux-jdk10] [INFO] Downloading from central: https://repo.maven.apache.org/maven2/javax/xml/bind/jaxb-api/2.3.0/jaxb-api-2.3.0.jar
[linux-jdk10] [INFO] Downloaded from central: https://repo.maven.apache.org/maven2/commons-beanutils/commons-beanutils/1.9.2/commons-beanutils-1.9.2.jar (234 kB at 4.7 MB/s)
[linux-jdk10] [INFO] Downloaded from central: https://repo.maven.apache.org/maven2/commons-lang/commons-lang/2.1/commons-lang-2.1.jar (208 kB at 3.6 MB/s)
[linux-jdk10] [INFO] Downloaded from central: https://repo.maven.apache.org/maven2/javax/xml/bind/jaxb-api/2.3.0/jaxb-api-2.3.0.jar (126 kB at 1.9 MB/s)
[linux-jdk10] [INFO] Downloaded from central: https://repo.maven.apache.org/maven2/com/puppycrawl/tools/checkstyle/6.18/checkstyle-6.18.jar (1.2 MB at 15 MB/s)
[linux-jdk10] [INFO] Downloaded from central: https://repo.maven.apache.org/maven2/com/google/guava/guava/19.0/guava-19.0.jar (2.3 MB at 23 MB/s)
[linux-jdk10] [INFO] There are 4 errors reported by Checkstyle 6.18 with config/maven_checks.xml ruleset.
[linux-jdk10] [INFO] Ignored 4 errors, 0 violation remaining.
[linux-jdk10] [INFO] 
[linux-jdk10] [INFO] --- maven-invoker-plugin:3.0.1:verify (integration-test) @ maven-javadoc-plugin ---
[linux-jdk10] [INFO] -------------------------------------------------
[linux-jdk10] [INFO] Build Summary:
[linux-jdk10] [INFO]   Passed: 33, Failed: 3, Errors: 0, Skipped: 0
[linux-jdk10] [INFO] -------------------------------------------------
[linux-jdk10] [WARNING] The following builds failed:
[linux-jdk10] [WARNING] *  MJAVADOC-257/pom.xml
[linux-jdk10] [WARNING] *  MJAVADOC-497/pom.xml
[linux-jdk10] [WARNING] *  detectLinks/pom.xml
[linux-jdk10] [INFO] -------------------------------------------------
[linux-jdk10] [WARNING] Ignoring that 3 builds failed.
[linux-jdk10] [INFO] ------------------------------------------------------------------------
[linux-jdk10] [INFO] BUILD SUCCESS
[linux-jdk10] [INFO] ------------------------------------------------------------------------
[linux-jdk10] [INFO] Total time: 07:21 min
[linux-jdk10] [INFO] Finished at: 2018-07-03T04:23:58Z
[linux-jdk10] [INFO] Final Memory: 54M/280M
[linux-jdk10] [INFO] ------------------------------------------------------------------------
[linux-jdk10] [INFO] [jenkins-event-spy] Generated /home/jenkins/jenkins-slave/workspace/javadoc-plugin_MJAVADOC-521-4VCCRI6KPRH73A3RWPEXQVQHXBYIUVYDLQPEN3Z2IPPUYMQWLG3Q@2@tmp/withMavenf35dd854/maven-spy-20180703-041636-84845574582925244057.log
[Pipeline] [linux-jdk10] }
[Pipeline] [linux-jdk10] // dir
[Pipeline] [linux-jdk10] }
[linux-jdk10] [withMaven] invokerPublisher - Archive invoker results for Maven artifact MavenArtifact{org.apache.maven.plugins:maven-javadoc-plugin::3.0.1-SNAPSHOT(version: 3.0.1-SNAPSHOT, snapshot:false) } generated by PluginInvocation{org.apache.maven.plugins:maven-invoker-plugin:3.0.1@integration-test  integration-test}: m/target/invoker-reports/*.xml
[linux-jdk10] performing MavenInvokerRecorder, reportsFilenamePattern:'**/m/target/invoker-reports/BUILD*.xml', invokerBuildDir:'**/m/target/it'
[linux-jdk10] Found reports:[/home/jenkins/jenkins-slave/workspace/javadoc-plugin_MJAVADOC-521-4VCCRI6KPRH73A3RWPEXQVQHXBYIUVYDLQPEN3Z2IPPUYMQWLG3Q@2/m/target/invoker-reports/BUILD-MJAVADOC-110.xml, /home/jenkins/jenkins-slave/workspace/javadoc-plugin_MJAVADOC-521-4VCCRI6KPRH73A3RWPEXQVQHXBYIUVYDLQPEN3Z2IPPUYMQWLG3Q@2/m/target/invoker-reports/BUILD-MJAVADOC-126.xml, /home/jenkins/jenkins-slave/workspace/javadoc-plugin_MJAVADOC-521-4VCCRI6KPRH73A3RWPEXQVQHXBYIUVYDLQPEN3Z2IPPUYMQWLG3Q@2/m/target/invoker-reports/BUILD-MJAVADOC-137.xml, /home/jenkins/jenkins-slave/workspace/javadoc-plugin_MJAVADOC-521-4VCCRI6KPRH73A3RWPEXQVQHXBYIUVYDLQPEN3Z2IPPUYMQWLG3Q@2/m/target/invoker-reports/BUILD-MJAVADOC-172.xml, /home/jenkins/jenkins-slave/workspace/javadoc-plugin_MJAVADOC-521-4VCCRI6KPRH73A3RWPEXQVQHXBYIUVYDLQPEN3Z2IPPUYMQWLG3Q@2/m/target/invoker-reports/BUILD-MJAVADOC-180.xml, /home/jenkins/jenkins-slave/workspace/javadoc-plugin_MJAVADOC-521-4VCCRI6KPRH73A3RWPEXQVQHXBYIUVYDLQPEN3Z2IPPUYMQWLG3Q@2/m/target/invoker-reports/BUILD-MJAVADOC-194.xml, /home/jenkins/jenkins-slave/workspace/javadoc-plugin_MJAVADOC-521-4VCCRI6KPRH73A3RWPEXQVQHXBYIUVYDLQPEN3Z2IPPUYMQWLG3Q@2/m/target/invoker-reports/BUILD-MJAVADOC-250.xml, /home/jenkins/jenkins-slave/workspace/javadoc-plugin_MJAVADOC-521-4VCCRI6KPRH73A3RWPEXQVQHXBYIUVYDLQPEN3Z2IPPUYMQWLG3Q@2/m/target/invoker-reports/BUILD-MJAVADOC-257.xml, /home/jenkins/jenkins-slave/workspace/javadoc-plugin_MJAVADOC-521-4VCCRI6KPRH73A3RWPEXQVQHXBYIUVYDLQPEN3Z2IPPUYMQWLG3Q@2/m/target/invoker-reports/BUILD-MJAVADOC-259.xml, /home/jenkins/jenkins-slave/workspace/javadoc-plugin_MJAVADOC-521-4VCCRI6KPRH73A3RWPEXQVQHXBYIUVYDLQPEN3Z2IPPUYMQWLG3Q@2/m/target/invoker-reports/BUILD-MJAVADOC-262.xml, /home/jenkins/jenkins-slave/workspace/javadoc-plugin_MJAVADOC-521-4VCCRI6KPRH73A3RWPEXQVQHXBYIUVYDLQPEN3Z2IPPUYMQWLG3Q@2/m/target/invoker-reports/BUILD-MJAVADOC-275.xml, /home/jenkins/jenkins-slave/workspace/javadoc-plugin_MJAVADOC-521-4VCCRI6KPRH73A3RWPEXQVQHXBYIUVYDLQPEN3Z2IPPUYMQWLG3Q@2/m/target/invoker-reports/BUILD-MJAVADOC-278.xml, /home/jenkins/jenkins-slave/workspace/javadoc-plugin_MJAVADOC-521-4VCCRI6KPRH73A3RWPEXQVQHXBYIUVYDLQPEN3Z2IPPUYMQWLG3Q@2/m/target/invoker-reports/BUILD-MJAVADOC-320.xml, /home/jenkins/jenkins-slave/workspace/javadoc-plugin_MJAVADOC-521-4VCCRI6KPRH73A3RWPEXQVQHXBYIUVYDLQPEN3Z2IPPUYMQWLG3Q@2/m/target/invoker-reports/BUILD-MJAVADOC-325.xml, /home/jenkins/jenkins-slave/workspace/javadoc-plugin_MJAVADOC-521-4VCCRI6KPRH73A3RWPEXQVQHXBYIUVYDLQPEN3Z2IPPUYMQWLG3Q@2/m/target/invoker-reports/BUILD-MJAVADOC-365.xml, /home/jenkins/jenkins-slave/workspace/javadoc-plugin_MJAVADOC-521-4VCCRI6KPRH73A3RWPEXQVQHXBYIUVYDLQPEN3Z2IPPUYMQWLG3Q@2/m/target/invoker-reports/BUILD-MJAVADOC-369.xml, /home/jenkins/jenkins-slave/workspace/javadoc-plugin_MJAVADOC-521-4VCCRI6KPRH73A3RWPEXQVQHXBYIUVYDLQPEN3Z2IPPUYMQWLG3Q@2/m/target/invoker-reports/BUILD-MJAVADOC-384.xml, /home/jenkins/jenkins-slave/workspace/javadoc-plugin_MJAVADOC-521-4VCCRI6KPRH73A3RWPEXQVQHXBYIUVYDLQPEN3Z2IPPUYMQWLG3Q@2/m/target/invoker-reports/BUILD-MJAVADOC-407.xml, /home/jenkins/jenkins-slave/workspace/javadoc-plugin_MJAVADOC-521-4VCCRI6KPRH73A3RWPEXQVQHXBYIUVYDLQPEN3Z2IPPUYMQWLG3Q@2/m/target/invoker-reports/BUILD-MJAVADOC-414.xml, /home/jenkins/jenkins-slave/workspace/javadoc-plugin_MJAVADOC-521-4VCCRI6KPRH73A3RWPEXQVQHXBYIUVYDLQPEN3Z2IPPUYMQWLG3Q@2/m/target/invoker-reports/BUILD-MJAVADOC-427.xml, /home/jenkins/jenkins-slave/workspace/javadoc-plugin_MJAVADOC-521-4VCCRI6KPRH73A3RWPEXQVQHXBYIUVYDLQPEN3Z2IPPUYMQWLG3Q@2/m/target/invoker-reports/BUILD-MJAVADOC-437.xml, /home/jenkins/jenkins-slave/workspace/javadoc-plugin_MJAVADOC-521-4VCCRI6KPRH73A3RWPEXQVQHXBYIUVYDLQPEN3Z2IPPUYMQWLG3Q@2/m/target/invoker-reports/BUILD-MJAVADOC-494_aggregate-repositories.xml, /home/jenkins/jenkins-slave/workspace/javadoc-plugin_MJAVADOC-521-4VCCRI6KPRH73A3RWPEXQVQHXBYIUVYDLQPEN3Z2IPPUYMQWLG3Q@2/m/target/invoker-reports/BUILD-MJAVADOC-497.xml, /home/jenkins/jenkins-slave/workspace/javadoc-plugin_MJAVADOC-521-4VCCRI6KPRH73A3RWPEXQVQHXBYIUVYDLQPEN3Z2IPPUYMQWLG3Q@2/m/target/invoker-reports/BUILD-MJAVADOC-498_aggr_modulepath.xml, /home/jenkins/jenkins-slave/workspace/javadoc-plugin_MJAVADOC-521-4VCCRI6KPRH73A3RWPEXQVQHXBYIUVYDLQPEN3Z2IPPUYMQWLG3Q@2/m/target/invoker-reports/BUILD-MJAVADOC-498_mm_modulepath.xml, /home/jenkins/jenkins-slave/workspace/javadoc-plugin_MJAVADOC-521-4VCCRI6KPRH73A3RWPEXQVQHXBYIUVYDLQPEN3Z2IPPUYMQWLG3Q@2/m/target/invoker-reports/BUILD-MJAVADOC-498_modulepath.xml, /home/jenkins/jenkins-slave/workspace/javadoc-plugin_MJAVADOC-521-4VCCRI6KPRH73A3RWPEXQVQHXBYIUVYDLQPEN3Z2IPPUYMQWLG3Q@2/m/target/invoker-reports/BUILD-MJAVADOC-508.xml, /home/jenkins/jenkins-slave/workspace/javadoc-plugin_MJAVADOC-521-4VCCRI6KPRH73A3RWPEXQVQHXBYIUVYDLQPEN3Z2IPPUYMQWLG3Q@2/m/target/invoker-reports/BUILD-additional-dependencies-non-aggregate.xml, /home/jenkins/jenkins-slave/workspace/javadoc-plugin_MJAVADOC-521-4VCCRI6KPRH73A3RWPEXQVQHXBYIUVYDLQPEN3Z2IPPUYMQWLG3Q@2/m/target/invoker-reports/BUILD-additional-dependencies.xml, /home/jenkins/jenkins-slave/workspace/javadoc-plugin_MJAVADOC-521-4VCCRI6KPRH73A3RWPEXQVQHXBYIUVYDLQPEN3Z2IPPUYMQWLG3Q@2/m/target/invoker-reports/BUILD-dependencySource-1.xml, /home/jenkins/jenkins-slave/workspace/javadoc-plugin_MJAVADOC-521-4VCCRI6KPRH73A3RWPEXQVQHXBYIUVYDLQPEN3Z2IPPUYMQWLG3Q@2/m/target/invoker-reports/BUILD-dependencySource-2.xml, /home/jenkins/jenkins-slave/workspace/javadoc-plugin_MJAVADOC-521-4VCCRI6KPRH73A3RWPEXQVQHXBYIUVYDLQPEN3Z2IPPUYMQWLG3Q@2/m/target/invoker-reports/BUILD-dependencySource-3.xml, /home/jenkins/jenkins-slave/workspace/javadoc-plugin_MJAVADOC-521-4VCCRI6KPRH73A3RWPEXQVQHXBYIUVYDLQPEN3Z2IPPUYMQWLG3Q@2/m/target/invoker-reports/BUILD-dependencySource-4.xml, /home/jenkins/jenkins-slave/workspace/javadoc-plugin_MJAVADOC-521-4VCCRI6KPRH73A3RWPEXQVQHXBYIUVYDLQPEN3Z2IPPUYMQWLG3Q@2/m/target/invoker-reports/BUILD-detectLinks.xml, /home/jenkins/jenkins-slave/workspace/javadoc-plugin_MJAVADOC-521-4VCCRI6KPRH73A3RWPEXQVQHXBYIUVYDLQPEN3Z2IPPUYMQWLG3Q@2/m/target/invoker-reports/BUILD-javadoc-fix.xml, /home/jenkins/jenkins-slave/workspace/javadoc-plugin_MJAVADOC-521-4VCCRI6KPRH73A3RWPEXQVQHXBYIUVYDLQPEN3Z2IPPUYMQWLG3Q@2/m/target/invoker-reports/BUILD-site-failOnError.xml]
[linux-jdk10] Found logs:[/home/jenkins/jenkins-slave/workspace/javadoc-plugin_MJAVADOC-521-4VCCRI6KPRH73A3RWPEXQVQHXBYIUVYDLQPEN3Z2IPPUYMQWLG3Q@2/m/target/it/MJAVADOC-110/build.log, /home/jenkins/jenkins-slave/workspace/javadoc-plugin_MJAVADOC-521-4VCCRI6KPRH73A3RWPEXQVQHXBYIUVYDLQPEN3Z2IPPUYMQWLG3Q@2/m/target/it/MJAVADOC-126/build.log, /home/jenkins/jenkins-slave/workspace/javadoc-plugin_MJAVADOC-521-4VCCRI6KPRH73A3RWPEXQVQHXBYIUVYDLQPEN3Z2IPPUYMQWLG3Q@2/m/target/it/MJAVADOC-137/build.log, /home/jenkins/jenkins-slave/workspace/javadoc-plugin_MJAVADOC-521-4VCCRI6KPRH73A3RWPEXQVQHXBYIUVYDLQPEN3Z2IPPUYMQWLG3Q@2/m/target/it/MJAVADOC-172/build.log, /home/jenkins/jenkins-slave/workspace/javadoc-plugin_MJAVADOC-521-4VCCRI6KPRH73A3RWPEXQVQHXBYIUVYDLQPEN3Z2IPPUYMQWLG3Q@2/m/target/it/MJAVADOC-180/build.log, /home/jenkins/jenkins-slave/workspace/javadoc-plugin_MJAVADOC-521-4VCCRI6KPRH73A3RWPEXQVQHXBYIUVYDLQPEN3Z2IPPUYMQWLG3Q@2/m/target/it/MJAVADOC-194/build.log, /home/jenkins/jenkins-slave/workspace/javadoc-plugin_MJAVADOC-521-4VCCRI6KPRH73A3RWPEXQVQHXBYIUVYDLQPEN3Z2IPPUYMQWLG3Q@2/m/target/it/MJAVADOC-250/build.log, /home/jenkins/jenkins-slave/workspace/javadoc-plugin_MJAVADOC-521-4VCCRI6KPRH73A3RWPEXQVQHXBYIUVYDLQPEN3Z2IPPUYMQWLG3Q@2/m/target/it/MJAVADOC-257/build.log, /home/jenkins/jenkins-slave/workspace/javadoc-plugin_MJAVADOC-521-4VCCRI6KPRH73A3RWPEXQVQHXBYIUVYDLQPEN3Z2IPPUYMQWLG3Q@2/m/target/it/MJAVADOC-259/build.log, /home/jenkins/jenkins-slave/workspace/javadoc-plugin_MJAVADOC-521-4VCCRI6KPRH73A3RWPEXQVQHXBYIUVYDLQPEN3Z2IPPUYMQWLG3Q@2/m/target/it/MJAVADOC-262/build.log, /home/jenkins/jenkins-slave/workspace/javadoc-plugin_MJAVADOC-521-4VCCRI6KPRH73A3RWPEXQVQHXBYIUVYDLQPEN3Z2IPPUYMQWLG3Q@2/m/target/it/MJAVADOC-275/build.log, /home/jenkins/jenkins-slave/workspace/javadoc-plugin_MJAVADOC-521-4VCCRI6KPRH73A3RWPEXQVQHXBYIUVYDLQPEN3Z2IPPUYMQWLG3Q@2/m/target/it/MJAVADOC-278/build.log, /home/jenkins/jenkins-slave/workspace/javadoc-plugin_MJAVADOC-521-4VCCRI6KPRH73A3RWPEXQVQHXBYIUVYDLQPEN3Z2IPPUYMQWLG3Q@2/m/target/it/MJAVADOC-320/build.log, /home/jenkins/jenkins-slave/workspace/javadoc-plugin_MJAVADOC-521-4VCCRI6KPRH73A3RWPEXQVQHXBYIUVYDLQPEN3Z2IPPUYMQWLG3Q@2/m/target/it/MJAVADOC-325/build.log, /home/jenkins/jenkins-slave/workspace/javadoc-plugin_MJAVADOC-521-4VCCRI6KPRH73A3RWPEXQVQHXBYIUVYDLQPEN3Z2IPPUYMQWLG3Q@2/m/target/it/MJAVADOC-365/build.log, /home/jenkins/jenkins-slave/workspace/javadoc-plugin_MJAVADOC-521-4VCCRI6KPRH73A3RWPEXQVQHXBYIUVYDLQPEN3Z2IPPUYMQWLG3Q@2/m/target/it/MJAVADOC-369/build.log, /home/jenkins/jenkins-slave/workspace/javadoc-plugin_MJAVADOC-521-4VCCRI6KPRH73A3RWPEXQVQHXBYIUVYDLQPEN3Z2IPPUYMQWLG3Q@2/m/target/it/MJAVADOC-384/build.log, /home/jenkins/jenkins-slave/workspace/javadoc-plugin_MJAVADOC-521-4VCCRI6KPRH73A3RWPEXQVQHXBYIUVYDLQPEN3Z2IPPUYMQWLG3Q@2/m/target/it/MJAVADOC-407/build.log, /home/jenkins/jenkins-slave/workspace/javadoc-plugin_MJAVADOC-521-4VCCRI6KPRH73A3RWPEXQVQHXBYIUVYDLQPEN3Z2IPPUYMQWLG3Q@2/m/target/it/MJAVADOC-414/build.log, /home/jenkins/jenkins-slave/workspace/javadoc-plugin_MJAVADOC-521-4VCCRI6KPRH73A3RWPEXQVQHXBYIUVYDLQPEN3Z2IPPUYMQWLG3Q@2/m/target/it/MJAVADOC-427/build.log, /home/jenkins/jenkins-slave/workspace/javadoc-plugin_MJAVADOC-521-4VCCRI6KPRH73A3RWPEXQVQHXBYIUVYDLQPEN3Z2IPPUYMQWLG3Q@2/m/target/it/MJAVADOC-437/build.log, /home/jenkins/jenkins-slave/workspace/javadoc-plugin_MJAVADOC-521-4VCCRI6KPRH73A3RWPEXQVQHXBYIUVYDLQPEN3Z2IPPUYMQWLG3Q@2/m/target/it/MJAVADOC-494_aggregate-repositories/build.log, /home/jenkins/jenkins-slave/workspace/javadoc-plugin_MJAVADOC-521-4VCCRI6KPRH73A3RWPEXQVQHXBYIUVYDLQPEN3Z2IPPUYMQWLG3Q@2/m/target/it/MJAVADOC-497/build.log, /home/jenkins/jenkins-slave/workspace/javadoc-plugin_MJAVADOC-521-4VCCRI6KPRH73A3RWPEXQVQHXBYIUVYDLQPEN3Z2IPPUYMQWLG3Q@2/m/target/it/MJAVADOC-498_aggr_modulepath/build.log, /home/jenkins/jenkins-slave/workspace/javadoc-plugin_MJAVADOC-521-4VCCRI6KPRH73A3RWPEXQVQHXBYIUVYDLQPEN3Z2IPPUYMQWLG3Q@2/m/target/it/MJAVADOC-498_mm_modulepath/build.log, /home/jenkins/jenkins-slave/workspace/javadoc-plugin_MJAVADOC-521-4VCCRI6KPRH73A3RWPEXQVQHXBYIUVYDLQPEN3Z2IPPUYMQWLG3Q@2/m/target/it/MJAVADOC-498_modulepath/build.log, /home/jenkins/jenkins-slave/workspace/javadoc-plugin_MJAVADOC-521-4VCCRI6KPRH73A3RWPEXQVQHXBYIUVYDLQPEN3Z2IPPUYMQWLG3Q@2/m/target/it/MJAVADOC-508/build.log, /home/jenkins/jenkins-slave/workspace/javadoc-plugin_MJAVADOC-521-4VCCRI6KPRH73A3RWPEXQVQHXBYIUVYDLQPEN3Z2IPPUYMQWLG3Q@2/m/target/it/additional-dependencies-non-aggregate/build.log, /home/jenkins/jenkins-slave/workspace/javadoc-plugin_MJAVADOC-521-4VCCRI6KPRH73A3RWPEXQVQHXBYIUVYDLQPEN3Z2IPPUYMQWLG3Q@2/m/target/it/additional-dependencies/build.log, /home/jenkins/jenkins-slave/workspace/javadoc-plugin_MJAVADOC-521-4VCCRI6KPRH73A3RWPEXQVQHXBYIUVYDLQPEN3Z2IPPUYMQWLG3Q@2/m/target/it/dependencySource-1/build.log, /home/jenkins/jenkins-slave/workspace/javadoc-plugin_MJAVADOC-521-4VCCRI6KPRH73A3RWPEXQVQHXBYIUVYDLQPEN3Z2IPPUYMQWLG3Q@2/m/target/it/dependencySource-2/build.log, /home/jenkins/jenkins-slave/workspace/javadoc-plugin_MJAVADOC-521-4VCCRI6KPRH73A3RWPEXQVQHXBYIUVYDLQPEN3Z2IPPUYMQWLG3Q@2/m/target/it/dependencySource-3/build.log, /home/jenkins/jenkins-slave/workspace/javadoc-plugin_MJAVADOC-521-4VCCRI6KPRH73A3RWPEXQVQHXBYIUVYDLQPEN3Z2IPPUYMQWLG3Q@2/m/target/it/dependencySource-4/build.log, /home/jenkins/jenkins-slave/workspace/javadoc-plugin_MJAVADOC-521-4VCCRI6KPRH73A3RWPEXQVQHXBYIUVYDLQPEN3Z2IPPUYMQWLG3Q@2/m/target/it/detectLinks/build.log, /home/jenkins/jenkins-slave/workspace/javadoc-plugin_MJAVADOC-521-4VCCRI6KPRH73A3RWPEXQVQHXBYIUVYDLQPEN3Z2IPPUYMQWLG3Q@2/m/target/it/javadoc-fix/build.log, /home/jenkins/jenkins-slave/workspace/javadoc-plugin_MJAVADOC-521-4VCCRI6KPRH73A3RWPEXQVQHXBYIUVYDLQPEN3Z2IPPUYMQWLG3Q@2/m/target/it/site-failOnError/build.log]
[linux-jdk10] Finished parsing Maven Invoker results (found 36)
[linux-jdk10] [withMaven] junitPublisher - Archive test results for Maven artifact org.apache.maven.plugins:maven-javadoc-plugin:3.0.1-SNAPSHOT generated by maven-surefire-plugin:test (default-test): m/target/surefire-reports/*.xml
[linux-jdk10] Recording test results
[Pipeline] [linux-jdk10] // withMaven
[Pipeline] [linux-jdk10] }
[Pipeline] [linux-jdk10] // stage
[Pipeline] [linux-jdk10] }
[Pipeline] [linux-jdk10] // node
[Pipeline] [linux-jdk10] }
[Pipeline] // parallel
[Pipeline] stage
[Pipeline] { (Notifications)
[Pipeline] echo
Build result: UNSTABLE
[Pipeline] jiraIssueSelector
[Pipeline] emailext
Mime
  • Unnamed multipart/mixed (inline, None, 0 bytes)
View raw message