maven-notifications mailing list archives

Site index · List index
Message view « Date » · « Thread »
Top « Date » · « Thread »
From Apache Jenkins Server <jenk...@builds.apache.org>
Subject Build failed in Jenkins: Maven TLP » maven-verifier-plugin » master #18
Date Fri, 13 Jul 2018 13:24:53 GMT
See https://builds.apache.org/job/maven-box/job/maven-verifier-plugin/job/master/18/

No changes.

All tests passed

Build log:
[...truncated 355.95 KB...]
[Pipeline] [windows-jdk9] }
[Pipeline] [windows-jdk9] // node
[windows-jdk10] Running on windows-2012-2 in f:\jenkins\jenkins-slave\workspace\aven-verifier-plugin_master-HSCDHQJXT5RJNUUH6OIYTY636JPRROEDKOBLHF3ONXUPSAU6TFYQ
[Pipeline] [windows-jdk9] }
[Pipeline] [windows-jdk10] {
[Pipeline] [windows-jdk10] stage
[Pipeline] [windows-jdk10] { (Checkout windows-jdk10)
[Pipeline] [windows-jdk10] dir
[windows-jdk10] Running in f:\jenkins\jenkins-slave\workspace\aven-verifier-plugin_master-HSCDHQJXT5RJNUUH6OIYTY636JPRROEDKOBLHF3ONXUPSAU6TFYQ\m
[Pipeline] [windows-jdk10] {
[Pipeline] [windows-jdk10] checkout
[windows-jdk10]  > git rev-parse --is-inside-work-tree # timeout=10
[windows-jdk10] Fetching changes from the remote Git repository
[windows-jdk10]  > git config remote.origin.url https://gitbox.apache.org/repos/asf/maven-verifier-plugin.git
# timeout=10
[windows-jdk10] Fetching without tags
[windows-jdk10] Fetching upstream changes from https://gitbox.apache.org/repos/asf/maven-verifier-plugin.git
[windows-jdk10]  > git --version # timeout=10
[windows-jdk10]  > git fetch --no-tags --progress https://gitbox.apache.org/repos/asf/maven-verifier-plugin.git
+refs/heads/*:refs/remotes/origin/*
[windows-jdk10] Checking out Revision 612acaa39ad59150966751ef9ca6198cd2dc1cb2 (master)
[windows-jdk10]  > git config core.sparsecheckout # timeout=10
[windows-jdk10]  > git checkout -f 612acaa39ad59150966751ef9ca6198cd2dc1cb2
[windows-jdk10] Commit message: "[INFRA-16467] move components documentation out of CMS space"
[windows-jdk10] Cleaning workspace
[windows-jdk10]  > git rev-parse --verify HEAD # timeout=10
[windows-jdk10] Resetting working tree
[windows-jdk10]  > git reset --hard # timeout=10
[windows-jdk10]  > git clean -fdx # timeout=10
[Pipeline] [windows-jdk10] }
[Pipeline] [windows-jdk10] // dir
[Pipeline] [windows-jdk10] }
[Pipeline] [windows-jdk10] // stage
[Pipeline] [windows-jdk10] stage
[Pipeline] [windows-jdk10] { (Build windows-jdk10)
[Pipeline] [windows-jdk10] withMaven
[windows-jdk10] [withMaven] Options: [org.jenkinsci.plugins.pipeline.maven.publishers.GeneratedArtifactsPublisher[disabled=true],
JunitTestsPublisher[disabled=false,healthScaleFactor=,keepLongStdio=false,ignoreAttachments=false],
org.jenkinsci.plugins.pipeline.maven.publishers.FindbugsAnalysisPublisher[disabled='true',
healthy='', unHealthy='', thresholdLimit='low'], org.jenkinsci.plugins.pipeline.maven.publishers.TasksScannerPublisher[disabled='true',
healthy='', unHealthy='', thresholdLimit='low'], org.jenkinsci.plugins.pipeline.maven.publishers.DependenciesFingerprintPublisher[disabled=false,
scopes=[compile, provided, runtime], versions={snapshot:true, release:false}], org.jenkinsci.plugins.pipeline.maven.publishers.InvokerRunsPublisher[disabled=false],
org.jenkinsci.plugins.pipeline.maven.publishers.PipelineGraphPublisher[disabled=false, scopes=[compile,
provided, runtime], versions={snapshot:true, release:false}, skipDownstreamTriggers=false,
lifecycleThreshold=deploy, ignoreUpstreamTriggers=false]]
[windows-jdk10] [withMaven] Available options: 
[windows-jdk10] [withMaven] using JDK installation JDK 10 (latest)
[windows-jdk10] [withMaven] using Maven installation 'Maven 3.5.0 (Windows)'
[Pipeline] [windows-jdk10] {
[Pipeline] [windows-jdk10] dir
[windows-jdk10] Running in f:\jenkins\jenkins-slave\workspace\aven-verifier-plugin_master-HSCDHQJXT5RJNUUH6OIYTY636JPRROEDKOBLHF3ONXUPSAU6TFYQ\m
[Pipeline] [windows-jdk10] {
[Pipeline] [windows-jdk10] isUnix
[Pipeline] [windows-jdk10] bat
[windows-jdk10] [m] Running batch script
[windows-jdk10] 
[windows-jdk10] f:\jenkins\jenkins-slave\workspace\aven-verifier-plugin_master-HSCDHQJXT5RJNUUH6OIYTY636JPRROEDKOBLHF3ONXUPSAU6TFYQ\m>mvn
-P+run-its -Dmaven.test.failure.ignore=true -Dfindbugs.failOnError=false -Dfindbugs.skip=true
clean verify 
[windows-jdk10] ----- withMaven Wrapper script -----
[windows-jdk10] Picked up JAVA_TOOL_OPTIONS: -Dmaven.ext.class.path="f:\jenkins\jenkins-slave\workspace\aven-verifier-plugin_master-HSCDHQJXT5RJNUUH6OIYTY636JPRROEDKOBLHF3ONXUPSAU6TFYQ@tmp\withMaven95c9081e\pipeline-maven-spy.jar"
-Dorg.jenkinsci.plugins.pipeline.maven.reportsFolder="f:\jenkins\jenkins-slave\workspace\aven-verifier-plugin_master-HSCDHQJXT5RJNUUH6OIYTY636JPRROEDKOBLHF3ONXUPSAU6TFYQ@tmp\withMaven95c9081e"

[windows-jdk10] Apache Maven 3.5.0 (ff8f5e7444045639af65f6095c62210b5713f426; 2017-04-03T19:39:06Z)
[windows-jdk10] Maven home: F:\jenkins\tools\maven\apache-maven-3.5.0\bin\..
[windows-jdk10] Java version: 10, vendor: Oracle Corporation
[windows-jdk10] Java home: f:\jenkins\tools\java\latest10
[windows-jdk10] Default locale: en_US, platform encoding: Cp1252
[windows-jdk10] OS name: "windows server 2012 r2", version: "6.3", arch: "amd64", family:
"windows"
[windows-jdk10] [INFO] [jenkins-event-spy] Generate F:\jenkins\jenkins-slave\workspace\aven-verifier-plugin_master-HSCDHQJXT5RJNUUH6OIYTY636JPRROEDKOBLHF3ONXUPSAU6TFYQ@tmp\withMaven95c9081e\maven-spy-20180713-131841-83712508363353552332631.log.tmp
...
[windows-jdk10] [INFO] Scanning for projects...
[windows-jdk10] [INFO] 
[windows-jdk10] [INFO] ------------------------------------------------------------------------
[windows-jdk10] [INFO] Building Apache Maven Verifier Plugin 3.0.0-SNAPSHOT
[windows-jdk10] [INFO] ------------------------------------------------------------------------
[windows-jdk10] [INFO] 
[windows-jdk10] [INFO] --- maven-clean-plugin:3.0.0:clean (default-clean) @ maven-verifier-plugin
---
[windows-jdk10] [INFO] 
[windows-jdk10] [INFO] --- maven-enforcer-plugin:1.4.1:enforce (enforce-maven-version) @ maven-verifier-plugin
---
[windows-jdk10] [INFO] 
[windows-jdk10] [INFO] --- maven-enforcer-plugin:1.4.1:enforce (enforce-bytecode-version)
@ maven-verifier-plugin ---
[windows-jdk10] [INFO] 
[windows-jdk10] [INFO] --- maven-enforcer-plugin:1.4.1:enforce (ban-known-bad-maven-versions)
@ maven-verifier-plugin ---
[windows-jdk10] [INFO] 
[windows-jdk10] [INFO] --- maven-enforcer-plugin:1.4.1:enforce (ensure-no-container-api) @
maven-verifier-plugin ---
[windows-jdk10] [INFO] 
[windows-jdk10] [INFO] --- apache-rat-plugin:0.12:check (rat-check) @ maven-verifier-plugin
---
[windows-jdk10] [INFO] Enabled default license matchers.
[windows-jdk10] [INFO] Will parse SCM ignores for exclusions...
[windows-jdk10] [INFO] Parsing exclusions from f:\jenkins\jenkins-slave\workspace\aven-verifier-plugin_master-HSCDHQJXT5RJNUUH6OIYTY636JPRROEDKOBLHF3ONXUPSAU6TFYQ\m\.gitignore
[windows-jdk10] [INFO] Finished adding exclusions from SCM ignore files.
[windows-jdk10] [INFO] 71 implicit excludes (use -debug for more details).
[windows-jdk10] [INFO] Exclude: .repository/**
[windows-jdk10] [INFO] Exclude: .maven/spy.log
[windows-jdk10] [INFO] Exclude: dependency-reduced-pom.xml
[windows-jdk10] [INFO] Exclude: .java-version
[windows-jdk10] [INFO] 29 resources included (use -debug for more details)
[windows-jdk10] [INFO] Rat check: Summary over all files. Unapproved: 0, unknown: 0, generated:
0, approved: 29 licenses.
[windows-jdk10] [INFO] 
[windows-jdk10] [INFO] --- maven-plugin-plugin:3.5.1:helpmojo (generate-helpmojo) @ maven-verifier-plugin
---
[windows-jdk10] [INFO] Using 'UTF-8' encoding to read mojo source files.
[windows-jdk10] [INFO] java-javadoc mojo extractor found 0 mojo descriptor.
[windows-jdk10] [INFO] java-annotations mojo extractor found 0 mojo descriptor.
[windows-jdk10] [INFO] 
[windows-jdk10] [INFO] --- modello-maven-plugin:1.9.1:java (standard) @ maven-verifier-plugin
---
[windows-jdk10] [INFO] outputDirectory: f:\jenkins\jenkins-slave\workspace\aven-verifier-plugin_master-HSCDHQJXT5RJNUUH6OIYTY636JPRROEDKOBLHF3ONXUPSAU6TFYQ\m\target\generated-sources\modello
[windows-jdk10] [INFO] Working on model: src/main/mdo/verifications.mdo
[windows-jdk10] [INFO] Generating current version: 1.0.0
[windows-jdk10] [INFO] 
[windows-jdk10] [INFO] --- modello-maven-plugin:1.9.1:xpp3-reader (standard) @ maven-verifier-plugin
---
[windows-jdk10] [INFO] outputDirectory: f:\jenkins\jenkins-slave\workspace\aven-verifier-plugin_master-HSCDHQJXT5RJNUUH6OIYTY636JPRROEDKOBLHF3ONXUPSAU6TFYQ\m\target\generated-sources\modello
[windows-jdk10] [INFO] Working on model: src/main/mdo/verifications.mdo
[windows-jdk10] [INFO] Generating current version: 1.0.0
[windows-jdk10] [INFO] 
[windows-jdk10] [INFO] --- modello-maven-plugin:1.9.1:xpp3-writer (standard) @ maven-verifier-plugin
---
[windows-jdk10] [INFO] outputDirectory: f:\jenkins\jenkins-slave\workspace\aven-verifier-plugin_master-HSCDHQJXT5RJNUUH6OIYTY636JPRROEDKOBLHF3ONXUPSAU6TFYQ\m\target\generated-sources\modello
[windows-jdk10] [INFO] Working on model: src/main/mdo/verifications.mdo
[windows-jdk10] [INFO] Generating current version: 1.0.0
[windows-jdk10] [INFO] 
[windows-jdk10] [INFO] --- maven-remote-resources-plugin:1.5:process (process-resource-bundles)
@ maven-verifier-plugin ---
[windows-jdk10] [INFO] 
[windows-jdk10] [INFO] --- maven-resources-plugin:3.0.2:resources (default-resources) @ maven-verifier-plugin
---
[windows-jdk10] [INFO] Using 'UTF-8' encoding to copy filtered resources.
[windows-jdk10] [INFO] skip non existing resourceDirectory f:\jenkins\jenkins-slave\workspace\aven-verifier-plugin_master-HSCDHQJXT5RJNUUH6OIYTY636JPRROEDKOBLHF3ONXUPSAU6TFYQ\m\src\main\resources
[windows-jdk10] [INFO] Copying 3 resources
[windows-jdk10] [INFO] 
[windows-jdk10] [INFO] --- maven-compiler-plugin:3.7.0:compile (default-compile) @ maven-verifier-plugin
---
[windows-jdk10] [INFO] Changes detected - recompiling the module!
[windows-jdk10] [INFO] Compiling 9 source files to f:\jenkins\jenkins-slave\workspace\aven-verifier-plugin_master-HSCDHQJXT5RJNUUH6OIYTY636JPRROEDKOBLHF3ONXUPSAU6TFYQ\m\target\classes
[windows-jdk10] [INFO] /f:/jenkins/jenkins-slave/workspace/aven-verifier-plugin_master-HSCDHQJXT5RJNUUH6OIYTY636JPRROEDKOBLHF3ONXUPSAU6TFYQ/m/target/generated-sources/modello/org/apache/maven/plugin/verifier/model/io/xpp3/VerificationsXpp3Reader.java:
f:\jenkins\jenkins-slave\workspace\aven-verifier-plugin_master-HSCDHQJXT5RJNUUH6OIYTY636JPRROEDKOBLHF3ONXUPSAU6TFYQ\m\target\generated-sources\modello\org\apache\maven\plugin\verifier\model\io\xpp3\VerificationsXpp3Reader.java
uses unchecked or unsafe operations.
[windows-jdk10] [INFO] /f:/jenkins/jenkins-slave/workspace/aven-verifier-plugin_master-HSCDHQJXT5RJNUUH6OIYTY636JPRROEDKOBLHF3ONXUPSAU6TFYQ/m/target/generated-sources/modello/org/apache/maven/plugin/verifier/model/io/xpp3/VerificationsXpp3Reader.java:
Recompile with -Xlint:unchecked for details.
[windows-jdk10] [INFO] 
[windows-jdk10] [INFO] --- maven-plugin-plugin:3.5.1:descriptor (default-descriptor) @ maven-verifier-plugin
---
[windows-jdk10] [INFO] Using 'UTF-8' encoding to read mojo source files.
[windows-jdk10] [INFO] java-javadoc mojo extractor found 0 mojo descriptor.
[windows-jdk10] [INFO] java-annotations mojo extractor found 2 mojo descriptors.
[windows-jdk10] [INFO] 
[windows-jdk10] [INFO] --- maven-resources-plugin:3.0.2:testResources (default-testResources)
@ maven-verifier-plugin ---
[windows-jdk10] [INFO] Using 'UTF-8' encoding to copy filtered resources.
[windows-jdk10] [INFO] Copying 6 resources
[windows-jdk10] [INFO] Copying 3 resources
[windows-jdk10] [INFO] 
[windows-jdk10] [INFO] --- maven-compiler-plugin:3.7.0:testCompile (default-testCompile) @
maven-verifier-plugin ---
[windows-jdk10] [INFO] Changes detected - recompiling the module!
[windows-jdk10] [INFO] Compiling 1 source file to f:\jenkins\jenkins-slave\workspace\aven-verifier-plugin_master-HSCDHQJXT5RJNUUH6OIYTY636JPRROEDKOBLHF3ONXUPSAU6TFYQ\m\target\test-classes
[windows-jdk10] [INFO] 
[windows-jdk10] [INFO] --- maven-surefire-plugin:2.21.0:test (default-test) @ maven-verifier-plugin
---
[windows-jdk10] [INFO] 
[windows-jdk10] [INFO] -------------------------------------------------------
[windows-jdk10] [INFO]  T E S T S
[windows-jdk10] [INFO] -------------------------------------------------------
[windows-jdk10] [INFO] Running org.apache.maven.plugins.verifier.VerifierMojoTest
[windows-jdk10] [debug] Verifying absence of f:\jenkins\jenkins-slave\workspace\aven-verifier-plugin_master-HSCDHQJXT5RJNUUH6OIYTY636JPRROEDKOBLHF3ONXUPSAU6TFYQ\m\target\test-classes\InexistentFileThatExists.xml
[windows-jdk10] [debug] Verifying existence of f:\jenkins\jenkins-slave\workspace\aven-verifier-plugin_master-HSCDHQJXT5RJNUUH6OIYTY636JPRROEDKOBLHF3ONXUPSAU6TFYQ\m\target\test-classes\FileExistsValidContent.xml
[windows-jdk10] [debug] Verifying contents of f:\jenkins\jenkins-slave\workspace\aven-verifier-plugin_master-HSCDHQJXT5RJNUUH6OIYTY636JPRROEDKOBLHF3ONXUPSAU6TFYQ\m\target\test-classes\FileExistsValidContent.xml
[windows-jdk10] [debug] Verifying existence of f:\jenkins\jenkins-slave\workspace\aven-verifier-plugin_master-HSCDHQJXT5RJNUUH6OIYTY636JPRROEDKOBLHF3ONXUPSAU6TFYQ\m\target\test-classes\FileExistsValidContent.xml
[windows-jdk10] [debug] Verifying contents of f:\jenkins\jenkins-slave\workspace\aven-verifier-plugin_master-HSCDHQJXT5RJNUUH6OIYTY636JPRROEDKOBLHF3ONXUPSAU6TFYQ\m\target\test-classes\FileExistsValidContent.xml
[windows-jdk10] [debug] Verifying absence of c:\some\path\src\test\resources\Dummy.xml
[windows-jdk10] [debug] Verifying existence of f:\jenkins\jenkins-slave\workspace\aven-verifier-plugin_master-HSCDHQJXT5RJNUUH6OIYTY636JPRROEDKOBLHF3ONXUPSAU6TFYQ\m\target\test-classes\File
Exists.xml
[windows-jdk10] [debug] Verifying existence of c:\some\path\src\test\resources\Dummy.xml
[windows-jdk10] [INFO] Tests run: 8, Failures: 0, Errors: 0, Skipped: 0, Time elapsed: 0.105
s - in org.apache.maven.plugins.verifier.VerifierMojoTest
[windows-jdk10] [INFO] 
[windows-jdk10] [INFO] Results:
[windows-jdk10] [INFO] 
[windows-jdk10] [INFO] Tests run: 8, Failures: 0, Errors: 0, Skipped: 0
[windows-jdk10] [INFO] 
[windows-jdk10] [INFO] 
[windows-jdk10] [INFO] --- maven-jar-plugin:3.0.2:jar (default-jar) @ maven-verifier-plugin
---
[windows-jdk10] [INFO] Building jar: f:\jenkins\jenkins-slave\workspace\aven-verifier-plugin_master-HSCDHQJXT5RJNUUH6OIYTY636JPRROEDKOBLHF3ONXUPSAU6TFYQ\m\target\maven-verifier-plugin-3.0.0-SNAPSHOT.jar
[windows-jdk10] [INFO] 
[windows-jdk10] [INFO] --- maven-plugin-plugin:3.5.1:addPluginArtifactMetadata (default-addPluginArtifactMetadata)
@ maven-verifier-plugin ---
[windows-jdk10] [INFO] 
[windows-jdk10] [INFO] --- maven-site-plugin:3.7:attach-descriptor (attach-descriptor) @ maven-verifier-plugin
---
[windows-jdk10] [INFO] Skipping because packaging 'maven-plugin' is not pom.
[windows-jdk10] [INFO] 
[windows-jdk10] [INFO] --- maven-invoker-plugin:3.0.1:install (integration-test) @ maven-verifier-plugin
---
[windows-jdk10] [INFO] Installing f:\jenkins\jenkins-slave\workspace\aven-verifier-plugin_master-HSCDHQJXT5RJNUUH6OIYTY636JPRROEDKOBLHF3ONXUPSAU6TFYQ\m\pom.xml
to f:\jenkins\jenkins-slave\workspace\aven-verifier-plugin_master-HSCDHQJXT5RJNUUH6OIYTY636JPRROEDKOBLHF3ONXUPSAU6TFYQ\m\target\local-repo\org\apache\maven\plugins\maven-verifier-plugin\3.0.0-SNAPSHOT\maven-verifier-plugin-3.0.0-SNAPSHOT.pom
[windows-jdk10] [INFO] Installing f:\jenkins\jenkins-slave\workspace\aven-verifier-plugin_master-HSCDHQJXT5RJNUUH6OIYTY636JPRROEDKOBLHF3ONXUPSAU6TFYQ\m\target\maven-verifier-plugin-3.0.0-SNAPSHOT.jar
to f:\jenkins\jenkins-slave\workspace\aven-verifier-plugin_master-HSCDHQJXT5RJNUUH6OIYTY636JPRROEDKOBLHF3ONXUPSAU6TFYQ\m\target\local-repo\org\apache\maven\plugins\maven-verifier-plugin\3.0.0-SNAPSHOT\maven-verifier-plugin-3.0.0-SNAPSHOT.jar
[windows-jdk10] [INFO] 
[windows-jdk10] [INFO] --- maven-invoker-plugin:3.0.1:integration-test (integration-test)
@ maven-verifier-plugin ---
[windows-jdk10] [INFO] Running Setup Jobs
[windows-jdk10] [INFO] Building: default\pom.xml
[windows-jdk10] [INFO]           default\pom.xml .................................. SUCCESS
(7.6 s)
[windows-jdk10] [INFO] Building: simple\pom.xml
[windows-jdk10] [INFO]           simple\pom.xml ................................... SUCCESS
(4.2 s)
[windows-jdk10] [INFO] 
[windows-jdk10] [INFO] --- maven-checkstyle-plugin:3.0.0:check (checkstyle-check) @ maven-verifier-plugin
---
[windows-jdk10] [INFO] 
[windows-jdk10] [INFO] --- maven-invoker-plugin:3.0.1:verify (integration-test) @ maven-verifier-plugin
---
[windows-jdk10] [INFO] -------------------------------------------------
[windows-jdk10] [INFO] Build Summary:
[windows-jdk10] [INFO]   Passed: 2, Failed: 0, Errors: 0, Skipped: 0
[windows-jdk10] [INFO] -------------------------------------------------
[windows-jdk10] [INFO] ------------------------------------------------------------------------
[windows-jdk10] [INFO] BUILD SUCCESS
[windows-jdk10] [INFO] ------------------------------------------------------------------------
[windows-jdk10] [INFO] Total time: 27.858 s
[windows-jdk10] [INFO] Finished at: 2018-07-13T13:19:10Z
[windows-jdk10] [INFO] Final Memory: 38M/134M
[windows-jdk10] [INFO] ------------------------------------------------------------------------
[windows-jdk10] [INFO] [jenkins-event-spy] Generated F:\jenkins\jenkins-slave\workspace\aven-verifier-plugin_master-HSCDHQJXT5RJNUUH6OIYTY636JPRROEDKOBLHF3ONXUPSAU6TFYQ@tmp\withMaven95c9081e\maven-spy-20180713-131841-83712508363353552332631.log
[Pipeline] [windows-jdk10] }
[Pipeline] [windows-jdk10] // dir
[Pipeline] [windows-jdk10] }
[windows-jdk10] [withMaven] invokerPublisher - Archive invoker results for Maven artifact
MavenArtifact{org.apache.maven.plugins:maven-verifier-plugin::3.0.0-SNAPSHOT(version: 3.0.0-SNAPSHOT,
snapshot:false) } generated by PluginInvocation{org.apache.maven.plugins:maven-invoker-plugin:3.0.1@integration-test
 integration-test}: m\target\invoker-reports\*.xml
[windows-jdk10] performing MavenInvokerRecorder, reportsFilenamePattern:'**/m\target\invoker-reports/BUILD*.xml',
invokerBuildDir:'**/m\target\it'
[windows-jdk10] Found reports:[f:\jenkins\jenkins-slave\workspace\aven-verifier-plugin_master-HSCDHQJXT5RJNUUH6OIYTY636JPRROEDKOBLHF3ONXUPSAU6TFYQ\m\target\invoker-reports\BUILD-default.xml,
f:\jenkins\jenkins-slave\workspace\aven-verifier-plugin_master-HSCDHQJXT5RJNUUH6OIYTY636JPRROEDKOBLHF3ONXUPSAU6TFYQ\m\target\invoker-reports\BUILD-simple.xml]
[windows-jdk10] Found logs:[f:\jenkins\jenkins-slave\workspace\aven-verifier-plugin_master-HSCDHQJXT5RJNUUH6OIYTY636JPRROEDKOBLHF3ONXUPSAU6TFYQ\m\target\it\default\build.log,
f:\jenkins\jenkins-slave\workspace\aven-verifier-plugin_master-HSCDHQJXT5RJNUUH6OIYTY636JPRROEDKOBLHF3ONXUPSAU6TFYQ\m\target\it\simple\build.log]
[windows-jdk10] Finished parsing Maven Invoker results (found 2)
[windows-jdk10] [withMaven] junitPublisher - Archive test results for Maven artifact org.apache.maven.plugins:maven-verifier-plugin:3.0.0-SNAPSHOT
generated by maven-surefire-plugin:test (default-test): m\target\surefire-reports\*.xml
[windows-jdk10] Recording test results
[Pipeline] [windows-jdk10] // withMaven
[Pipeline] [windows-jdk10] }
[Pipeline] [windows-jdk10] // stage
[Pipeline] [windows-jdk10] }
[Pipeline] [windows-jdk10] // node
[Pipeline] [windows-jdk10] }
[linux-jdk7] Running on H24 in /home/jenkins/jenkins-slave/workspace/aven-verifier-plugin_master-HSCDHQJXT5RJNUUH6OIYTY636JPRROEDKOBLHF3ONXUPSAU6TFYQ
[Pipeline] [linux-jdk7] {
[Pipeline] [linux-jdk7] stage
[Pipeline] [linux-jdk7] { (Checkout linux-jdk7)
[Pipeline] [linux-jdk7] dir
[linux-jdk7] Running in /home/jenkins/jenkins-slave/workspace/aven-verifier-plugin_master-HSCDHQJXT5RJNUUH6OIYTY636JPRROEDKOBLHF3ONXUPSAU6TFYQ/m
[Pipeline] [linux-jdk7] {
[Pipeline] [linux-jdk7] checkout
[Pipeline] [linux-jdk7] }
[Pipeline] [linux-jdk7] // dir
[Pipeline] [linux-jdk7] echo
[linux-jdk7] [FAIL FAST] This is the first failure and likely root cause
[Pipeline] [linux-jdk7] }
[Pipeline] [linux-jdk7] // stage
[Pipeline] [linux-jdk7] }
[linux-jdk8] Running on H24 in /home/jenkins/jenkins-slave/workspace/aven-verifier-plugin_master-HSCDHQJXT5RJNUUH6OIYTY636JPRROEDKOBLHF3ONXUPSAU6TFYQ
[Pipeline] [linux-jdk7] // node
[Pipeline] [linux-jdk8] {
[Pipeline] [linux-jdk7] }
[linux-jdk7] Failed in branch linux-jdk7
[Pipeline] [linux-jdk8] stage
[Pipeline] [linux-jdk8] { (Checkout linux-jdk8)
[Pipeline] [linux-jdk8] }
[Pipeline] [linux-jdk9] // node
[Pipeline] [linux-jdk10] // node
[Pipeline] [linux-jdk8] // stage
[Pipeline] [linux-jdk9] }
[linux-jdk9] Failed in branch linux-jdk9
[Pipeline] [linux-jdk10] }
[linux-jdk10] Failed in branch linux-jdk10
[Pipeline] [linux-jdk8] }
[Pipeline] [linux-jdk8] // node
[Pipeline] [linux-jdk8] }
[linux-jdk8] Failed in branch linux-jdk8
[Pipeline] // parallel
[Pipeline] echo
***** FAST FAILURE *****

Fast failure triggered by linux-jdk7

***** FAST FAILURE *****
[Pipeline] stage
[Pipeline] { (Notifications)
[Pipeline] echo
Build result: FAILURE
[Pipeline] jiraIssueSelector
Mime
  • Unnamed multipart/mixed (inline, None, 0 bytes)
View raw message