maven-notifications mailing list archives

Site index · List index
Message view « Date » · « Thread »
Top « Date » · « Thread »
From Apache Jenkins Server <jenk...@builds.apache.org>
Subject Build unstable in Jenkins: Maven TLP » maven-checkstyle-plugin » master #25
Date Sat, 21 Jul 2018 09:11:30 GMT
See https://builds.apache.org/job/maven-box/job/maven-checkstyle-plugin/job/master/25/

Changes:

* Fixed link to mailing list.
* Fixed link to mailing list.
* Fixed link to mailing list.
* Fixed link to mailing list.
* Fixed link to mailing list.
* Fixed link to mailing list.
* Fixed link to mailing list.
* Fixed link to mailing list.

All tests passed

Build log:
[...truncated 3.71 MB...]
[windows-jdk8]        |        [DEBUG]    commons-collections:commons-collections:jar:3.2.1:compile
[windows-jdk8]        |        [DEBUG] Created new class realm plugin>org.apache.maven.plugins:maven-checkstyle-plugin:3.0.1-SNAPSHOT
[windows-jdk8]        |        [DEBUG] Importing foreign packages into class realm plugin>org.apache.maven.plugins:maven-checkstyle-plugin:3.0.1-SNAPSHOT
[windows-jdk8]        |        [DEBUG]   Imported:  < maven.api
[windows-jdk8]        |        [DEBUG] Populating class realm plugin>org.apache.maven.plugins:maven-checkstyle-plugin:3.0.1-SNAPSHOT
[windows-jdk8]        |        [DEBUG]   Included: org.apache.maven.plugins:maven-checkstyle-plugin:jar:3.0.1-SNAPSHOT
[windows-jdk8]        |        [DEBUG]   Included: org.apache.maven:maven-aether-provider:jar:3.0
[windows-jdk8]        |        [DEBUG]   Included: org.sonatype.aether:aether-util:jar:1.7
[windows-jdk8]        |        [DEBUG]   Included: org.sonatype.sisu:sisu-inject-bean:jar:1.4.2
[windows-jdk8]        |        [DEBUG]   Included: org.sonatype.sisu:sisu-guice:jar:noaop:2.1.7
[windows-jdk8]        |        [DEBUG]   Included: org.sonatype.plexus:plexus-sec-dispatcher:jar:1.3
[windows-jdk8]        |        [DEBUG]   Included: org.sonatype.plexus:plexus-cipher:jar:1.4
[windows-jdk8]        |        [DEBUG]   Included: org.apache.maven.reporting:maven-reporting-api:jar:3.0
[windows-jdk8]        |        [DEBUG]   Included: org.apache.maven.reporting:maven-reporting-impl:jar:2.3
[windows-jdk8]        |        [DEBUG]   Included: org.apache.maven.shared:maven-shared-utils:jar:0.6
[windows-jdk8]        |        [DEBUG]   Included: com.google.code.findbugs:jsr305:jar:2.0.1
[windows-jdk8]        |        [DEBUG]   Included: org.apache.maven.doxia:doxia-core:jar:1.2
[windows-jdk8]        |        [DEBUG]   Included: xerces:xercesImpl:jar:2.9.1
[windows-jdk8]        |        [DEBUG]   Included: xml-apis:xml-apis:jar:1.3.04
[windows-jdk8]        |        [DEBUG]   Included: org.apache.httpcomponents:httpclient:jar:4.0.2
[windows-jdk8]        |        [DEBUG]   Included: org.apache.httpcomponents:httpcore:jar:4.0.1
[windows-jdk8]        |        [DEBUG]   Included: commons-codec:commons-codec:jar:1.3
[windows-jdk8]        |        [DEBUG]   Included: commons-validator:commons-validator:jar:1.3.1
[windows-jdk8]        |        [DEBUG]   Included: commons-digester:commons-digester:jar:1.6
[windows-jdk8]        |        [DEBUG]   Included: commons-logging:commons-logging:jar:1.0.4
[windows-jdk8]        |        [DEBUG]   Included: org.apache.maven.doxia:doxia-sink-api:jar:1.4
[windows-jdk8]        |        [DEBUG]   Included: org.apache.maven.doxia:doxia-logging-api:jar:1.4
[windows-jdk8]        |        [DEBUG]   Included: org.apache.maven.doxia:doxia-decoration-model:jar:1.4
[windows-jdk8]        |        [DEBUG]   Included: org.apache.maven.doxia:doxia-site-renderer:jar:1.4
[windows-jdk8]        |        [DEBUG]   Included: org.apache.maven.doxia:doxia-module-xhtml:jar:1.4
[windows-jdk8]        |        [DEBUG]   Included: org.apache.maven.doxia:doxia-module-fml:jar:1.4
[windows-jdk8]        |        [DEBUG]   Included: org.codehaus.plexus:plexus-i18n:jar:1.0-beta-7
[windows-jdk8]        |        [DEBUG]   Included: org.apache.velocity:velocity-tools:jar:2.0
[windows-jdk8]        |        [DEBUG]   Included: commons-chain:commons-chain:jar:1.1
[windows-jdk8]        |        [DEBUG]   Included: dom4j:dom4j:jar:1.1
[windows-jdk8]        |        [DEBUG]   Included: sslext:sslext:jar:1.2-0
[windows-jdk8]        |        [DEBUG]   Included: org.apache.struts:struts-core:jar:1.3.8
[windows-jdk8]        |        [DEBUG]   Included: org.apache.struts:struts-taglib:jar:1.3.8
[windows-jdk8]        |        [DEBUG]   Included: org.apache.struts:struts-tiles:jar:1.3.8
[windows-jdk8]        |        [DEBUG]   Included: org.apache.maven.doxia:doxia-integration-tools:jar:1.6
[windows-jdk8]        |        [DEBUG]   Included: commons-io:commons-io:jar:1.4
[windows-jdk8]        |        [DEBUG]   Included: junit:junit:jar:3.8.1
[windows-jdk8]        |        [DEBUG]   Included: org.codehaus.plexus:plexus-component-annotations:jar:1.7.1
[windows-jdk8]        |        [DEBUG]   Included: org.codehaus.plexus:plexus-resources:jar:1.1.0
[windows-jdk8]        |        [DEBUG]   Included: org.codehaus.plexus:plexus-utils:jar:3.0.24
[windows-jdk8]        |        [DEBUG]   Included: org.codehaus.plexus:plexus-interpolation:jar:1.24
[windows-jdk8]        |        [DEBUG]   Included: org.codehaus.plexus:plexus-velocity:jar:1.1.8
[windows-jdk8]        |        [DEBUG]   Included: com.puppycrawl.tools:checkstyle:jar:6.18
[windows-jdk8]        |        [DEBUG]   Included: antlr:antlr:jar:2.7.7
[windows-jdk8]        |        [DEBUG]   Included: org.antlr:antlr4-runtime:jar:4.5.3
[windows-jdk8]        |        [DEBUG]   Included: commons-beanutils:commons-beanutils:jar:1.9.2
[windows-jdk8]        |        [DEBUG]   Included: commons-cli:commons-cli:jar:1.3.1
[windows-jdk8]        |        [DEBUG]   Included: com.google.guava:guava:jar:19.0
[windows-jdk8]        |        [DEBUG]   Included: org.apache.velocity:velocity:jar:1.5
[windows-jdk8]        |        [DEBUG]   Included: commons-lang:commons-lang:jar:2.1
[windows-jdk8]        |        [DEBUG]   Included: oro:oro:jar:2.0.8
[windows-jdk8]        |        [DEBUG]   Included: commons-collections:commons-collections:jar:3.2.1
[windows-jdk8]        |        [DEBUG] Configuring mojo org.apache.maven.plugins:maven-checkstyle-plugin:3.0.1-SNAPSHOT:check from plugin realm ClassRealm[plugin>org.apache.maven.plugins:maven-checkstyle-plugin:3.0.1-SNAPSHOT, parent: sun.misc.Launcher$AppClassLoader@33909752]
[windows-jdk8]        |        [DEBUG] Configuring mojo 'org.apache.maven.plugins:maven-checkstyle-plugin:3.0.1-SNAPSHOT:check' with basic configurator -->
[windows-jdk8]        |        [DEBUG]   (f) cacheFile = F:\jenkins\jenkins-slave\workspace\en-checkstyle-plugin_master-6DNBLC4MMIUMS5G3LAT6DLZEJTJFDWHANNB7EQVCGNVHOCTJQXVA\m\target\it\MCHECKSTYLE-337\target/checkstyle-cachefile
[windows-jdk8]        |        [DEBUG]   (f) configLocation = sun_checks.xml
[windows-jdk8]        |        [DEBUG]   (f) consoleOutput = false
[windows-jdk8]        |        [DEBUG]   (f) encoding = UTF-8
[windows-jdk8]        |        [DEBUG]   (f) failOnViolation = true
[windows-jdk8]        |        [DEBUG]   (f) failsOnError = false
[windows-jdk8]        |        [DEBUG]   (f) headerLocation = LICENSE.txt
[windows-jdk8]        |        [DEBUG]   (f) includeResources = true
[windows-jdk8]        |        [DEBUG]   (f) includeTestResources = true
[windows-jdk8]        |        [DEBUG]   (f) includeTestSourceDirectory = false
[windows-jdk8]        |        [DEBUG]   (f) includes = **\/*.java
[windows-jdk8]        |        [DEBUG]   (f) logViolationsToConsole = true
[windows-jdk8]        |        [DEBUG]   (f) maxAllowedViolations = 0
[windows-jdk8]        |        [DEBUG]   (f) omitIgnoredModules = false
[windows-jdk8]        |        [DEBUG]   (f) outputFile = F:\jenkins\jenkins-slave\workspace\en-checkstyle-plugin_master-6DNBLC4MMIUMS5G3LAT6DLZEJTJFDWHANNB7EQVCGNVHOCTJQXVA\m\target\it\MCHECKSTYLE-337\target\checkstyle-result.txt
[windows-jdk8]        |        [DEBUG]   (f) outputFileFormat = plain
[windows-jdk8]        |        [DEBUG]   (f) plugin = Component Descriptor: role: 'org.apache.maven.plugin.Mojo', implementation: 'org.apache.maven.plugins.checkstyle.CheckstyleViolationCheckMojo', role hint: 'org.apache.maven.plugins:maven-checkstyle-plugin:3.0.1-SNAPSHOT:check'
[windows-jdk8]        |        role: 'org.apache.maven.plugin.Mojo', implementation: 'org.apache.maven.plugins.checkstyle.CheckstyleReport', role hint: 'org.apache.maven.plugins:maven-checkstyle-plugin:3.0.1-SNAPSHOT:checkstyle'
[windows-jdk8]        |        role: 'org.apache.maven.plugin.Mojo', implementation: 'org.apache.maven.plugins.checkstyle.CheckstyleAggregateReport', role hint: 'org.apache.maven.plugins:maven-checkstyle-plugin:3.0.1-SNAPSHOT:checkstyle-aggregate'
[windows-jdk8]        |        role: 'org.apache.maven.plugin.Mojo', implementation: 'org.apache.maven.plugins.checkstyle.HelpMojo', role hint: 'org.apache.maven.plugins:maven-checkstyle-plugin:3.0.1-SNAPSHOT:help'
[windows-jdk8]        |        ---
[windows-jdk8]        |        [DEBUG]   (f) project = MavenProject: org.apache.maven.plugins.checkstyle:MCHECKSTYLE-337:1.0-SNAPSHOT @ F:\jenkins\jenkins-slave\workspace\en-checkstyle-plugin_master-6DNBLC4MMIUMS5G3LAT6DLZEJTJFDWHANNB7EQVCGNVHOCTJQXVA\m\target\it\MCHECKSTYLE-337\pom.xml
[windows-jdk8]        |        [DEBUG]   (f) resourceIncludes = **/*.properties
[windows-jdk8]        |        [DEBUG]   (f) resources = [Resource {targetPath: null, filtering: false, FileSet {directory: F:\jenkins\jenkins-slave\workspace\en-checkstyle-plugin_master-6DNBLC4MMIUMS5G3LAT6DLZEJTJFDWHANNB7EQVCGNVHOCTJQXVA\m\target\it\MCHECKSTYLE-337\src\main\resources, PatternSet [includes: {}, excludes: {}]}}]
[windows-jdk8]        |        [DEBUG]   (f) rulesFiles = F:\jenkins\jenkins-slave\workspace\en-checkstyle-plugin_master-6DNBLC4MMIUMS5G3LAT6DLZEJTJFDWHANNB7EQVCGNVHOCTJQXVA\m\target\it\MCHECKSTYLE-337\target\checkstyle-rules.xml
[windows-jdk8]        |        [DEBUG]   (f) skip = false
[windows-jdk8]        |        [DEBUG]   (f) skipExec = false
[windows-jdk8]        |        [DEBUG]   (f) suppressionsFileExpression = checkstyle.suppressions.file
[windows-jdk8]        |        [DEBUG]   (f) testResources = [Resource {targetPath: null, filtering: false, FileSet {directory: F:\jenkins\jenkins-slave\workspace\en-checkstyle-plugin_master-6DNBLC4MMIUMS5G3LAT6DLZEJTJFDWHANNB7EQVCGNVHOCTJQXVA\m\target\it\MCHECKSTYLE-337\src\test\resources, PatternSet [includes: {}, excludes: {}]}}]
[windows-jdk8]        |        [DEBUG]   (f) violationIgnore = NewlineAtEndOfFile
[windows-jdk8]        |        [DEBUG]   (f) violationSeverity = error
[windows-jdk8]        |        [DEBUG] -- end configuration --
[windows-jdk8]        |        [DEBUG] executeCheckstyle start headerLocation : LICENSE.txt
[windows-jdk8]        |        [DEBUG] Added 2 source files found in 'F:\jenkins\jenkins-slave\workspace\en-checkstyle-plugin_master-6DNBLC4MMIUMS5G3LAT6DLZEJTJFDWHANNB7EQVCGNVHOCTJQXVA\m\target\it\MCHECKSTYLE-337\src\main\java'.
[windows-jdk8]        |        [DEBUG] The resources directory 'F:\jenkins\jenkins-slave\workspace\en-checkstyle-plugin_master-6DNBLC4MMIUMS5G3LAT6DLZEJTJFDWHANNB7EQVCGNVHOCTJQXVA\m\target\it\MCHECKSTYLE-337\src\main\resources' does not exist or is not a directory.
[windows-jdk8]        |        [DEBUG] The resources directory 'F:\jenkins\jenkins-slave\workspace\en-checkstyle-plugin_master-6DNBLC4MMIUMS5G3LAT6DLZEJTJFDWHANNB7EQVCGNVHOCTJQXVA\m\target\it\MCHECKSTYLE-337\src\test\resources' does not exist or is not a directory.
[windows-jdk8]        |        [DEBUG] Added 2 files to process.
[windows-jdk8]        |        [DEBUG] Adding the outputDirectory file:/F:/jenkins/jenkins-slave/workspace/en-checkstyle-plugin_master-6DNBLC4MMIUMS5G3LAT6DLZEJTJFDWHANNB7EQVCGNVHOCTJQXVA/m/target/it/MCHECKSTYLE-337/target/classes/ to the Checkstyle class path
[windows-jdk8]        |        [DEBUG] request.getConfigLocation() sun_checks.xml
[windows-jdk8]        |        [DEBUG] The resource 'sun_checks.xml' was not found with resourceLoader org.codehaus.plexus.resource.loader.FileResourceLoader.
[windows-jdk8]        |        [DEBUG] URLResourceLoader: No valid URL 'sun_checks.xml'
[windows-jdk8]        |        [DEBUG] URLResourceLoader: No valid URL 'sun_checks.xml'
[windows-jdk8]        |        [DEBUG] The resource 'sun_checks.xml' was not found with resourceLoader org.codehaus.plexus.resource.loader.URLResourceLoader.
[windows-jdk8]        |        [DEBUG] The resource 'sun_checks.xml' was found as jar:file:/F:/jenkins/jenkins-slave/workspace/en-checkstyle-plugin_master-6DNBLC4MMIUMS5G3LAT6DLZEJTJFDWHANNB7EQVCGNVHOCTJQXVA/m/target/local-repo/com/puppycrawl/tools/checkstyle/6.18/checkstyle-6.18.jar!/sun_checks.xml.
[windows-jdk8]        |        [DEBUG] headerLocation LICENSE.txt
[windows-jdk8]        |        [DEBUG] The resource 'LICENSE.txt' was not found with resourceLoader org.codehaus.plexus.resource.loader.FileResourceLoader.
[windows-jdk8]        |        [DEBUG] URLResourceLoader: No valid URL 'LICENSE.txt'
[windows-jdk8]        |        [DEBUG] URLResourceLoader: No valid URL 'LICENSE.txt'
[windows-jdk8]        |        [DEBUG] The resource 'LICENSE.txt' was not found with resourceLoader org.codehaus.plexus.resource.loader.URLResourceLoader.
[windows-jdk8]        |        [DEBUG] The resource 'LICENSE.txt' was not found with resourceLoader org.codehaus.plexus.resource.loader.JarResourceLoader.
[windows-jdk8]        |        [DEBUG] Unable to process header location: LICENSE.txt
[windows-jdk8]        |        [DEBUG] Checkstyle will throw exception if ${checkstyle.header.file} is used
[windows-jdk8]        |        [INFO] There is 1 error reported by Checkstyle 6.18 with sun_checks.xml ruleset.
[windows-jdk8]        |        [INFO] ------------------------------------------------------------------------
[windows-jdk8]        |        [INFO] BUILD FAILURE
[windows-jdk8]        |        [INFO] ------------------------------------------------------------------------
[windows-jdk8]        |        [INFO] Total time: 6.357 s
[windows-jdk8]        |        [INFO] Finished at: 2018-07-21T09:10:21Z
[windows-jdk8]        |        [INFO] Final Memory: 22M/254M
[windows-jdk8]        |        [INFO] ------------------------------------------------------------------------
[windows-jdk8]        |        [ERROR] Failed to execute goal org.apache.maven.plugins:maven-checkstyle-plugin:3.0.1-SNAPSHOT:check (check) on project MCHECKSTYLE-337: Unable to read Checkstyle results xml: C:\Users\jenkins\AppData\Local\Temp\1\checkstyle-result4284207209166334852.xml: input contained no data -> [Help 1]
[windows-jdk8]        |        org.apache.maven.lifecycle.LifecycleExecutionException: Failed to execute goal org.apache.maven.plugins:maven-checkstyle-plugin:3.0.1-SNAPSHOT:check (check) on project MCHECKSTYLE-337: Unable to read Checkstyle results xml: C:\Users\jenkins\AppData\Local\Temp\1\checkstyle-result4284207209166334852.xml
[windows-jdk8]        |        	at org.apache.maven.lifecycle.internal.MojoExecutor.execute(MojoExecutor.java:213)
[windows-jdk8]        |        	at org.apache.maven.lifecycle.internal.MojoExecutor.execute(MojoExecutor.java:154)
[windows-jdk8]        |        	at org.apache.maven.lifecycle.internal.MojoExecutor.execute(MojoExecutor.java:146)
[windows-jdk8]        |        	at org.apache.maven.lifecycle.internal.LifecycleModuleBuilder.buildProject(LifecycleModuleBuilder.java:117)
[windows-jdk8]        |        	at org.apache.maven.lifecycle.internal.LifecycleModuleBuilder.buildProject(LifecycleModuleBuilder.java:81)
[windows-jdk8]        |        	at org.apache.maven.lifecycle.internal.builder.singlethreaded.SingleThreadedBuilder.build(SingleThreadedBuilder.java:51)
[windows-jdk8]        |        	at org.apache.maven.lifecycle.internal.LifecycleStarter.execute(LifecycleStarter.java:128)
[windows-jdk8]        |        	at org.apache.maven.DefaultMaven.doExecute(DefaultMaven.java:309)
[windows-jdk8]        |        	at org.apache.maven.DefaultMaven.doExecute(DefaultMaven.java:194)
[windows-jdk8]        |        	at org.apache.maven.DefaultMaven.execute(DefaultMaven.java:107)
[windows-jdk8]        |        	at org.apache.maven.cli.MavenCli.execute(MavenCli.java:993)
[windows-jdk8]        |        	at org.apache.maven.cli.MavenCli.doMain(MavenCli.java:345)
[windows-jdk8]        |        	at org.apache.maven.cli.MavenCli.main(MavenCli.java:191)
[windows-jdk8]        |        	at sun.reflect.NativeMethodAccessorImpl.invoke0(Native Method)
[windows-jdk8]        |        	at sun.reflect.NativeMethodAccessorImpl.invoke(NativeMethodAccessorImpl.java:62)
[windows-jdk8]        |        	at sun.reflect.DelegatingMethodAccessorImpl.invoke(DelegatingMethodAccessorImpl.java:43)
[windows-jdk8]        |        	at java.lang.reflect.Method.invoke(Method.java:498)
[windows-jdk8]        |        	at org.codehaus.plexus.classworlds.launcher.Launcher.launchEnhanced(Launcher.java:289)
[windows-jdk8]        |        	at org.codehaus.plexus.classworlds.launcher.Launcher.launch(Launcher.java:229)
[windows-jdk8]        |        	at org.codehaus.plexus.classworlds.launcher.Launcher.mainWithExitCode(Launcher.java:415)
[windows-jdk8]        |        	at org.codehaus.plexus.classworlds.launcher.Launcher.main(Launcher.java:356)
[windows-jdk8]        |        Caused by: org.apache.maven.plugin.MojoExecutionException: Unable to read Checkstyle results xml: C:\Users\jenkins\AppData\Local\Temp\1\checkstyle-result4284207209166334852.xml
[windows-jdk8]        |        	at org.apache.maven.plugins.checkstyle.CheckstyleViolationCheckMojo.execute(CheckstyleViolationCheckMojo.java:586)
[windows-jdk8]        |        	at org.apache.maven.plugin.DefaultBuildPluginManager.executeMojo(DefaultBuildPluginManager.java:134)
[windows-jdk8]        |        	at org.apache.maven.lifecycle.internal.MojoExecutor.execute(MojoExecutor.java:208)
[windows-jdk8]        |        	... 20 more
[windows-jdk8]        |        Caused by: java.io.EOFException: input contained no data
[windows-jdk8]        |        	at org.codehaus.plexus.util.xml.pull.MXParser.fillBuf(MXParser.java:3037)
[windows-jdk8]        |        	at org.codehaus.plexus.util.xml.pull.MXParser.more(MXParser.java:3080)
[windows-jdk8]        |        	at org.codehaus.plexus.util.xml.pull.MXParser.parseProlog(MXParser.java:1451)
[windows-jdk8]        |        	at org.codehaus.plexus.util.xml.pull.MXParser.nextImpl(MXParser.java:1436)
[windows-jdk8]        |        	at org.codehaus.plexus.util.xml.pull.MXParser.next(MXParser.java:1131)
[windows-jdk8]        |        	at org.apache.maven.plugins.checkstyle.CheckstyleViolationCheckMojo.countViolations(CheckstyleViolationCheckMojo.java:611)
[windows-jdk8]        |        	at org.apache.maven.plugins.checkstyle.CheckstyleViolationCheckMojo.execute(CheckstyleViolationCheckMojo.java:565)
[windows-jdk8]        |        	... 22 more
[windows-jdk8]        |        [ERROR] 
[windows-jdk8]        |        [ERROR] 
[windows-jdk8]        |        [ERROR] For more information about the errors and possible solutions, please read the following articles:
[windows-jdk8]        |        [ERROR] [Help 1] http://cwiki.apache.org/confluence/display/MAVEN/MojoExecutionException
[windows-jdk8]        |        Picked up JAVA_TOOL_OPTIONS: -Dmaven.ext.class.path="f:\jenkins\jenkins-slave\workspace\en-checkstyle-plugin_master-6DNBLC4MMIUMS5G3LAT6DLZEJTJFDWHANNB7EQVCGNVHOCTJQXVA@tmp\withMavenba6ff2d5\pipeline-maven-spy.jar" -Dorg.jenkinsci.plugins.pipeline.maven.reportsFolder="f:\jenkins\jenkins-slave\workspace\en-checkstyle-plugin_master-6DNBLC4MMIUMS5G3LAT6DLZEJTJFDWHANNB7EQVCGNVHOCTJQXVA@tmp\withMavenba6ff2d5" 
[windows-jdk8]        |        Running post-build script: f:\jenkins\jenkins-slave\workspace\en-checkstyle-plugin_master-6DNBLC4MMIUMS5G3LAT6DLZEJTJFDWHANNB7EQVCGNVHOCTJQXVA\m\target\it\MCHECKSTYLE-337\verify.groovy
[windows-jdk8]        f:\jenkins\jenkins-slave\workspace\en-checkstyle-plugin_master-6DNBLC4MMIUMS5G3LAT6DLZEJTJFDWHANNB7EQVCGNVHOCTJQXVA\m\target\it\MCHECKSTYLE-337\build.log
[windows-jdk8] [INFO] Building: MCHECKSTYLE-338\pom.xml
[Pipeline] [windows-jdk9] }
[windows-jdk9] [withMaven] invokerPublisher - Archive invoker results for Maven artifact MavenArtifact{org.apache.maven.plugins:maven-checkstyle-plugin::3.0.1-SNAPSHOT(version: 3.0.1-SNAPSHOT, snapshot:false) } generated by PluginInvocation{org.apache.maven.plugins:maven-invoker-plugin:3.0.1@integration-test  integration-test}: m\target\invoker-reports\*.xml
[windows-jdk9] performing MavenInvokerRecorder, reportsFilenamePattern:'**/m\target\invoker-reports/BUILD*.xml', invokerBuildDir:'**/m\target\it'
[windows-jdk9] Found reports:[f:\jenkins\jenkins-slave\workspace\en-checkstyle-plugin_master-6DNBLC4MMIUMS5G3LAT6DLZEJTJFDWHANNB7EQVCGNVHOCTJQXVA@2\m\target\invoker-reports\BUILD-MCHECKSTYLE-129.xml, f:\jenkins\jenkins-slave\workspace\en-checkstyle-plugin_master-6DNBLC4MMIUMS5G3LAT6DLZEJTJFDWHANNB7EQVCGNVHOCTJQXVA@2\m\target\invoker-reports\BUILD-MCHECKSTYLE-131.xml, f:\jenkins\jenkins-slave\workspace\en-checkstyle-plugin_master-6DNBLC4MMIUMS5G3LAT6DLZEJTJFDWHANNB7EQVCGNVHOCTJQXVA@2\m\target\invoker-reports\BUILD-MCHECKSTYLE-137.xml, f:\jenkins\jenkins-slave\workspace\en-checkstyle-plugin_master-6DNBLC4MMIUMS5G3LAT6DLZEJTJFDWHANNB7EQVCGNVHOCTJQXVA@2\m\target\invoker-reports\BUILD-MCHECKSTYLE-169.xml, f:\jenkins\jenkins-slave\workspace\en-checkstyle-plugin_master-6DNBLC4MMIUMS5G3LAT6DLZEJTJFDWHANNB7EQVCGNVHOCTJQXVA@2\m\target\invoker-reports\BUILD-MCHECKSTYLE-172.xml, f:\jenkins\jenkins-slave\workspace\en-checkstyle-plugin_master-6DNBLC4MMIUMS5G3LAT6DLZEJTJFDWHANNB7EQVCGNVHOCTJQXVA@2\m\target\invoker-reports\BUILD-MCHECKSTYLE-173-with-charset.xml, f:\jenkins\jenkins-slave\workspace\en-checkstyle-plugin_master-6DNBLC4MMIUMS5G3LAT6DLZEJTJFDWHANNB7EQVCGNVHOCTJQXVA@2\m\target\invoker-reports\BUILD-MCHECKSTYLE-173-without-charset.xml, f:\jenkins\jenkins-slave\workspace\en-checkstyle-plugin_master-6DNBLC4MMIUMS5G3LAT6DLZEJTJFDWHANNB7EQVCGNVHOCTJQXVA@2\m\target\invoker-reports\BUILD-MCHECKSTYLE-193.xml, f:\jenkins\jenkins-slave\workspace\en-checkstyle-plugin_master-6DNBLC4MMIUMS5G3LAT6DLZEJTJFDWHANNB7EQVCGNVHOCTJQXVA@2\m\target\invoker-reports\BUILD-MCHECKSTYLE-214-basedir-resource.xml, f:\jenkins\jenkins-slave\workspace\en-checkstyle-plugin_master-6DNBLC4MMIUMS5G3LAT6DLZEJTJFDWHANNB7EQVCGNVHOCTJQXVA@2\m\target\invoker-reports\BUILD-MCHECKSTYLE-219-no-license_failure.xml, f:\jenkins\jenkins-slave\workspace\en-checkstyle-plugin_master-6DNBLC4MMIUMS5G3LAT6DLZEJTJFDWHANNB7EQVCGNVHOCTJQXVA@2\m\target\invoker-reports\BUILD-MCHECKSTYLE-219-no-license_success.xml, f:\jenkins\jenkins-slave\workspace\en-checkstyle-plugin_master-6DNBLC4MMIUMS5G3LAT6DLZEJTJFDWHANNB7EQVCGNVHOCTJQXVA@2\m\target\invoker-reports\BUILD-MCHECKSTYLE-220.xml, f:\jenkins\jenkins-slave\workspace\en-checkstyle-plugin_master-6DNBLC4MMIUMS5G3LAT6DLZEJTJFDWHANNB7EQVCGNVHOCTJQXVA@2\m\target\invoker-reports\BUILD-MCHECKSTYLE-222-no-resources.xml, f:\jenkins\jenkins-slave\workspace\en-checkstyle-plugin_master-6DNBLC4MMIUMS5G3LAT6DLZEJTJFDWHANNB7EQVCGNVHOCTJQXVA@2\m\target\invoker-reports\BUILD-MCHECKSTYLE-222-resources.xml, f:\jenkins\jenkins-slave\workspace\en-checkstyle-plugin_master-6DNBLC4MMIUMS5G3LAT6DLZEJTJFDWHANNB7EQVCGNVHOCTJQXVA@2\m\target\invoker-reports\BUILD-MCHECKSTYLE-222-testResources.xml, f:\jenkins\jenkins-slave\workspace\en-checkstyle-plugin_master-6DNBLC4MMIUMS5G3LAT6DLZEJTJFDWHANNB7EQVCGNVHOCTJQXVA@2\m\target\invoker-reports\BUILD-MCHECKSTYLE-224.xml, f:\jenkins\jenkins-slave\workspace\en-checkstyle-plugin_master-6DNBLC4MMIUMS5G3LAT6DLZEJTJFDWHANNB7EQVCGNVHOCTJQXVA@2\m\target\invoker-reports\BUILD-MCHECKSTYLE-225-LICENSE.txt.xml, f:\jenkins\jenkins-slave\workspace\en-checkstyle-plugin_master-6DNBLC4MMIUMS5G3LAT6DLZEJTJFDWHANNB7EQVCGNVHOCTJQXVA@2\m\target\invoker-reports\BUILD-MCHECKSTYLE-225-customHeader.xml, f:\jenkins\jenkins-slave\workspace\en-checkstyle-plugin_master-6DNBLC4MMIUMS5G3LAT6DLZEJTJFDWHANNB7EQVCGNVHOCTJQXVA@2\m\target\invoker-reports\BUILD-MCHECKSTYLE-225-pluginManagement.xml, f:\jenkins\jenkins-slave\workspace\en-checkstyle-plugin_master-6DNBLC4MMIUMS5G3LAT6DLZEJTJFDWHANNB7EQVCGNVHOCTJQXVA@2\m\target\invoker-reports\BUILD-MCHECKSTYLE-253-jdk8.xml, f:\jenkins\jenkins-slave\workspace\en-checkstyle-plugin_master-6DNBLC4MMIUMS5G3LAT6DLZEJTJFDWHANNB7EQVCGNVHOCTJQXVA@2\m\target\invoker-reports\BUILD-MCHECKSTYLE-260-sourceDirectories.xml, f:\jenkins\jenkins-slave\workspace\en-checkstyle-plugin_master-6DNBLC4MMIUMS5G3LAT6DLZEJTJFDWHANNB7EQVCGNVHOCTJQXVA@2\m\target\invoker-reports\BUILD-MCHECKSTYLE-260-testSourceDirectories.xml, f:\jenkins\jenkins-slave\workspace\en-checkstyle-plugin_master-6DNBLC4MMIUMS5G3LAT6DLZEJTJFDWHANNB7EQVCGNVHOCTJQXVA@2\m\target\invoker-reports\BUILD-MCHECKSTYLE-268.xml, f:\jenkins\jenkins-slave\workspace\en-checkstyle-plugin_master-6DNBLC4MMIUMS5G3LAT6DLZEJTJFDWHANNB7EQVCGNVHOCTJQXVA@2\m\target\invoker-reports\BUILD-MCHECKSTYLE-295.xml, f:\jenkins\jenkins-slave\workspace\en-checkstyle-plugin_master-6DNBLC4MMIUMS5G3LAT6DLZEJTJFDWHANNB7EQVCGNVHOCTJQXVA@2\m\target\invoker-reports\BUILD-MCHECKSTYLE-332_cache-checker.xml, f:\jenkins\jenkins-slave\workspace\en-checkstyle-plugin_master-6DNBLC4MMIUMS5G3LAT6DLZEJTJFDWHANNB7EQVCGNVHOCTJQXVA@2\m\target\invoker-reports\BUILD-MCHECKSTYLE-332_cache-treewalker.xml, f:\jenkins\jenkins-slave\workspace\en-checkstyle-plugin_master-6DNBLC4MMIUMS5G3LAT6DLZEJTJFDWHANNB7EQVCGNVHOCTJQXVA@2\m\target\invoker-reports\BUILD-MCHECKSTYLE-337.xml, f:\jenkins\jenkins-slave\workspace\en-checkstyle-plugin_master-6DNBLC4MMIUMS5G3LAT6DLZEJTJFDWHANNB7EQVCGNVHOCTJQXVA@2\m\target\invoker-reports\BUILD-MCHECKSTYLE-338.xml, f:\jenkins\jenkins-slave\workspace\en-checkstyle-plugin_master-6DNBLC4MMIUMS5G3LAT6DLZEJTJFDWHANNB7EQVCGNVHOCTJQXVA@2\m\target\invoker-reports\BUILD-MCHECKSTYLE-347.xml, f:\jenkins\jenkins-slave\workspace\en-checkstyle-plugin_master-6DNBLC4MMIUMS5G3LAT6DLZEJTJFDWHANNB7EQVCGNVHOCTJQXVA@2\m\target\invoker-reports\BUILD-MCHECKSTYLE-70-multi-sourcefolder.xml, f:\jenkins\jenkins-slave\workspace\en-checkstyle-plugin_master-6DNBLC4MMIUMS5G3LAT6DLZEJTJFDWHANNB7EQVCGNVHOCTJQXVA@2\m\target\invoker-reports\BUILD-check-fail.xml, f:\jenkins\jenkins-slave\workspace\en-checkstyle-plugin_master-6DNBLC4MMIUMS5G3LAT6DLZEJTJFDWHANNB7EQVCGNVHOCTJQXVA@2\m\target\invoker-reports\BUILD-check-pass.xml, f:\jenkins\jenkins-slave\workspace\en-checkstyle-plugin_master-6DNBLC4MMIUMS5G3LAT6DLZEJTJFDWHANNB7EQVCGNVHOCTJQXVA@2\m\target\invoker-reports\BUILD-check-tests-only.xml, f:\jenkins\jenkins-slave\workspace\en-checkstyle-plugin_master-6DNBLC4MMIUMS5G3LAT6DLZEJTJFDWHANNB7EQVCGNVHOCTJQXVA@2\m\target\invoker-reports\BUILD-checkstyle-goal.xml, f:\jenkins\jenkins-slave\workspace\en-checkstyle-plugin_master-6DNBLC4MMIUMS5G3LAT6DLZEJTJFDWHANNB7EQVCGNVHOCTJQXVA@2\m\target\invoker-reports\BUILD-checkstyle-report.xml, f:\jenkins\jenkins-slave\workspace\en-checkstyle-plugin_master-6DNBLC4MMIUMS5G3LAT6DLZEJTJFDWHANNB7EQVCGNVHOCTJQXVA@2\m\target\invoker-reports\BUILD-inlinerules.xml, f:\jenkins\jenkins-slave\workspace\en-checkstyle-plugin_master-6DNBLC4MMIUMS5G3LAT6DLZEJTJFDWHANNB7EQVCGNVHOCTJQXVA@2\m\target\invoker-reports\BUILD-minimal-pom.xml, f:\jenkins\jenkins-slave\workspace\en-checkstyle-plugin_master-6DNBLC4MMIUMS5G3LAT6DLZEJTJFDWHANNB7EQVCGNVHOCTJQXVA@2\m\target\invoker-reports\BUILD-multi-modules-aggregate.xml, f:\jenkins\jenkins-slave\workspace\en-checkstyle-plugin_master-6DNBLC4MMIUMS5G3LAT6DLZEJTJFDWHANNB7EQVCGNVHOCTJQXVA@2\m\target\invoker-reports\BUILD-multi-modules.xml, f:\jenkins\jenkins-slave\workspace\en-checkstyle-plugin_master-6DNBLC4MMIUMS5G3LAT6DLZEJTJFDWHANNB7EQVCGNVHOCTJQXVA@2\m\target\invoker-reports\BUILD-multimoduleproject.xml]
[windows-jdk9] Found logs:[f:\jenkins\jenkins-slave\workspace\en-checkstyle-plugin_master-6DNBLC4MMIUMS5G3LAT6DLZEJTJFDWHANNB7EQVCGNVHOCTJQXVA@2\m\target\it\MCHECKSTYLE-129\build.log, f:\jenkins\jenkins-slave\workspace\en-checkstyle-plugin_master-6DNBLC4MMIUMS5G3LAT6DLZEJTJFDWHANNB7EQVCGNVHOCTJQXVA@2\m\target\it\MCHECKSTYLE-131\build.log, f:\jenkins\jenkins-slave\workspace\en-checkstyle-plugin_master-6DNBLC4MMIUMS5G3LAT6DLZEJTJFDWHANNB7EQVCGNVHOCTJQXVA@2\m\target\it\MCHECKSTYLE-137\build.log, f:\jenkins\jenkins-slave\workspace\en-checkstyle-plugin_master-6DNBLC4MMIUMS5G3LAT6DLZEJTJFDWHANNB7EQVCGNVHOCTJQXVA@2\m\target\it\MCHECKSTYLE-169\build.log, f:\jenkins\jenkins-slave\workspace\en-checkstyle-plugin_master-6DNBLC4MMIUMS5G3LAT6DLZEJTJFDWHANNB7EQVCGNVHOCTJQXVA@2\m\target\it\MCHECKSTYLE-172\build.log, f:\jenkins\jenkins-slave\workspace\en-checkstyle-plugin_master-6DNBLC4MMIUMS5G3LAT6DLZEJTJFDWHANNB7EQVCGNVHOCTJQXVA@2\m\target\it\MCHECKSTYLE-173-with-charset\build.log, f:\jenkins\jenkins-slave\workspace\en-checkstyle-plugin_master-6DNBLC4MMIUMS5G3LAT6DLZEJTJFDWHANNB7EQVCGNVHOCTJQXVA@2\m\target\it\MCHECKSTYLE-173-without-charset\build.log, f:\jenkins\jenkins-slave\workspace\en-checkstyle-plugin_master-6DNBLC4MMIUMS5G3LAT6DLZEJTJFDWHANNB7EQVCGNVHOCTJQXVA@2\m\target\it\MCHECKSTYLE-193\build.log, f:\jenkins\jenkins-slave\workspace\en-checkstyle-plugin_master-6DNBLC4MMIUMS5G3LAT6DLZEJTJFDWHANNB7EQVCGNVHOCTJQXVA@2\m\target\it\MCHECKSTYLE-214-basedir-resource\build.log, f:\jenkins\jenkins-slave\workspace\en-checkstyle-plugin_master-6DNBLC4MMIUMS5G3LAT6DLZEJTJFDWHANNB7EQVCGNVHOCTJQXVA@2\m\target\it\MCHECKSTYLE-219-no-license_failure\build.log, f:\jenkins\jenkins-slave\workspace\en-checkstyle-plugin_master-6DNBLC4MMIUMS5G3LAT6DLZEJTJFDWHANNB7EQVCGNVHOCTJQXVA@2\m\target\it\MCHECKSTYLE-219-no-license_success\build.log, f:\jenkins\jenkins-slave\workspace\en-checkstyle-plugin_master-6DNBLC4MMIUMS5G3LAT6DLZEJTJFDWHANNB7EQVCGNVHOCTJQXVA@2\m\target\it\MCHECKSTYLE-220\build.log, f:\jenkins\jenkins-slave\workspace\en-checkstyle-plugin_master-6DNBLC4MMIUMS5G3LAT6DLZEJTJFDWHANNB7EQVCGNVHOCTJQXVA@2\m\target\it\MCHECKSTYLE-222-no-resources\build.log, f:\jenkins\jenkins-slave\workspace\en-checkstyle-plugin_master-6DNBLC4MMIUMS5G3LAT6DLZEJTJFDWHANNB7EQVCGNVHOCTJQXVA@2\m\target\it\MCHECKSTYLE-222-resources\build.log, f:\jenkins\jenkins-slave\workspace\en-checkstyle-plugin_master-6DNBLC4MMIUMS5G3LAT6DLZEJTJFDWHANNB7EQVCGNVHOCTJQXVA@2\m\target\it\MCHECKSTYLE-222-testResources\build.log, f:\jenkins\jenkins-slave\workspace\en-checkstyle-plugin_master-6DNBLC4MMIUMS5G3LAT6DLZEJTJFDWHANNB7EQVCGNVHOCTJQXVA@2\m\target\it\MCHECKSTYLE-224\build.log, f:\jenkins\jenkins-slave\workspace\en-checkstyle-plugin_master-6DNBLC4MMIUMS5G3LAT6DLZEJTJFDWHANNB7EQVCGNVHOCTJQXVA@2\m\target\it\MCHECKSTYLE-225-LICENSE.txt\build.log, f:\jenkins\jenkins-slave\workspace\en-checkstyle-plugin_master-6DNBLC4MMIUMS5G3LAT6DLZEJTJFDWHANNB7EQVCGNVHOCTJQXVA@2\m\target\it\MCHECKSTYLE-225-customHeader\build.log, f:\jenkins\jenkins-slave\workspace\en-checkstyle-plugin_master-6DNBLC4MMIUMS5G3LAT6DLZEJTJFDWHANNB7EQVCGNVHOCTJQXVA@2\m\target\it\MCHECKSTYLE-225-pluginManagement\build.log, f:\jenkins\jenkins-slave\workspace\en-checkstyle-plugin_master-6DNBLC4MMIUMS5G3LAT6DLZEJTJFDWHANNB7EQVCGNVHOCTJQXVA@2\m\target\it\MCHECKSTYLE-253-jdk8\build.log, f:\jenkins\jenkins-slave\workspace\en-checkstyle-plugin_master-6DNBLC4MMIUMS5G3LAT6DLZEJTJFDWHANNB7EQVCGNVHOCTJQXVA@2\m\target\it\MCHECKSTYLE-260-sourceDirectories\build.log, f:\jenkins\jenkins-slave\workspace\en-checkstyle-plugin_master-6DNBLC4MMIUMS5G3LAT6DLZEJTJFDWHANNB7EQVCGNVHOCTJQXVA@2\m\target\it\MCHECKSTYLE-260-testSourceDirectories\build.log, f:\jenkins\jenkins-slave\workspace\en-checkstyle-plugin_master-6DNBLC4MMIUMS5G3LAT6DLZEJTJFDWHANNB7EQVCGNVHOCTJQXVA@2\m\target\it\MCHECKSTYLE-268\build.log, f:\jenkins\jenkins-slave\workspace\en-checkstyle-plugin_master-6DNBLC4MMIUMS5G3LAT6DLZEJTJFDWHANNB7EQVCGNVHOCTJQXVA@2\m\target\it\MCHECKSTYLE-295\build.log, f:\jenkins\jenkins-slave\workspace\en-checkstyle-plugin_master-6DNBLC4MMIUMS5G3LAT6DLZEJTJFDWHANNB7EQVCGNVHOCTJQXVA@2\m\target\it\MCHECKSTYLE-332_cache-checker\build.log, f:\jenkins\jenkins-slave\workspace\en-checkstyle-plugin_master-6DNBLC4MMIUMS5G3LAT6DLZEJTJFDWHANNB7EQVCGNVHOCTJQXVA@2\m\target\it\MCHECKSTYLE-332_cache-treewalker\build.log, f:\jenkins\jenkins-slave\workspace\en-checkstyle-plugin_master-6DNBLC4MMIUMS5G3LAT6DLZEJTJFDWHANNB7EQVCGNVHOCTJQXVA@2\m\target\it\MCHECKSTYLE-337\build.log, f:\jenkins\jenkins-slave\workspace\en-checkstyle-plugin_master-6DNBLC4MMIUMS5G3LAT6DLZEJTJFDWHANNB7EQVCGNVHOCTJQXVA@2\m\target\it\MCHECKSTYLE-338\build.log, f:\jenkins\jenkins-slave\workspace\en-checkstyle-plugin_master-6DNBLC4MMIUMS5G3LAT6DLZEJTJFDWHANNB7EQVCGNVHOCTJQXVA@2\m\target\it\MCHECKSTYLE-347\build.log, f:\jenkins\jenkins-slave\workspace\en-checkstyle-plugin_master-6DNBLC4MMIUMS5G3LAT6DLZEJTJFDWHANNB7EQVCGNVHOCTJQXVA@2\m\target\it\MCHECKSTYLE-70-multi-sourcefolder\build.log, f:\jenkins\jenkins-slave\workspace\en-checkstyle-plugin_master-6DNBLC4MMIUMS5G3LAT6DLZEJTJFDWHANNB7EQVCGNVHOCTJQXVA@2\m\target\it\check-fail\build.log, f:\jenkins\jenkins-slave\workspace\en-checkstyle-plugin_master-6DNBLC4MMIUMS5G3LAT6DLZEJTJFDWHANNB7EQVCGNVHOCTJQXVA@2\m\target\it\check-pass\build.log, f:\jenkins\jenkins-slave\workspace\en-checkstyle-plugin_master-6DNBLC4MMIUMS5G3LAT6DLZEJTJFDWHANNB7EQVCGNVHOCTJQXVA@2\m\target\it\check-tests-only\build.log, f:\jenkins\jenkins-slave\workspace\en-checkstyle-plugin_master-6DNBLC4MMIUMS5G3LAT6DLZEJTJFDWHANNB7EQVCGNVHOCTJQXVA@2\m\target\it\checkstyle-goal\build.log, f:\jenkins\jenkins-slave\workspace\en-checkstyle-plugin_master-6DNBLC4MMIUMS5G3LAT6DLZEJTJFDWHANNB7EQVCGNVHOCTJQXVA@2\m\target\it\checkstyle-report\build.log, f:\jenkins\jenkins-slave\workspace\en-checkstyle-plugin_master-6DNBLC4MMIUMS5G3LAT6DLZEJTJFDWHANNB7EQVCGNVHOCTJQXVA@2\m\target\it\inlinerules\build.log, f:\jenkins\jenkins-slave\workspace\en-checkstyle-plugin_master-6DNBLC4MMIUMS5G3LAT6DLZEJTJFDWHANNB7EQVCGNVHOCTJQXVA@2\m\target\it\minimal-pom\build.log, f:\jenkins\jenkins-slave\workspace\en-checkstyle-plugin_master-6DNBLC4MMIUMS5G3LAT6DLZEJTJFDWHANNB7EQVCGNVHOCTJQXVA@2\m\target\it\multi-modules-aggregate\build.log, f:\jenkins\jenkins-slave\workspace\en-checkstyle-plugin_master-6DNBLC4MMIUMS5G3LAT6DLZEJTJFDWHANNB7EQVCGNVHOCTJQXVA@2\m\target\it\multi-modules\build.log, f:\jenkins\jenkins-slave\workspace\en-checkstyle-plugin_master-6DNBLC4MMIUMS5G3LAT6DLZEJTJFDWHANNB7EQVCGNVHOCTJQXVA@2\m\target\it\multimoduleproject\build.log]
[windows-jdk9] Finished parsing Maven Invoker results (found 40)
[windows-jdk9] [withMaven] junitPublisher - Archive test results for Maven artifact org.apache.maven.plugins:maven-checkstyle-plugin:3.0.1-SNAPSHOT generated by maven-surefire-plugin:test (default-test): m\target\surefire-reports\*.xml
[windows-jdk9] Recording test results
[windows-jdk9] None of the test reports contained any result
[Pipeline] [windows-jdk9] // withMaven
[Pipeline] [windows-jdk9] }
[Pipeline] [windows-jdk9] // stage
[Pipeline] [windows-jdk9] }
[Pipeline] [windows-jdk9] // node
[Pipeline] [windows-jdk9] }
[windows-jdk8] [INFO] run post-build script verify.groovy
[windows-jdk8] [INFO]           MCHECKSTYLE-338\pom.xml .......................... SUCCESS (7.8 s)
[windows-jdk8] [INFO] Building: MCHECKSTYLE-347\pom.xml
[windows-jdk8] [INFO] run post-build script verify.groovy
[windows-jdk8] [INFO]           MCHECKSTYLE-347\pom.xml .......................... SUCCESS (4.6 s)
[windows-jdk8] [INFO] Building: MCHECKSTYLE-70-multi-sourcefolder\pom.xml
[windows-jdk8] [INFO] run post-build script verify.groovy
[windows-jdk8] [INFO]           MCHECKSTYLE-70-multi-sourcefolder\pom.xml ........ SUCCESS (9.5 s)
[windows-jdk8] [INFO] Building: minimal-pom\pom.xml
[windows-jdk8] [INFO] run post-build script verify.bsh
[windows-jdk8] [INFO]           minimal-pom\pom.xml .............................. FAILED (6.5 s)
[windows-jdk8] [INFO]   The post-build script returned false.
[windows-jdk8] [INFO] Building: multi-modules\pom.xml
[windows-jdk8] [INFO]           multi-modules\pom.xml ............................ SUCCESS (10.8 s)
[windows-jdk8] [INFO] Building: multi-modules-aggregate\pom.xml
[windows-jdk8] [INFO] run post-build script verify.groovy
[windows-jdk8] [INFO]           multi-modules-aggregate\pom.xml .................. SUCCESS (8.9 s)
[windows-jdk8] [INFO] Building: multimoduleproject\pom.xml
[windows-jdk8] [INFO]           multimoduleproject\pom.xml ....................... SUCCESS (10.1 s)
[windows-jdk8] [INFO] 
[windows-jdk8] [INFO] --- maven-checkstyle-plugin:3.0.0:check (checkstyle-check) @ maven-checkstyle-plugin ---
[windows-jdk8] [INFO] There is 1 error reported by Checkstyle 6.18 with config/maven_checks.xml ruleset.
[windows-jdk8] [INFO] Ignored 1 error, 0 violation remaining.
[windows-jdk8] [INFO] 
[windows-jdk8] [INFO] --- maven-invoker-plugin:3.0.1:verify (integration-test) @ maven-checkstyle-plugin ---
[windows-jdk8] [INFO] -------------------------------------------------
[windows-jdk8] [INFO] Build Summary:
[windows-jdk8] [INFO]   Passed: 35, Failed: 5, Errors: 0, Skipped: 0
[windows-jdk8] [INFO] -------------------------------------------------
[windows-jdk8] [WARNING] The following builds failed:
[windows-jdk8] [WARNING] *  MCHECKSTYLE-129\pom.xml
[windows-jdk8] [WARNING] *  MCHECKSTYLE-173-with-charset\pom.xml
[windows-jdk8] [WARNING] *  MCHECKSTYLE-173-without-charset\pom.xml
[windows-jdk8] [WARNING] *  MCHECKSTYLE-337\pom.xml
[windows-jdk8] [WARNING] *  minimal-pom\pom.xml
[windows-jdk8] [INFO] -------------------------------------------------
[windows-jdk8] [WARNING] Ignoring that 5 builds failed.
[windows-jdk8] [INFO] ------------------------------------------------------------------------
[windows-jdk8] [INFO] BUILD SUCCESS
[windows-jdk8] [INFO] ------------------------------------------------------------------------
[windows-jdk8] [INFO] Total time: 07:54 min
[windows-jdk8] [INFO] Finished at: 2018-07-21T09:11:23Z
[windows-jdk8] [INFO] Final Memory: 64M/867M
[windows-jdk8] [INFO] ------------------------------------------------------------------------
[windows-jdk8] [INFO] [jenkins-event-spy] Generated F:\jenkins\jenkins-slave\workspace\en-checkstyle-plugin_master-6DNBLC4MMIUMS5G3LAT6DLZEJTJFDWHANNB7EQVCGNVHOCTJQXVA@tmp\withMavenba6ff2d5\maven-spy-20180721-090329-2101531148573460028537.log
[windows-jdk8] Picked up JAVA_TOOL_OPTIONS: -Dmaven.ext.class.path="f:\jenkins\jenkins-slave\workspace\en-checkstyle-plugin_master-6DNBLC4MMIUMS5G3LAT6DLZEJTJFDWHANNB7EQVCGNVHOCTJQXVA@tmp\withMavenba6ff2d5\pipeline-maven-spy.jar" -Dorg.jenkinsci.plugins.pipeline.maven.reportsFolder="f:\jenkins\jenkins-slave\workspace\en-checkstyle-plugin_master-6DNBLC4MMIUMS5G3LAT6DLZEJTJFDWHANNB7EQVCGNVHOCTJQXVA@tmp\withMavenba6ff2d5" 
[Pipeline] [windows-jdk8] }
[Pipeline] [windows-jdk8] // dir
[Pipeline] [windows-jdk8] }
[windows-jdk8] [withMaven] invokerPublisher - Archive invoker results for Maven artifact MavenArtifact{org.apache.maven.plugins:maven-checkstyle-plugin::3.0.1-SNAPSHOT(version: 3.0.1-SNAPSHOT, snapshot:false) } generated by PluginInvocation{org.apache.maven.plugins:maven-invoker-plugin:3.0.1@integration-test  integration-test}: m\target\invoker-reports\*.xml
[windows-jdk8] performing MavenInvokerRecorder, reportsFilenamePattern:'**/m\target\invoker-reports/BUILD*.xml', invokerBuildDir:'**/m\target\it'
[windows-jdk8] Found reports:[f:\jenkins\jenkins-slave\workspace\en-checkstyle-plugin_master-6DNBLC4MMIUMS5G3LAT6DLZEJTJFDWHANNB7EQVCGNVHOCTJQXVA\m\target\invoker-reports\BUILD-MCHECKSTYLE-129.xml, f:\jenkins\jenkins-slave\workspace\en-checkstyle-plugin_master-6DNBLC4MMIUMS5G3LAT6DLZEJTJFDWHANNB7EQVCGNVHOCTJQXVA\m\target\invoker-reports\BUILD-MCHECKSTYLE-131.xml, f:\jenkins\jenkins-slave\workspace\en-checkstyle-plugin_master-6DNBLC4MMIUMS5G3LAT6DLZEJTJFDWHANNB7EQVCGNVHOCTJQXVA\m\target\invoker-reports\BUILD-MCHECKSTYLE-137.xml, f:\jenkins\jenkins-slave\workspace\en-checkstyle-plugin_master-6DNBLC4MMIUMS5G3LAT6DLZEJTJFDWHANNB7EQVCGNVHOCTJQXVA\m\target\invoker-reports\BUILD-MCHECKSTYLE-169.xml, f:\jenkins\jenkins-slave\workspace\en-checkstyle-plugin_master-6DNBLC4MMIUMS5G3LAT6DLZEJTJFDWHANNB7EQVCGNVHOCTJQXVA\m\target\invoker-reports\BUILD-MCHECKSTYLE-172.xml, f:\jenkins\jenkins-slave\workspace\en-checkstyle-plugin_master-6DNBLC4MMIUMS5G3LAT6DLZEJTJFDWHANNB7EQVCGNVHOCTJQXVA\m\target\invoker-reports\BUILD-MCHECKSTYLE-173-with-charset.xml, f:\jenkins\jenkins-slave\workspace\en-checkstyle-plugin_master-6DNBLC4MMIUMS5G3LAT6DLZEJTJFDWHANNB7EQVCGNVHOCTJQXVA\m\target\invoker-reports\BUILD-MCHECKSTYLE-173-without-charset.xml, f:\jenkins\jenkins-slave\workspace\en-checkstyle-plugin_master-6DNBLC4MMIUMS5G3LAT6DLZEJTJFDWHANNB7EQVCGNVHOCTJQXVA\m\target\invoker-reports\BUILD-MCHECKSTYLE-193.xml, f:\jenkins\jenkins-slave\workspace\en-checkstyle-plugin_master-6DNBLC4MMIUMS5G3LAT6DLZEJTJFDWHANNB7EQVCGNVHOCTJQXVA\m\target\invoker-reports\BUILD-MCHECKSTYLE-214-basedir-resource.xml, f:\jenkins\jenkins-slave\workspace\en-checkstyle-plugin_master-6DNBLC4MMIUMS5G3LAT6DLZEJTJFDWHANNB7EQVCGNVHOCTJQXVA\m\target\invoker-reports\BUILD-MCHECKSTYLE-219-no-license_failure.xml, f:\jenkins\jenkins-slave\workspace\en-checkstyle-plugin_master-6DNBLC4MMIUMS5G3LAT6DLZEJTJFDWHANNB7EQVCGNVHOCTJQXVA\m\target\invoker-reports\BUILD-MCHECKSTYLE-219-no-license_success.xml, f:\jenkins\jenkins-slave\workspace\en-checkstyle-plugin_master-6DNBLC4MMIUMS5G3LAT6DLZEJTJFDWHANNB7EQVCGNVHOCTJQXVA\m\target\invoker-reports\BUILD-MCHECKSTYLE-220.xml, f:\jenkins\jenkins-slave\workspace\en-checkstyle-plugin_master-6DNBLC4MMIUMS5G3LAT6DLZEJTJFDWHANNB7EQVCGNVHOCTJQXVA\m\target\invoker-reports\BUILD-MCHECKSTYLE-222-no-resources.xml, f:\jenkins\jenkins-slave\workspace\en-checkstyle-plugin_master-6DNBLC4MMIUMS5G3LAT6DLZEJTJFDWHANNB7EQVCGNVHOCTJQXVA\m\target\invoker-reports\BUILD-MCHECKSTYLE-222-resources.xml, f:\jenkins\jenkins-slave\workspace\en-checkstyle-plugin_master-6DNBLC4MMIUMS5G3LAT6DLZEJTJFDWHANNB7EQVCGNVHOCTJQXVA\m\target\invoker-reports\BUILD-MCHECKSTYLE-222-testResources.xml, f:\jenkins\jenkins-slave\workspace\en-checkstyle-plugin_master-6DNBLC4MMIUMS5G3LAT6DLZEJTJFDWHANNB7EQVCGNVHOCTJQXVA\m\target\invoker-reports\BUILD-MCHECKSTYLE-224.xml, f:\jenkins\jenkins-slave\workspace\en-checkstyle-plugin_master-6DNBLC4MMIUMS5G3LAT6DLZEJTJFDWHANNB7EQVCGNVHOCTJQXVA\m\target\invoker-reports\BUILD-MCHECKSTYLE-225-LICENSE.txt.xml, f:\jenkins\jenkins-slave\workspace\en-checkstyle-plugin_master-6DNBLC4MMIUMS5G3LAT6DLZEJTJFDWHANNB7EQVCGNVHOCTJQXVA\m\target\invoker-reports\BUILD-MCHECKSTYLE-225-customHeader.xml, f:\jenkins\jenkins-slave\workspace\en-checkstyle-plugin_master-6DNBLC4MMIUMS5G3LAT6DLZEJTJFDWHANNB7EQVCGNVHOCTJQXVA\m\target\invoker-reports\BUILD-MCHECKSTYLE-225-pluginManagement.xml, f:\jenkins\jenkins-slave\workspace\en-checkstyle-plugin_master-6DNBLC4MMIUMS5G3LAT6DLZEJTJFDWHANNB7EQVCGNVHOCTJQXVA\m\target\invoker-reports\BUILD-MCHECKSTYLE-253-jdk8.xml, f:\jenkins\jenkins-slave\workspace\en-checkstyle-plugin_master-6DNBLC4MMIUMS5G3LAT6DLZEJTJFDWHANNB7EQVCGNVHOCTJQXVA\m\target\invoker-reports\BUILD-MCHECKSTYLE-260-sourceDirectories.xml, f:\jenkins\jenkins-slave\workspace\en-checkstyle-plugin_master-6DNBLC4MMIUMS5G3LAT6DLZEJTJFDWHANNB7EQVCGNVHOCTJQXVA\m\target\invoker-reports\BUILD-MCHECKSTYLE-260-testSourceDirectories.xml, f:\jenkins\jenkins-slave\workspace\en-checkstyle-plugin_master-6DNBLC4MMIUMS5G3LAT6DLZEJTJFDWHANNB7EQVCGNVHOCTJQXVA\m\target\invoker-reports\BUILD-MCHECKSTYLE-268.xml, f:\jenkins\jenkins-slave\workspace\en-checkstyle-plugin_master-6DNBLC4MMIUMS5G3LAT6DLZEJTJFDWHANNB7EQVCGNVHOCTJQXVA\m\target\invoker-reports\BUILD-MCHECKSTYLE-295.xml, f:\jenkins\jenkins-slave\workspace\en-checkstyle-plugin_master-6DNBLC4MMIUMS5G3LAT6DLZEJTJFDWHANNB7EQVCGNVHOCTJQXVA\m\target\invoker-reports\BUILD-MCHECKSTYLE-332_cache-checker.xml, f:\jenkins\jenkins-slave\workspace\en-checkstyle-plugin_master-6DNBLC4MMIUMS5G3LAT6DLZEJTJFDWHANNB7EQVCGNVHOCTJQXVA\m\target\invoker-reports\BUILD-MCHECKSTYLE-332_cache-treewalker.xml, f:\jenkins\jenkins-slave\workspace\en-checkstyle-plugin_master-6DNBLC4MMIUMS5G3LAT6DLZEJTJFDWHANNB7EQVCGNVHOCTJQXVA\m\target\invoker-reports\BUILD-MCHECKSTYLE-337.xml, f:\jenkins\jenkins-slave\workspace\en-checkstyle-plugin_master-6DNBLC4MMIUMS5G3LAT6DLZEJTJFDWHANNB7EQVCGNVHOCTJQXVA\m\target\invoker-reports\BUILD-MCHECKSTYLE-338.xml, f:\jenkins\jenkins-slave\workspace\en-checkstyle-plugin_master-6DNBLC4MMIUMS5G3LAT6DLZEJTJFDWHANNB7EQVCGNVHOCTJQXVA\m\target\invoker-reports\BUILD-MCHECKSTYLE-347.xml, f:\jenkins\jenkins-slave\workspace\en-checkstyle-plugin_master-6DNBLC4MMIUMS5G3LAT6DLZEJTJFDWHANNB7EQVCGNVHOCTJQXVA\m\target\invoker-reports\BUILD-MCHECKSTYLE-70-multi-sourcefolder.xml, f:\jenkins\jenkins-slave\workspace\en-checkstyle-plugin_master-6DNBLC4MMIUMS5G3LAT6DLZEJTJFDWHANNB7EQVCGNVHOCTJQXVA\m\target\invoker-reports\BUILD-check-fail.xml, f:\jenkins\jenkins-slave\workspace\en-checkstyle-plugin_master-6DNBLC4MMIUMS5G3LAT6DLZEJTJFDWHANNB7EQVCGNVHOCTJQXVA\m\target\invoker-reports\BUILD-check-pass.xml, f:\jenkins\jenkins-slave\workspace\en-checkstyle-plugin_master-6DNBLC4MMIUMS5G3LAT6DLZEJTJFDWHANNB7EQVCGNVHOCTJQXVA\m\target\invoker-reports\BUILD-check-tests-only.xml, f:\jenkins\jenkins-slave\workspace\en-checkstyle-plugin_master-6DNBLC4MMIUMS5G3LAT6DLZEJTJFDWHANNB7EQVCGNVHOCTJQXVA\m\target\invoker-reports\BUILD-checkstyle-goal.xml, f:\jenkins\jenkins-slave\workspace\en-checkstyle-plugin_master-6DNBLC4MMIUMS5G3LAT6DLZEJTJFDWHANNB7EQVCGNVHOCTJQXVA\m\target\invoker-reports\BUILD-checkstyle-report.xml, f:\jenkins\jenkins-slave\workspace\en-checkstyle-plugin_master-6DNBLC4MMIUMS5G3LAT6DLZEJTJFDWHANNB7EQVCGNVHOCTJQXVA\m\target\invoker-reports\BUILD-inlinerules.xml, f:\jenkins\jenkins-slave\workspace\en-checkstyle-plugin_master-6DNBLC4MMIUMS5G3LAT6DLZEJTJFDWHANNB7EQVCGNVHOCTJQXVA\m\target\invoker-reports\BUILD-minimal-pom.xml, f:\jenkins\jenkins-slave\workspace\en-checkstyle-plugin_master-6DNBLC4MMIUMS5G3LAT6DLZEJTJFDWHANNB7EQVCGNVHOCTJQXVA\m\target\invoker-reports\BUILD-multi-modules-aggregate.xml, f:\jenkins\jenkins-slave\workspace\en-checkstyle-plugin_master-6DNBLC4MMIUMS5G3LAT6DLZEJTJFDWHANNB7EQVCGNVHOCTJQXVA\m\target\invoker-reports\BUILD-multi-modules.xml, f:\jenkins\jenkins-slave\workspace\en-checkstyle-plugin_master-6DNBLC4MMIUMS5G3LAT6DLZEJTJFDWHANNB7EQVCGNVHOCTJQXVA\m\target\invoker-reports\BUILD-multimoduleproject.xml]
[windows-jdk8] Found logs:[f:\jenkins\jenkins-slave\workspace\en-checkstyle-plugin_master-6DNBLC4MMIUMS5G3LAT6DLZEJTJFDWHANNB7EQVCGNVHOCTJQXVA\m\target\it\MCHECKSTYLE-129\build.log, f:\jenkins\jenkins-slave\workspace\en-checkstyle-plugin_master-6DNBLC4MMIUMS5G3LAT6DLZEJTJFDWHANNB7EQVCGNVHOCTJQXVA\m\target\it\MCHECKSTYLE-131\build.log, f:\jenkins\jenkins-slave\workspace\en-checkstyle-plugin_master-6DNBLC4MMIUMS5G3LAT6DLZEJTJFDWHANNB7EQVCGNVHOCTJQXVA\m\target\it\MCHECKSTYLE-137\build.log, f:\jenkins\jenkins-slave\workspace\en-checkstyle-plugin_master-6DNBLC4MMIUMS5G3LAT6DLZEJTJFDWHANNB7EQVCGNVHOCTJQXVA\m\target\it\MCHECKSTYLE-169\build.log, f:\jenkins\jenkins-slave\workspace\en-checkstyle-plugin_master-6DNBLC4MMIUMS5G3LAT6DLZEJTJFDWHANNB7EQVCGNVHOCTJQXVA\m\target\it\MCHECKSTYLE-172\build.log, f:\jenkins\jenkins-slave\workspace\en-checkstyle-plugin_master-6DNBLC4MMIUMS5G3LAT6DLZEJTJFDWHANNB7EQVCGNVHOCTJQXVA\m\target\it\MCHECKSTYLE-173-with-charset\build.log, f:\jenkins\jenkins-slave\workspace\en-checkstyle-plugin_master-6DNBLC4MMIUMS5G3LAT6DLZEJTJFDWHANNB7EQVCGNVHOCTJQXVA\m\target\it\MCHECKSTYLE-173-without-charset\build.log, f:\jenkins\jenkins-slave\workspace\en-checkstyle-plugin_master-6DNBLC4MMIUMS5G3LAT6DLZEJTJFDWHANNB7EQVCGNVHOCTJQXVA\m\target\it\MCHECKSTYLE-193\build.log, f:\jenkins\jenkins-slave\workspace\en-checkstyle-plugin_master-6DNBLC4MMIUMS5G3LAT6DLZEJTJFDWHANNB7EQVCGNVHOCTJQXVA\m\target\it\MCHECKSTYLE-214-basedir-resource\build.log, f:\jenkins\jenkins-slave\workspace\en-checkstyle-plugin_master-6DNBLC4MMIUMS5G3LAT6DLZEJTJFDWHANNB7EQVCGNVHOCTJQXVA\m\target\it\MCHECKSTYLE-219-no-license_failure\build.log, f:\jenkins\jenkins-slave\workspace\en-checkstyle-plugin_master-6DNBLC4MMIUMS5G3LAT6DLZEJTJFDWHANNB7EQVCGNVHOCTJQXVA\m\target\it\MCHECKSTYLE-219-no-license_success\build.log, f:\jenkins\jenkins-slave\workspace\en-checkstyle-plugin_master-6DNBLC4MMIUMS5G3LAT6DLZEJTJFDWHANNB7EQVCGNVHOCTJQXVA\m\target\it\MCHECKSTYLE-220\build.log, f:\jenkins\jenkins-slave\workspace\en-checkstyle-plugin_master-6DNBLC4MMIUMS5G3LAT6DLZEJTJFDWHANNB7EQVCGNVHOCTJQXVA\m\target\it\MCHECKSTYLE-222-no-resources\build.log, f:\jenkins\jenkins-slave\workspace\en-checkstyle-plugin_master-6DNBLC4MMIUMS5G3LAT6DLZEJTJFDWHANNB7EQVCGNVHOCTJQXVA\m\target\it\MCHECKSTYLE-222-resources\build.log, f:\jenkins\jenkins-slave\workspace\en-checkstyle-plugin_master-6DNBLC4MMIUMS5G3LAT6DLZEJTJFDWHANNB7EQVCGNVHOCTJQXVA\m\target\it\MCHECKSTYLE-222-testResources\build.log, f:\jenkins\jenkins-slave\workspace\en-checkstyle-plugin_master-6DNBLC4MMIUMS5G3LAT6DLZEJTJFDWHANNB7EQVCGNVHOCTJQXVA\m\target\it\MCHECKSTYLE-224\build.log, f:\jenkins\jenkins-slave\workspace\en-checkstyle-plugin_master-6DNBLC4MMIUMS5G3LAT6DLZEJTJFDWHANNB7EQVCGNVHOCTJQXVA\m\target\it\MCHECKSTYLE-225-LICENSE.txt\build.log, f:\jenkins\jenkins-slave\workspace\en-checkstyle-plugin_master-6DNBLC4MMIUMS5G3LAT6DLZEJTJFDWHANNB7EQVCGNVHOCTJQXVA\m\target\it\MCHECKSTYLE-225-customHeader\build.log, f:\jenkins\jenkins-slave\workspace\en-checkstyle-plugin_master-6DNBLC4MMIUMS5G3LAT6DLZEJTJFDWHANNB7EQVCGNVHOCTJQXVA\m\target\it\MCHECKSTYLE-225-pluginManagement\build.log, f:\jenkins\jenkins-slave\workspace\en-checkstyle-plugin_master-6DNBLC4MMIUMS5G3LAT6DLZEJTJFDWHANNB7EQVCGNVHOCTJQXVA\m\target\it\MCHECKSTYLE-253-jdk8\build.log, f:\jenkins\jenkins-slave\workspace\en-checkstyle-plugin_master-6DNBLC4MMIUMS5G3LAT6DLZEJTJFDWHANNB7EQVCGNVHOCTJQXVA\m\target\it\MCHECKSTYLE-260-sourceDirectories\build.log, f:\jenkins\jenkins-slave\workspace\en-checkstyle-plugin_master-6DNBLC4MMIUMS5G3LAT6DLZEJTJFDWHANNB7EQVCGNVHOCTJQXVA\m\target\it\MCHECKSTYLE-260-testSourceDirectories\build.log, f:\jenkins\jenkins-slave\workspace\en-checkstyle-plugin_master-6DNBLC4MMIUMS5G3LAT6DLZEJTJFDWHANNB7EQVCGNVHOCTJQXVA\m\target\it\MCHECKSTYLE-268\build.log, f:\jenkins\jenkins-slave\workspace\en-checkstyle-plugin_master-6DNBLC4MMIUMS5G3LAT6DLZEJTJFDWHANNB7EQVCGNVHOCTJQXVA\m\target\it\MCHECKSTYLE-295\build.log, f:\jenkins\jenkins-slave\workspace\en-checkstyle-plugin_master-6DNBLC4MMIUMS5G3LAT6DLZEJTJFDWHANNB7EQVCGNVHOCTJQXVA\m\target\it\MCHECKSTYLE-332_cache-checker\build.log, f:\jenkins\jenkins-slave\workspace\en-checkstyle-plugin_master-6DNBLC4MMIUMS5G3LAT6DLZEJTJFDWHANNB7EQVCGNVHOCTJQXVA\m\target\it\MCHECKSTYLE-332_cache-treewalker\build.log, f:\jenkins\jenkins-slave\workspace\en-checkstyle-plugin_master-6DNBLC4MMIUMS5G3LAT6DLZEJTJFDWHANNB7EQVCGNVHOCTJQXVA\m\target\it\MCHECKSTYLE-337\build.log, f:\jenkins\jenkins-slave\workspace\en-checkstyle-plugin_master-6DNBLC4MMIUMS5G3LAT6DLZEJTJFDWHANNB7EQVCGNVHOCTJQXVA\m\target\it\MCHECKSTYLE-338\build.log, f:\jenkins\jenkins-slave\workspace\en-checkstyle-plugin_master-6DNBLC4MMIUMS5G3LAT6DLZEJTJFDWHANNB7EQVCGNVHOCTJQXVA\m\target\it\MCHECKSTYLE-347\build.log, f:\jenkins\jenkins-slave\workspace\en-checkstyle-plugin_master-6DNBLC4MMIUMS5G3LAT6DLZEJTJFDWHANNB7EQVCGNVHOCTJQXVA\m\target\it\MCHECKSTYLE-70-multi-sourcefolder\build.log, f:\jenkins\jenkins-slave\workspace\en-checkstyle-plugin_master-6DNBLC4MMIUMS5G3LAT6DLZEJTJFDWHANNB7EQVCGNVHOCTJQXVA\m\target\it\check-fail\build.log, f:\jenkins\jenkins-slave\workspace\en-checkstyle-plugin_master-6DNBLC4MMIUMS5G3LAT6DLZEJTJFDWHANNB7EQVCGNVHOCTJQXVA\m\target\it\check-pass\build.log, f:\jenkins\jenkins-slave\workspace\en-checkstyle-plugin_master-6DNBLC4MMIUMS5G3LAT6DLZEJTJFDWHANNB7EQVCGNVHOCTJQXVA\m\target\it\check-tests-only\build.log, f:\jenkins\jenkins-slave\workspace\en-checkstyle-plugin_master-6DNBLC4MMIUMS5G3LAT6DLZEJTJFDWHANNB7EQVCGNVHOCTJQXVA\m\target\it\checkstyle-goal\build.log, f:\jenkins\jenkins-slave\workspace\en-checkstyle-plugin_master-6DNBLC4MMIUMS5G3LAT6DLZEJTJFDWHANNB7EQVCGNVHOCTJQXVA\m\target\it\checkstyle-report\build.log, f:\jenkins\jenkins-slave\workspace\en-checkstyle-plugin_master-6DNBLC4MMIUMS5G3LAT6DLZEJTJFDWHANNB7EQVCGNVHOCTJQXVA\m\target\it\inlinerules\build.log, f:\jenkins\jenkins-slave\workspace\en-checkstyle-plugin_master-6DNBLC4MMIUMS5G3LAT6DLZEJTJFDWHANNB7EQVCGNVHOCTJQXVA\m\target\it\minimal-pom\build.log, f:\jenkins\jenkins-slave\workspace\en-checkstyle-plugin_master-6DNBLC4MMIUMS5G3LAT6DLZEJTJFDWHANNB7EQVCGNVHOCTJQXVA\m\target\it\multi-modules-aggregate\build.log, f:\jenkins\jenkins-slave\workspace\en-checkstyle-plugin_master-6DNBLC4MMIUMS5G3LAT6DLZEJTJFDWHANNB7EQVCGNVHOCTJQXVA\m\target\it\multi-modules\build.log, f:\jenkins\jenkins-slave\workspace\en-checkstyle-plugin_master-6DNBLC4MMIUMS5G3LAT6DLZEJTJFDWHANNB7EQVCGNVHOCTJQXVA\m\target\it\multimoduleproject\build.log]
[windows-jdk8] Finished parsing Maven Invoker results (found 40)
[windows-jdk8] [withMaven] junitPublisher - Archive test results for Maven artifact org.apache.maven.plugins:maven-checkstyle-plugin:3.0.1-SNAPSHOT generated by maven-surefire-plugin:test (default-test): m\target\surefire-reports\*.xml
[windows-jdk8] Recording test results
[windows-jdk8] None of the test reports contained any result
[Pipeline] [windows-jdk8] // withMaven
[Pipeline] [windows-jdk8] }
[Pipeline] [windows-jdk8] // stage
[Pipeline] [windows-jdk8] }
[Pipeline] [windows-jdk8] // node
[Pipeline] [windows-jdk8] }
[Pipeline] // parallel
[Pipeline] stage
[Pipeline] { (Notifications)
[Pipeline] echo
Build result: UNSTABLE
[Pipeline] jiraIssueSelector
[Pipeline] emailext
Mime
  • Unnamed multipart/mixed (inline, None, 0 bytes)
View raw message