maven-notifications mailing list archives

Site index · List index
Message view « Date » · « Thread »
Top « Date » · « Thread »
From Apache Jenkins Server <jenk...@builds.apache.org>
Subject Build failed in Jenkins: Maven TLP » maven-ant-plugin » master #7
Date Thu, 19 Jul 2018 12:05:36 GMT
See https://builds.apache.org/job/maven-box/job/maven-ant-plugin/job/master/7/

Changes:

* Add jenkinsEnv#nodeSelection to globally finetune node selection
* Try another expression
* INFRA-16749, INFRA-16768  - Trying to keep workspace clean
* INFRA-16749, INFRA-16768  - Followup
* INFRA-16749, INFRA-16768  - Followup temporarily failFast = false.
* Used the wrong comment style.
* Exclude ubuntu-eu2 due to lack of disk space
* Apply jenkinsEnv.nodeSelection
* Upgrade maven-plugins parent Switch to asfMavenTlpPlgnBuild
* Upgrade maven-plugins parent Switch to asfMavenTlpPlgnBuild
* Upgrade maven-plugins parent Switch to asfMavenTlpPlgnBuild
* Upgrade maven-plugins parent Switch to asfMavenTlpPlgnBuild
* Upgrade maven-plugins parent Switch to asfMavenTlpPlgnBuild
* Upgrade maven-plugins parent Switch to asfMavenTlpPlgnBuild
* Upgrade maven-plugins parent Switch to asfMavenTlpPlgnBuild
* Upgrade maven-plugins parent Switch to asfMavenTlpPlgnBuild

All tests passed

Build log:
[...truncated 3.68 MB...]
[windows-jdk10-m3.5.x_build] [INFO] Downloaded: https://repo.maven.apache.org/maven2/org/apache/maven/maven-parent/16/maven-parent-16.pom
(23 kB at 2.9 MB/s)
[windows-jdk10-m3.5.x_build] [INFO] Downloading: https://repo.maven.apache.org/maven2/org/apache/maven/doxia/doxia-sink-api/1.0/doxia-sink-api-1.0.pom
[windows-jdk10-m3.5.x_build] [INFO] Downloaded: https://repo.maven.apache.org/maven2/org/apache/maven/doxia/doxia-sink-api/1.0/doxia-sink-api-1.0.pom
(1.4 kB at 231 kB/s)
[windows-jdk10-m3.5.x_build] [INFO] Downloading: https://repo.maven.apache.org/maven2/org/apache/maven/doxia/doxia/1.0/doxia-1.0.pom
[windows-jdk10-m3.5.x_build] [INFO] Downloaded: https://repo.maven.apache.org/maven2/org/apache/maven/doxia/doxia/1.0/doxia-1.0.pom
(9.6 kB at 508 kB/s)
[windows-jdk10-m3.5.x_build] [INFO] Downloading: https://repo.maven.apache.org/maven2/org/apache/maven/maven-parent/10/maven-parent-10.pom
[windows-jdk10-m3.5.x_build] [INFO] Downloaded: https://repo.maven.apache.org/maven2/org/apache/maven/maven-parent/10/maven-parent-10.pom
(32 kB at 1.5 MB/s)
[windows-jdk10-m3.5.x_build] [INFO] Downloading: https://repo.maven.apache.org/maven2/org/codehaus/plexus/plexus-utils/3.0.21/plexus-utils-3.0.21.pom
[windows-jdk10-m3.5.x_build] [INFO] Downloaded: https://repo.maven.apache.org/maven2/org/codehaus/plexus/plexus-utils/3.0.21/plexus-utils-3.0.21.pom
(3.8 kB at 141 kB/s)
[windows-jdk10-m3.5.x_build] [INFO] Downloading: https://repo.maven.apache.org/maven2/org/apache/rat/apache-rat-api/0.12/apache-rat-api-0.12.jar
[windows-jdk10-m3.5.x_build] [INFO] Downloading: https://repo.maven.apache.org/maven2/commons-collections/commons-collections/3.2.2/commons-collections-3.2.2.jar
[windows-jdk10-m3.5.x_build] [INFO] Downloading: https://repo.maven.apache.org/maven2/commons-lang/commons-lang/2.6/commons-lang-2.6.jar
[windows-jdk10-m3.5.x_build] [INFO] Downloading: https://repo.maven.apache.org/maven2/commons-io/commons-io/2.2/commons-io-2.2.jar
[windows-jdk10-m3.5.x_build] [INFO] Downloading: https://repo.maven.apache.org/maven2/org/apache/rat/apache-rat-core/0.12/apache-rat-core-0.12.jar
[windows-jdk10-m3.5.x_build] [INFO] Downloaded: https://repo.maven.apache.org/maven2/org/apache/rat/apache-rat-api/0.12/apache-rat-api-0.12.jar
(11 kB at 231 kB/s)
[windows-jdk10-m3.5.x_build] [INFO] Downloading: https://repo.maven.apache.org/maven2/org/apache/commons/commons-compress/1.10/commons-compress-1.10.jar
[windows-jdk10-m3.5.x_build] [INFO] Downloaded: https://repo.maven.apache.org/maven2/commons-lang/commons-lang/2.6/commons-lang-2.6.jar
(284 kB at 5.8 MB/s)
[windows-jdk10-m3.5.x_build] [INFO] Downloading: https://repo.maven.apache.org/maven2/classworlds/classworlds/1.1-alpha-2/classworlds-1.1-alpha-2.jar
[windows-jdk10-m3.5.x_build] [INFO] Downloaded: https://repo.maven.apache.org/maven2/commons-io/commons-io/2.2/commons-io-2.2.jar
(174 kB at 2.8 MB/s)
[windows-jdk10-m3.5.x_build] [INFO] Downloading: https://repo.maven.apache.org/maven2/org/apache/maven/doxia/doxia-core/1.6/doxia-core-1.6.jar
[windows-jdk10-m3.5.x_build] [INFO] Downloaded: https://repo.maven.apache.org/maven2/org/apache/rat/apache-rat-core/0.12/apache-rat-core-0.12.jar
(122 kB at 1.9 MB/s)
[windows-jdk10-m3.5.x_build] [INFO] Downloading: https://repo.maven.apache.org/maven2/org/apache/maven/doxia/doxia-logging-api/1.6/doxia-logging-api-1.6.jar
[windows-jdk10-m3.5.x_build] [INFO] Downloaded: https://repo.maven.apache.org/maven2/classworlds/classworlds/1.1-alpha-2/classworlds-1.1-alpha-2.jar
(38 kB at 521 kB/s)
[windows-jdk10-m3.5.x_build] [INFO] Downloading: https://repo.maven.apache.org/maven2/org/apache/httpcomponents/httpclient/4.0.2/httpclient-4.0.2.jar
[windows-jdk10-m3.5.x_build] [INFO] Downloaded: https://repo.maven.apache.org/maven2/commons-collections/commons-collections/3.2.2/commons-collections-3.2.2.jar
(588 kB at 8.1 MB/s)
[windows-jdk10-m3.5.x_build] [INFO] Downloading: https://repo.maven.apache.org/maven2/commons-logging/commons-logging/1.1.1/commons-logging-1.1.1.jar
[windows-jdk10-m3.5.x_build] [INFO] Downloaded: https://repo.maven.apache.org/maven2/org/apache/commons/commons-compress/1.10/commons-compress-1.10.jar
(409 kB at 5.1 MB/s)
[windows-jdk10-m3.5.x_build] [INFO] Downloading: https://repo.maven.apache.org/maven2/commons-codec/commons-codec/1.3/commons-codec-1.3.jar
[windows-jdk10-m3.5.x_build] [INFO] Downloaded: https://repo.maven.apache.org/maven2/org/apache/maven/doxia/doxia-logging-api/1.6/doxia-logging-api-1.6.jar
(11 kB at 135 kB/s)
[windows-jdk10-m3.5.x_build] [INFO] Downloading: https://repo.maven.apache.org/maven2/org/apache/httpcomponents/httpcore/4.0.1/httpcore-4.0.1.jar
[windows-jdk10-m3.5.x_build] [INFO] Downloaded: https://repo.maven.apache.org/maven2/org/apache/maven/doxia/doxia-core/1.6/doxia-core-1.6.jar
(162 kB at 1.9 MB/s)
[windows-jdk10-m3.5.x_build] [INFO] Downloading: https://repo.maven.apache.org/maven2/xmlunit/xmlunit/1.5/xmlunit-1.5.jar
[windows-jdk10-m3.5.x_build] [INFO] Downloaded: https://repo.maven.apache.org/maven2/commons-codec/commons-codec/1.3/commons-codec-1.3.jar
(47 kB at 198 kB/s)
[windows-jdk10-m3.5.x_build] [INFO] Downloading: https://repo.maven.apache.org/maven2/org/apache/maven/doxia/doxia-decoration-model/1.6/doxia-decoration-model-1.6.jar
[windows-jdk10-m3.5.x_build] [INFO] Downloaded: https://repo.maven.apache.org/maven2/org/apache/httpcomponents/httpclient/4.0.2/httpclient-4.0.2.jar
(293 kB at 1.2 MB/s)
[windows-jdk10-m3.5.x_build] [INFO] Downloading: https://repo.maven.apache.org/maven2/org/apache/maven/doxia/doxia-sink-api/1.6/doxia-sink-api-1.6.jar
[windows-jdk10-m3.5.x_build] [INFO] Downloaded: https://repo.maven.apache.org/maven2/org/apache/httpcomponents/httpcore/4.0.1/httpcore-4.0.1.jar
(173 kB at 686 kB/s)
[windows-jdk10-m3.5.x_build] [INFO] Downloading: https://repo.maven.apache.org/maven2/org/apache/maven/doxia/doxia-site-renderer/1.6/doxia-site-renderer-1.6.jar
[windows-jdk10-m3.5.x_build] [INFO] Downloaded: https://repo.maven.apache.org/maven2/xmlunit/xmlunit/1.5/xmlunit-1.5.jar
(98 kB at 386 kB/s)
[windows-jdk10-m3.5.x_build] [INFO] Downloading: https://repo.maven.apache.org/maven2/org/apache/maven/doxia/doxia-module-xhtml/1.6/doxia-module-xhtml-1.6.jar
[windows-jdk10-m3.5.x_build] [INFO] Downloaded: https://repo.maven.apache.org/maven2/commons-logging/commons-logging/1.1.1/commons-logging-1.1.1.jar
(61 kB at 239 kB/s)
[windows-jdk10-m3.5.x_build] [INFO] Downloading: https://repo.maven.apache.org/maven2/org/apache/maven/doxia/doxia-module-fml/1.6/doxia-module-fml-1.6.jar
[windows-jdk10-m3.5.x_build] [INFO] Downloaded: https://repo.maven.apache.org/maven2/org/apache/maven/doxia/doxia-sink-api/1.6/doxia-sink-api-1.6.jar
(11 kB at 44 kB/s)
[windows-jdk10-m3.5.x_build] [INFO] Downloading: https://repo.maven.apache.org/maven2/org/codehaus/plexus/plexus-i18n/1.0-beta-7/plexus-i18n-1.0-beta-7.jar
[windows-jdk10-m3.5.x_build] [INFO] Downloaded: https://repo.maven.apache.org/maven2/org/apache/maven/doxia/doxia-decoration-model/1.6/doxia-decoration-model-1.6.jar
(57 kB at 222 kB/s)
[windows-jdk10-m3.5.x_build] [INFO] Downloading: https://repo.maven.apache.org/maven2/org/codehaus/plexus/plexus-velocity/1.1.7/plexus-velocity-1.1.7.jar
[windows-jdk10-m3.5.x_build] [INFO] Downloaded: https://repo.maven.apache.org/maven2/org/codehaus/plexus/plexus-i18n/1.0-beta-7/plexus-i18n-1.0-beta-7.jar
(11 kB at 40 kB/s)
[windows-jdk10-m3.5.x_build] [INFO] Downloading: https://repo.maven.apache.org/maven2/org/apache/velocity/velocity/1.5/velocity-1.5.jar
[windows-jdk10-m3.5.x_build] [INFO] Downloaded: https://repo.maven.apache.org/maven2/org/apache/maven/doxia/doxia-module-xhtml/1.6/doxia-module-xhtml-1.6.jar
(16 kB at 57 kB/s)
[windows-jdk10-m3.5.x_build] [INFO] Downloading: https://repo.maven.apache.org/maven2/oro/oro/2.0.8/oro-2.0.8.jar
[windows-jdk10-m3.5.x_build] [INFO] Downloading: https://repo.maven.apache.org/maven2/org/apache/velocity/velocity-tools/2.0/velocity-tools-2.0.jar
[windows-jdk10-m3.5.x_build] [INFO] Downloading: https://repo.maven.apache.org/maven2/commons-beanutils/commons-beanutils/1.7.0/commons-beanutils-1.7.0.jar
[windows-jdk10-m3.5.x_build] [INFO] Downloading: https://repo.maven.apache.org/maven2/commons-digester/commons-digester/1.8/commons-digester-1.8.jar
[windows-jdk10-m3.5.x_build] [INFO] Downloaded: https://repo.maven.apache.org/maven2/org/apache/maven/doxia/doxia-site-renderer/1.6/doxia-site-renderer-1.6.jar
(56 kB at 196 kB/s)
[windows-jdk10-m3.5.x_build] [INFO] Downloading: https://repo.maven.apache.org/maven2/commons-chain/commons-chain/1.1/commons-chain-1.1.jar
[windows-jdk10-m3.5.x_build] [INFO] Downloading: https://repo.maven.apache.org/maven2/commons-validator/commons-validator/1.3.1/commons-validator-1.3.1.jar
[windows-jdk10-m3.5.x_build] [INFO] Downloading: https://repo.maven.apache.org/maven2/dom4j/dom4j/1.1/dom4j-1.1.jar
[windows-jdk10-m3.5.x_build] [INFO] Downloading: https://repo.maven.apache.org/maven2/sslext/sslext/1.2-0/sslext-1.2-0.jar
[windows-jdk10-m3.5.x_build] [INFO] Downloading: https://repo.maven.apache.org/maven2/org/apache/struts/struts-core/1.3.8/struts-core-1.3.8.jar
[windows-jdk10-m3.5.x_build] [INFO] Downloading: https://repo.maven.apache.org/maven2/antlr/antlr/2.7.2/antlr-2.7.2.jar
[windows-jdk10-m3.5.x_build] [INFO] Downloading: https://repo.maven.apache.org/maven2/org/apache/struts/struts-taglib/1.3.8/struts-taglib-1.3.8.jar
[windows-jdk10-m3.5.x_build] [INFO] Downloading: https://repo.maven.apache.org/maven2/org/apache/struts/struts-tiles/1.3.8/struts-tiles-1.3.8.jar
[windows-jdk10-m3.5.x_build] [INFO] Downloading: https://repo.maven.apache.org/maven2/org/apache/maven/reporting/maven-reporting-api/3.0/maven-reporting-api-3.0.jar
[windows-jdk10-m3.5.x_build] [INFO] Downloading: https://repo.maven.apache.org/maven2/org/codehaus/plexus/plexus-utils/3.0.21/plexus-utils-3.0.21.jar
[windows-jdk10-m3.5.x_build] [INFO] ------------------------------------------------------------------------
[windows-jdk10-m3.5.x_build] [INFO] BUILD FAILURE
[windows-jdk10-m3.5.x_build] [INFO] ------------------------------------------------------------------------
[windows-jdk10-m3.5.x_build] [INFO] Total time: 11.687 s
[windows-jdk10-m3.5.x_build] [INFO] Finished at: 2018-07-19T12:04:13Z
[windows-jdk10-m3.5.x_build] [INFO] Final Memory: 17M/67M
[windows-jdk10-m3.5.x_build] [INFO] ------------------------------------------------------------------------
[windows-jdk10-m3.5.x_build] [INFO] [jenkins-event-spy] Generated F:\jenkins\jenkins-slave\workspace\box_maven-ant-plugin_master-N743QKOWXTZ36LZCK2YK3A6N4ZY3UG7X5RV3MH7PEH646A2IMDHA@2@tmp\withMavenf80e6314\maven-spy-20180719-120401-8141119803870019304157.log
[windows-jdk10-m3.5.x_build] [ERROR] Failed to execute goal org.apache.rat:apache-rat-plugin:0.12:check
(rat-check) on project maven-ant-plugin: Execution rat-check of goal org.apache.rat:apache-rat-plugin:0.12:check
failed: Plugin org.apache.rat:apache-rat-plugin:0.12 or one of its dependencies could not
be resolved: The following artifacts could not be resolved: org.apache.maven.doxia:doxia-module-fml:jar:1.6,
org.codehaus.plexus:plexus-velocity:jar:1.1.7, org.apache.velocity:velocity:jar:1.5, oro:oro:jar:2.0.8,
org.apache.velocity:velocity-tools:jar:2.0, commons-beanutils:commons-beanutils:jar:1.7.0,
commons-digester:commons-digester:jar:1.8, commons-chain:commons-chain:jar:1.1, commons-validator:commons-validator:jar:1.3.1,
dom4j:dom4j:jar:1.1, sslext:sslext:jar:1.2-0, org.apache.struts:struts-core:jar:1.3.8, antlr:antlr:jar:2.7.2,
org.apache.struts:struts-taglib:jar:1.3.8, org.apache.struts:struts-tiles:jar:1.3.8, org.apache.maven.reporting:maven-reporting-api:jar:3.0,
org.codehaus.plexus:plexus-utils:jar:3.0.21: Could not transfer artifact org.apache.maven.doxia:doxia-module-fml:jar:1.6
from/to central (https://repo.maven.apache.org/maven2): GET request of: org/apache/maven/doxia/doxia-module-fml/1.6/doxia-module-fml-1.6.jar
from central failed: There is not enough space on the disk -> [Help 1]
[windows-jdk10-m3.5.x_build] [ERROR] 
[windows-jdk10-m3.5.x_build] [ERROR] To see the full stack trace of the errors, re-run Maven
with the -e switch.
[windows-jdk10-m3.5.x_build] [ERROR] Re-run Maven using the -X switch to enable full debug
logging.
[windows-jdk10-m3.5.x_build] [ERROR] 
[windows-jdk10-m3.5.x_build] [ERROR] For more information about the errors and possible solutions,
please read the following articles:
[windows-jdk10-m3.5.x_build] [ERROR] [Help 1] http://cwiki.apache.org/confluence/display/MAVEN/PluginResolutionException
[Pipeline] [windows-jdk10-m3.5.x_build] }
[Pipeline] [windows-jdk10-m3.5.x_build] // dir
[Pipeline] [windows-jdk10-m3.5.x_build] }
[windows-jdk10-m3.5.x_build] ERROR: [withMaven] WARNING Exception parsing the logs generated
by the Jenkins Maven Event Spy f:\jenkins\jenkins-slave\workspace\box_maven-ant-plugin_master-N743QKOWXTZ36LZCK2YK3A6N4ZY3UG7X5RV3MH7PEH646A2IMDHA@2@tmp\withMavenf80e6314\maven-spy-20180719-120401-8141119803870019304157.log,
ignore file.  Please report a bug associated for the component 'pipeline-maven-plugin' at
https://issues.jenkins-ci.org 
[windows-jdk10-m3.5.x_build] ERROR: org.xml.sax.SAXParseException; lineNumber: 416; columnNumber:
62; The element type "addDefaultLicenseMatchers" must be terminated by the matching end-tag
"</addDefaultLicenseMatchers>".
[Pipeline] [windows-jdk10-m3.5.x_build] // withMaven
[Pipeline] [windows-jdk10-m3.5.x_build] cleanWs
[windows-jdk10-m3.5.x_build] [WS-CLEANUP] Deleting project workspace...[WS-CLEANUP] done
[Pipeline] [windows-jdk10-m3.5.x_build] }
[Pipeline] [windows-jdk10-m3.5.x_build] // stage
[Pipeline] [windows-jdk10-m3.5.x_build] }
[Pipeline] [windows-jdk10-m3.5.x_build] // node
[Pipeline] [windows-jdk10-m3.5.x_build] }
[windows-jdk10-m3.5.x_build] Failed in branch windows-jdk10-m3.5.x_build
[windows-jdk8-m3.5.x_build] [INFO]           javadoc-it\pom.xml ...............................
SUCCESS (9.2 s)
[windows-jdk8-m3.5.x_build] [INFO] Building: plugin-it\pom.xml
[windows-jdk8-m3.5.x_build] [INFO] run post-build script verify.bsh
[windows-jdk8-m3.5.x_build] [INFO]           plugin-it\pom.xml ................................
SUCCESS (7.0 s)
[windows-jdk8-m3.5.x_build] [INFO] Building: plugin-mngt-config\pom.xml
[windows-jdk8-m3.5.x_build] [INFO] run post-build script verify.bsh
[windows-jdk8-m3.5.x_build] [INFO]           plugin-mngt-config\pom.xml .......................
SUCCESS (5.7 s)
[windows-jdk8-m3.5.x_build] [INFO] Building: plugin-mngt-config-only\pom.xml
[windows-jdk8-m3.5.x_build] [INFO] run post-build script verify.bsh
[windows-jdk8-m3.5.x_build] [INFO]           plugin-mngt-config-only\pom.xml ..................
SUCCESS (4.5 s)
[windows-jdk8-m3.5.x_build] [INFO] Building: relative-path-it\pom.xml
[windows-jdk8-m3.5.x_build] [INFO] run post-build script verify.bsh
[windows-jdk8-m3.5.x_build] [INFO]           relative-path-it\pom.xml .........................
SUCCESS (4.8 s)
[windows-jdk8-m3.5.x_build] [INFO] Building: single-test-it\pom.xml
[windows-jdk8-m3.5.x_build] [INFO] run post-build script verify.bsh
[windows-jdk8-m3.5.x_build] [INFO]           single-test-it\pom.xml ...........................
SUCCESS (8.0 s)
[windows-jdk8-m3.5.x_build] [INFO] Building: skip-missing-junit-it\pom.xml
[windows-jdk8-m3.5.x_build] [INFO] run post-build script verify.bsh
[windows-jdk8-m3.5.x_build] [INFO]           skip-missing-junit-it\pom.xml ....................
SUCCESS (4.8 s)
[windows-jdk8-m3.5.x_build] [INFO] Building: skip-test-compilation-it\pom.xml
[windows-jdk8-m3.5.x_build] [INFO] run post-build script verify.bsh
[windows-jdk8-m3.5.x_build] [INFO]           skip-test-compilation-it\pom.xml .................
SUCCESS (4.9 s)
[windows-jdk8-m3.5.x_build] [INFO] Building: skip-test-execution-it\pom.xml
[windows-jdk8-m3.5.x_build] [INFO] run post-build script verify.bsh
[windows-jdk8-m3.5.x_build] [INFO]           skip-test-execution-it\pom.xml ...................
SUCCESS (4.6 s)
[windows-jdk8-m3.5.x_build] [INFO] Building: system-scope-dep\pom.xml
[windows-jdk8-m3.5.x_build] [INFO]           system-scope-dep\pom.xml .........................
SUCCESS (5.1 s)
[windows-jdk8-m3.5.x_build] [INFO] Building: test-custom-selector-it\pom.xml
[windows-jdk8-m3.5.x_build] [INFO] run post-build script verify.bsh
[windows-jdk8-m3.5.x_build] [INFO]           test-custom-selector-it\pom.xml ..................
SUCCESS (7.6 s)
[windows-jdk8-m3.5.x_build] [INFO] Building: test-default-selector-it\pom.xml
[windows-jdk8-m3.5.x_build] [INFO] run post-build script verify.bsh
[windows-jdk8-m3.5.x_build] [INFO]           test-default-selector-it\pom.xml .................
SUCCESS (8.1 s)
[windows-jdk8-m3.5.x_build] [INFO] Building: webapp-it\pom.xml
[windows-jdk8-m3.5.x_build] [INFO] run post-build script verify.bsh
[windows-jdk8-m3.5.x_build] [INFO]           webapp-it\pom.xml ................................
SUCCESS (7.9 s)
[windows-jdk8-m3.5.x_build] [INFO] 
[windows-jdk8-m3.5.x_build] [INFO] --- maven-checkstyle-plugin:3.0.0:check (checkstyle-check)
@ maven-ant-plugin ---
[windows-jdk8-m3.5.x_build] [INFO] Downloading: https://repo.maven.apache.org/maven2/org/apache/maven/shared/maven-shared-resources/2/maven-shared-resources-2.pom
[windows-jdk8-m3.5.x_build] [INFO] Downloaded: https://repo.maven.apache.org/maven2/org/apache/maven/shared/maven-shared-resources/2/maven-shared-resources-2.pom
(3.0 kB at 328 kB/s)
[windows-jdk8-m3.5.x_build] [INFO] Downloading: https://repo.maven.apache.org/maven2/org/codehaus/plexus/plexus-utils/3.0.10/plexus-utils-3.0.10.pom
[windows-jdk8-m3.5.x_build] [INFO] Downloaded: https://repo.maven.apache.org/maven2/org/codehaus/plexus/plexus-utils/3.0.10/plexus-utils-3.0.10.pom
(3.1 kB at 449 kB/s)
[windows-jdk8-m3.5.x_build] [INFO] Downloading: https://repo.maven.apache.org/maven2/org/codehaus/plexus/plexus/3.3/plexus-3.3.pom
[windows-jdk8-m3.5.x_build] [INFO] Downloaded: https://repo.maven.apache.org/maven2/org/codehaus/plexus/plexus/3.3/plexus-3.3.pom
(20 kB at 2.5 MB/s)
[windows-jdk8-m3.5.x_build] [INFO] Downloading: https://repo.maven.apache.org/maven2/org/apache/maven/doxia/doxia-integration-tools/1.6/doxia-integration-tools-1.6.pom
[windows-jdk8-m3.5.x_build] [INFO] Downloaded: https://repo.maven.apache.org/maven2/org/apache/maven/doxia/doxia-integration-tools/1.6/doxia-integration-tools-1.6.pom
(7.0 kB at 773 kB/s)
[windows-jdk8-m3.5.x_build] [INFO] Downloading: https://repo.maven.apache.org/maven2/org/apache/maven/doxia/doxia-tools/3/doxia-tools-3.pom
[windows-jdk8-m3.5.x_build] [INFO] Downloaded: https://repo.maven.apache.org/maven2/org/apache/maven/doxia/doxia-tools/3/doxia-tools-3.pom
(9.9 kB at 1.2 MB/s)
[windows-jdk8-m3.5.x_build] [INFO] Downloading: https://repo.maven.apache.org/maven2/org/codehaus/plexus/plexus-resources/1.1.0/plexus-resources-1.1.0.pom
[windows-jdk8-m3.5.x_build] [INFO] Downloaded: https://repo.maven.apache.org/maven2/org/codehaus/plexus/plexus-resources/1.1.0/plexus-resources-1.1.0.pom
(3.2 kB at 353 kB/s)
[windows-jdk8-m3.5.x_build] [INFO] Downloading: https://repo.maven.apache.org/maven2/com/puppycrawl/tools/checkstyle/6.18/checkstyle-6.18.pom
[windows-jdk8-m3.5.x_build] [INFO] Downloaded: https://repo.maven.apache.org/maven2/com/puppycrawl/tools/checkstyle/6.18/checkstyle-6.18.pom
(71 kB at 4.2 MB/s)
[windows-jdk8-m3.5.x_build] [INFO] Downloading: https://repo.maven.apache.org/maven2/antlr/antlr/2.7.7/antlr-2.7.7.pom
[windows-jdk8-m3.5.x_build] [INFO] Downloaded: https://repo.maven.apache.org/maven2/antlr/antlr/2.7.7/antlr-2.7.7.pom
(632 B at 90 kB/s)
[windows-jdk8-m3.5.x_build] [INFO] Downloading: https://repo.maven.apache.org/maven2/org/antlr/antlr4-runtime/4.5.3/antlr4-runtime-4.5.3.pom
[windows-jdk8-m3.5.x_build] [INFO] Downloaded: https://repo.maven.apache.org/maven2/org/antlr/antlr4-runtime/4.5.3/antlr4-runtime-4.5.3.pom
(2.3 kB at 289 kB/s)
[windows-jdk8-m3.5.x_build] [INFO] Downloading: https://repo.maven.apache.org/maven2/org/antlr/antlr4-master/4.5.3/antlr4-master-4.5.3.pom
[windows-jdk8-m3.5.x_build] [INFO] Downloaded: https://repo.maven.apache.org/maven2/org/antlr/antlr4-master/4.5.3/antlr4-master-4.5.3.pom
(3.7 kB at 409 kB/s)
[windows-jdk8-m3.5.x_build] [INFO] Downloading: https://repo.maven.apache.org/maven2/commons-beanutils/commons-beanutils/1.9.2/commons-beanutils-1.9.2.pom
[windows-jdk8-m3.5.x_build] [INFO] Downloaded: https://repo.maven.apache.org/maven2/commons-beanutils/commons-beanutils/1.9.2/commons-beanutils-1.9.2.pom
(14 kB at 1.8 MB/s)
[windows-jdk8-m3.5.x_build] [INFO] Downloading: https://repo.maven.apache.org/maven2/org/apache/commons/commons-parent/33/commons-parent-33.pom
[windows-jdk8-m3.5.x_build] [INFO] Downloaded: https://repo.maven.apache.org/maven2/org/apache/commons/commons-parent/33/commons-parent-33.pom
(53 kB at 4.8 MB/s)
[windows-jdk8-m3.5.x_build] [INFO] Downloading: https://repo.maven.apache.org/maven2/commons-cli/commons-cli/1.3.1/commons-cli-1.3.1.pom
[windows-jdk8-m3.5.x_build] [INFO] Downloaded: https://repo.maven.apache.org/maven2/commons-cli/commons-cli/1.3.1/commons-cli-1.3.1.pom
(10 kB at 1.5 MB/s)
[windows-jdk8-m3.5.x_build] [INFO] Downloading: https://repo.maven.apache.org/maven2/com/google/guava/guava/19.0/guava-19.0.pom
[windows-jdk8-m3.5.x_build] [INFO] Downloaded: https://repo.maven.apache.org/maven2/com/google/guava/guava/19.0/guava-19.0.pom
(6.8 kB at 849 kB/s)
[windows-jdk8-m3.5.x_build] [INFO] Downloading: https://repo.maven.apache.org/maven2/com/google/guava/guava-parent/19.0/guava-parent-19.0.pom
[windows-jdk8-m3.5.x_build] [INFO] Downloaded: https://repo.maven.apache.org/maven2/com/google/guava/guava-parent/19.0/guava-parent-19.0.pom
(9.9 kB at 1.4 MB/s)
[windows-jdk8-m3.5.x_build] [INFO] Downloading: https://repo.maven.apache.org/maven2/org/sonatype/oss/oss-parent/7/oss-parent-7.pom
[windows-jdk8-m3.5.x_build] [INFO] Downloaded: https://repo.maven.apache.org/maven2/org/sonatype/oss/oss-parent/7/oss-parent-7.pom
(4.8 kB at 804 kB/s)
[windows-jdk8-m3.5.x_build] [INFO] Downloading: https://repo.maven.apache.org/maven2/org/apache/maven/shared/maven-shared-resources/2/maven-shared-resources-2.jar
[windows-jdk8-m3.5.x_build] [INFO] Downloading: https://repo.maven.apache.org/maven2/commons-digester/commons-digester/1.6/commons-digester-1.6.jar
[windows-jdk8-m3.5.x_build] [INFO] Downloading: https://repo.maven.apache.org/maven2/org/apache/maven/doxia/doxia-core/1.2/doxia-core-1.2.jar
[windows-jdk8-m3.5.x_build] [INFO] Downloading: https://repo.maven.apache.org/maven2/org/apache/maven/doxia/doxia-integration-tools/1.6/doxia-integration-tools-1.6.jar
[windows-jdk8-m3.5.x_build] [INFO] Downloading: https://repo.maven.apache.org/maven2/commons-logging/commons-logging/1.0.4/commons-logging-1.0.4.jar
[windows-jdk8-m3.5.x_build] [INFO] Downloaded: https://repo.maven.apache.org/maven2/commons-digester/commons-digester/1.6/commons-digester-1.6.jar
(168 kB at 5.3 MB/s)
[windows-jdk8-m3.5.x_build] [INFO] Downloading: https://repo.maven.apache.org/maven2/commons-io/commons-io/1.4/commons-io-1.4.jar
[windows-jdk8-m3.5.x_build] [INFO] Downloaded: https://repo.maven.apache.org/maven2/org/apache/maven/doxia/doxia-core/1.2/doxia-core-1.2.jar
(154 kB at 4.8 MB/s)
[windows-jdk8-m3.5.x_build] [INFO] Downloading: https://repo.maven.apache.org/maven2/org/codehaus/plexus/plexus-resources/1.1.0/plexus-resources-1.1.0.jar
[windows-jdk8-m3.5.x_build] [INFO] Downloaded: https://repo.maven.apache.org/maven2/commons-logging/commons-logging/1.0.4/commons-logging-1.0.4.jar
(38 kB at 1.1 MB/s)
[windows-jdk8-m3.5.x_build] [INFO] Downloading: https://repo.maven.apache.org/maven2/com/puppycrawl/tools/checkstyle/6.18/checkstyle-6.18.jar
[windows-jdk8-m3.5.x_build] [INFO] Downloaded: https://repo.maven.apache.org/maven2/org/apache/maven/shared/maven-shared-resources/2/maven-shared-resources-2.jar
(13 kB at 344 kB/s)
[windows-jdk8-m3.5.x_build] [INFO] Downloading: https://repo.maven.apache.org/maven2/antlr/antlr/2.7.7/antlr-2.7.7.jar
[windows-jdk8-m3.5.x_build] [INFO] Downloaded: https://repo.maven.apache.org/maven2/org/apache/maven/doxia/doxia-integration-tools/1.6/doxia-integration-tools-1.6.jar
(45 kB at 1.1 MB/s)
[windows-jdk8-m3.5.x_build] [INFO] Downloading: https://repo.maven.apache.org/maven2/org/antlr/antlr4-runtime/4.5.3/antlr4-runtime-4.5.3.jar
[windows-jdk8-m3.5.x_build] [INFO] Downloaded: https://repo.maven.apache.org/maven2/org/codehaus/plexus/plexus-resources/1.1.0/plexus-resources-1.1.0.jar
(23 kB at 422 kB/s)
[windows-jdk8-m3.5.x_build] [INFO] Downloading: https://repo.maven.apache.org/maven2/commons-beanutils/commons-beanutils/1.9.2/commons-beanutils-1.9.2.jar
[windows-jdk8-m3.5.x_build] [INFO] Downloaded: https://repo.maven.apache.org/maven2/commons-io/commons-io/1.4/commons-io-1.4.jar
(109 kB at 1.7 MB/s)
[windows-jdk8-m3.5.x_build] [INFO] Downloading: https://repo.maven.apache.org/maven2/commons-cli/commons-cli/1.3.1/commons-cli-1.3.1.jar
[windows-jdk8-m3.5.x_build] [INFO] Downloaded: https://repo.maven.apache.org/maven2/commons-beanutils/commons-beanutils/1.9.2/commons-beanutils-1.9.2.jar
(234 kB at 2.7 MB/s)
[windows-jdk8-m3.5.x_build] [INFO] Downloading: https://repo.maven.apache.org/maven2/com/google/guava/guava/19.0/guava-19.0.jar
[windows-jdk8-m3.5.x_build] [INFO] Downloaded: https://repo.maven.apache.org/maven2/org/antlr/antlr4-runtime/4.5.3/antlr4-runtime-4.5.3.jar
(302 kB at 3.4 MB/s)
[windows-jdk8-m3.5.x_build] [INFO] Downloading: https://repo.maven.apache.org/maven2/commons-lang/commons-lang/2.1/commons-lang-2.1.jar
[windows-jdk8-m3.5.x_build] [INFO] Downloaded: https://repo.maven.apache.org/maven2/antlr/antlr/2.7.7/antlr-2.7.7.jar
(445 kB at 4.8 MB/s)
[windows-jdk8-m3.5.x_build] [INFO] Downloaded: https://repo.maven.apache.org/maven2/commons-cli/commons-cli/1.3.1/commons-cli-1.3.1.jar
(53 kB at 465 kB/s)
[windows-jdk8-m3.5.x_build] [INFO] Downloaded: https://repo.maven.apache.org/maven2/commons-lang/commons-lang/2.1/commons-lang-2.1.jar
(208 kB at 1.8 MB/s)
[windows-jdk8-m3.5.x_build] [INFO] Downloaded: https://repo.maven.apache.org/maven2/com/puppycrawl/tools/checkstyle/6.18/checkstyle-6.18.jar
(1.2 MB at 8.7 MB/s)
[windows-jdk8-m3.5.x_build] [INFO] Downloaded: https://repo.maven.apache.org/maven2/com/google/guava/guava/19.0/guava-19.0.jar
(2.3 MB at 10 MB/s)
[windows-jdk8-m3.5.x_build] [INFO] There are 4 errors reported by Checkstyle 6.18 with config/maven_checks.xml
ruleset.
[windows-jdk8-m3.5.x_build] [INFO] Ignored 4 errors, 0 violation remaining.
[windows-jdk8-m3.5.x_build] [INFO] 
[windows-jdk8-m3.5.x_build] [INFO] --- maven-invoker-plugin:3.1.0:verify (integration-test)
@ maven-ant-plugin ---
[windows-jdk8-m3.5.x_build] [INFO] -------------------------------------------------
[windows-jdk8-m3.5.x_build] [INFO] Build Summary:
[windows-jdk8-m3.5.x_build] [INFO]   Passed: 17, Failed: 1, Errors: 0, Skipped: 0
[windows-jdk8-m3.5.x_build] [INFO] -------------------------------------------------
[windows-jdk8-m3.5.x_build] [ERROR] The following builds failed:
[windows-jdk8-m3.5.x_build] [ERROR] *  ear-it\pom.xml
[windows-jdk8-m3.5.x_build] [INFO] -------------------------------------------------
[windows-jdk8-m3.5.x_build] [INFO] ------------------------------------------------------------------------
[windows-jdk8-m3.5.x_build] [INFO] BUILD FAILURE
[windows-jdk8-m3.5.x_build] [INFO] ------------------------------------------------------------------------
[windows-jdk8-m3.5.x_build] [INFO] Total time: 02:29 min
[windows-jdk8-m3.5.x_build] [INFO] Finished at: 2018-07-19T12:05:31Z
[windows-jdk8-m3.5.x_build] [INFO] Final Memory: 46M/567M
[windows-jdk8-m3.5.x_build] [INFO] ------------------------------------------------------------------------
[windows-jdk8-m3.5.x_build] [INFO] [jenkins-event-spy] Generated F:\jenkins\jenkins-slave\workspace\box_maven-ant-plugin_master-N743QKOWXTZ36LZCK2YK3A6N4ZY3UG7X5RV3MH7PEH646A2IMDHA@tmp\withMaven1b4703b8\maven-spy-20180719-120301-981186404487516550936.log
[windows-jdk8-m3.5.x_build] [ERROR] Failed to execute goal org.apache.maven.plugins:maven-invoker-plugin:3.1.0:verify
(integration-test) on project maven-ant-plugin: 1 build failed. See console output above for
details. -> [Help 1]
[windows-jdk8-m3.5.x_build] [ERROR] 
[windows-jdk8-m3.5.x_build] [ERROR] To see the full stack trace of the errors, re-run Maven
with the -e switch.
[windows-jdk8-m3.5.x_build] [ERROR] Re-run Maven using the -X switch to enable full debug
logging.
[windows-jdk8-m3.5.x_build] [ERROR] 
[windows-jdk8-m3.5.x_build] [ERROR] For more information about the errors and possible solutions,
please read the following articles:
[windows-jdk8-m3.5.x_build] [ERROR] [Help 1] http://cwiki.apache.org/confluence/display/MAVEN/MojoFailureException
[windows-jdk8-m3.5.x_build] Picked up JAVA_TOOL_OPTIONS: -Dmaven.ext.class.path="f:\jenkins\jenkins-slave\workspace\box_maven-ant-plugin_master-N743QKOWXTZ36LZCK2YK3A6N4ZY3UG7X5RV3MH7PEH646A2IMDHA@tmp\withMaven1b4703b8\pipeline-maven-spy.jar"
-Dorg.jenkinsci.plugins.pipeline.maven.reportsFolder="f:\jenkins\jenkins-slave\workspace\box_maven-ant-plugin_master-N743QKOWXTZ36LZCK2YK3A6N4ZY3UG7X5RV3MH7PEH646A2IMDHA@tmp\withMaven1b4703b8"

[Pipeline] [windows-jdk8-m3.5.x_build] }
[Pipeline] [windows-jdk8-m3.5.x_build] // dir
[Pipeline] [windows-jdk8-m3.5.x_build] }
[windows-jdk8-m3.5.x_build] [withMaven] invokerPublisher - Archive invoker results for Maven
artifact MavenArtifact{org.apache.maven.plugins:maven-ant-plugin::2.5-SNAPSHOT(version: 2.5-SNAPSHOT,
snapshot:false) } generated by PluginInvocation{org.apache.maven.plugins:maven-invoker-plugin:3.1.0@integration-test
 integration-test}: windows-jdk8-m3.5.x_build\target\invoker-reports\*.xml
[windows-jdk8-m3.5.x_build] performing MavenInvokerRecorder, reportsFilenamePattern:'**/windows-jdk8-m3.5.x_build\target\invoker-reports/BUILD*.xml',
invokerBuildDir:'**/windows-jdk8-m3.5.x_build\target\it'
[windows-jdk8-m3.5.x_build] Found reports:[f:\jenkins\jenkins-slave\workspace\box_maven-ant-plugin_master-N743QKOWXTZ36LZCK2YK3A6N4ZY3UG7X5RV3MH7PEH646A2IMDHA\windows-jdk8-m3.5.x_build\target\invoker-reports\BUILD-clean-custom-files.xml,
f:\jenkins\jenkins-slave\workspace\box_maven-ant-plugin_master-N743QKOWXTZ36LZCK2YK3A6N4ZY3UG7X5RV3MH7PEH646A2IMDHA\windows-jdk8-m3.5.x_build\target\invoker-reports\BUILD-clean.xml,
f:\jenkins\jenkins-slave\workspace\box_maven-ant-plugin_master-N743QKOWXTZ36LZCK2YK3A6N4ZY3UG7X5RV3MH7PEH646A2IMDHA\windows-jdk8-m3.5.x_build\target\invoker-reports\BUILD-ear-it.xml,
f:\jenkins\jenkins-slave\workspace\box_maven-ant-plugin_master-N743QKOWXTZ36LZCK2YK3A6N4ZY3UG7X5RV3MH7PEH646A2IMDHA\windows-jdk8-m3.5.x_build\target\invoker-reports\BUILD-encoding-it.xml,
f:\jenkins\jenkins-slave\workspace\box_maven-ant-plugin_master-N743QKOWXTZ36LZCK2YK3A6N4ZY3UG7X5RV3MH7PEH646A2IMDHA\windows-jdk8-m3.5.x_build\target\invoker-reports\BUILD-file-repo-it.xml,
f:\jenkins\jenkins-slave\workspace\box_maven-ant-plugin_master-N743QKOWXTZ36LZCK2YK3A6N4ZY3UG7X5RV3MH7PEH646A2IMDHA\windows-jdk8-m3.5.x_build\target\invoker-reports\BUILD-javadoc-it.xml,
f:\jenkins\jenkins-slave\workspace\box_maven-ant-plugin_master-N743QKOWXTZ36LZCK2YK3A6N4ZY3UG7X5RV3MH7PEH646A2IMDHA\windows-jdk8-m3.5.x_build\target\invoker-reports\BUILD-plugin-it.xml,
f:\jenkins\jenkins-slave\workspace\box_maven-ant-plugin_master-N743QKOWXTZ36LZCK2YK3A6N4ZY3UG7X5RV3MH7PEH646A2IMDHA\windows-jdk8-m3.5.x_build\target\invoker-reports\BUILD-plugin-mngt-config-only.xml,
f:\jenkins\jenkins-slave\workspace\box_maven-ant-plugin_master-N743QKOWXTZ36LZCK2YK3A6N4ZY3UG7X5RV3MH7PEH646A2IMDHA\windows-jdk8-m3.5.x_build\target\invoker-reports\BUILD-plugin-mngt-config.xml,
f:\jenkins\jenkins-slave\workspace\box_maven-ant-plugin_master-N743QKOWXTZ36LZCK2YK3A6N4ZY3UG7X5RV3MH7PEH646A2IMDHA\windows-jdk8-m3.5.x_build\target\invoker-reports\BUILD-relative-path-it.xml,
f:\jenkins\jenkins-slave\workspace\box_maven-ant-plugin_master-N743QKOWXTZ36LZCK2YK3A6N4ZY3UG7X5RV3MH7PEH646A2IMDHA\windows-jdk8-m3.5.x_build\target\invoker-reports\BUILD-single-test-it.xml,
f:\jenkins\jenkins-slave\workspace\box_maven-ant-plugin_master-N743QKOWXTZ36LZCK2YK3A6N4ZY3UG7X5RV3MH7PEH646A2IMDHA\windows-jdk8-m3.5.x_build\target\invoker-reports\BUILD-skip-missing-junit-it.xml,
f:\jenkins\jenkins-slave\workspace\box_maven-ant-plugin_master-N743QKOWXTZ36LZCK2YK3A6N4ZY3UG7X5RV3MH7PEH646A2IMDHA\windows-jdk8-m3.5.x_build\target\invoker-reports\BUILD-skip-test-compilation-it.xml,
f:\jenkins\jenkins-slave\workspace\box_maven-ant-plugin_master-N743QKOWXTZ36LZCK2YK3A6N4ZY3UG7X5RV3MH7PEH646A2IMDHA\windows-jdk8-m3.5.x_build\target\invoker-reports\BUILD-skip-test-execution-it.xml,
f:\jenkins\jenkins-slave\workspace\box_maven-ant-plugin_master-N743QKOWXTZ36LZCK2YK3A6N4ZY3UG7X5RV3MH7PEH646A2IMDHA\windows-jdk8-m3.5.x_build\target\invoker-reports\BUILD-system-scope-dep.xml,
f:\jenkins\jenkins-slave\workspace\box_maven-ant-plugin_master-N743QKOWXTZ36LZCK2YK3A6N4ZY3UG7X5RV3MH7PEH646A2IMDHA\windows-jdk8-m3.5.x_build\target\invoker-reports\BUILD-test-custom-selector-it.xml,
f:\jenkins\jenkins-slave\workspace\box_maven-ant-plugin_master-N743QKOWXTZ36LZCK2YK3A6N4ZY3UG7X5RV3MH7PEH646A2IMDHA\windows-jdk8-m3.5.x_build\target\invoker-reports\BUILD-test-default-selector-it.xml,
f:\jenkins\jenkins-slave\workspace\box_maven-ant-plugin_master-N743QKOWXTZ36LZCK2YK3A6N4ZY3UG7X5RV3MH7PEH646A2IMDHA\windows-jdk8-m3.5.x_build\target\invoker-reports\BUILD-webapp-it.xml]
[windows-jdk8-m3.5.x_build] Found logs:[f:\jenkins\jenkins-slave\workspace\box_maven-ant-plugin_master-N743QKOWXTZ36LZCK2YK3A6N4ZY3UG7X5RV3MH7PEH646A2IMDHA\windows-jdk8-m3.5.x_build\target\it\clean-custom-files\build.log,
f:\jenkins\jenkins-slave\workspace\box_maven-ant-plugin_master-N743QKOWXTZ36LZCK2YK3A6N4ZY3UG7X5RV3MH7PEH646A2IMDHA\windows-jdk8-m3.5.x_build\target\it\clean\build.log,
f:\jenkins\jenkins-slave\workspace\box_maven-ant-plugin_master-N743QKOWXTZ36LZCK2YK3A6N4ZY3UG7X5RV3MH7PEH646A2IMDHA\windows-jdk8-m3.5.x_build\target\it\ear-it\build.log,
f:\jenkins\jenkins-slave\workspace\box_maven-ant-plugin_master-N743QKOWXTZ36LZCK2YK3A6N4ZY3UG7X5RV3MH7PEH646A2IMDHA\windows-jdk8-m3.5.x_build\target\it\encoding-it\build.log,
f:\jenkins\jenkins-slave\workspace\box_maven-ant-plugin_master-N743QKOWXTZ36LZCK2YK3A6N4ZY3UG7X5RV3MH7PEH646A2IMDHA\windows-jdk8-m3.5.x_build\target\it\file-repo-it\build.log,
f:\jenkins\jenkins-slave\workspace\box_maven-ant-plugin_master-N743QKOWXTZ36LZCK2YK3A6N4ZY3UG7X5RV3MH7PEH646A2IMDHA\windows-jdk8-m3.5.x_build\target\it\javadoc-it\build.log,
f:\jenkins\jenkins-slave\workspace\box_maven-ant-plugin_master-N743QKOWXTZ36LZCK2YK3A6N4ZY3UG7X5RV3MH7PEH646A2IMDHA\windows-jdk8-m3.5.x_build\target\it\plugin-it\build.log,
f:\jenkins\jenkins-slave\workspace\box_maven-ant-plugin_master-N743QKOWXTZ36LZCK2YK3A6N4ZY3UG7X5RV3MH7PEH646A2IMDHA\windows-jdk8-m3.5.x_build\target\it\plugin-mngt-config-only\build.log,
f:\jenkins\jenkins-slave\workspace\box_maven-ant-plugin_master-N743QKOWXTZ36LZCK2YK3A6N4ZY3UG7X5RV3MH7PEH646A2IMDHA\windows-jdk8-m3.5.x_build\target\it\plugin-mngt-config\build.log,
f:\jenkins\jenkins-slave\workspace\box_maven-ant-plugin_master-N743QKOWXTZ36LZCK2YK3A6N4ZY3UG7X5RV3MH7PEH646A2IMDHA\windows-jdk8-m3.5.x_build\target\it\relative-path-it\build.log,
f:\jenkins\jenkins-slave\workspace\box_maven-ant-plugin_master-N743QKOWXTZ36LZCK2YK3A6N4ZY3UG7X5RV3MH7PEH646A2IMDHA\windows-jdk8-m3.5.x_build\target\it\single-test-it\build.log,
f:\jenkins\jenkins-slave\workspace\box_maven-ant-plugin_master-N743QKOWXTZ36LZCK2YK3A6N4ZY3UG7X5RV3MH7PEH646A2IMDHA\windows-jdk8-m3.5.x_build\target\it\skip-missing-junit-it\build.log,
f:\jenkins\jenkins-slave\workspace\box_maven-ant-plugin_master-N743QKOWXTZ36LZCK2YK3A6N4ZY3UG7X5RV3MH7PEH646A2IMDHA\windows-jdk8-m3.5.x_build\target\it\skip-test-compilation-it\build.log,
f:\jenkins\jenkins-slave\workspace\box_maven-ant-plugin_master-N743QKOWXTZ36LZCK2YK3A6N4ZY3UG7X5RV3MH7PEH646A2IMDHA\windows-jdk8-m3.5.x_build\target\it\skip-test-execution-it\build.log,
f:\jenkins\jenkins-slave\workspace\box_maven-ant-plugin_master-N743QKOWXTZ36LZCK2YK3A6N4ZY3UG7X5RV3MH7PEH646A2IMDHA\windows-jdk8-m3.5.x_build\target\it\system-scope-dep\build.log,
f:\jenkins\jenkins-slave\workspace\box_maven-ant-plugin_master-N743QKOWXTZ36LZCK2YK3A6N4ZY3UG7X5RV3MH7PEH646A2IMDHA\windows-jdk8-m3.5.x_build\target\it\test-custom-selector-it\build.log,
f:\jenkins\jenkins-slave\workspace\box_maven-ant-plugin_master-N743QKOWXTZ36LZCK2YK3A6N4ZY3UG7X5RV3MH7PEH646A2IMDHA\windows-jdk8-m3.5.x_build\target\it\test-default-selector-it\build.log,
f:\jenkins\jenkins-slave\workspace\box_maven-ant-plugin_master-N743QKOWXTZ36LZCK2YK3A6N4ZY3UG7X5RV3MH7PEH646A2IMDHA\windows-jdk8-m3.5.x_build\target\it\webapp-it\build.log]
[windows-jdk8-m3.5.x_build] Finished parsing Maven Invoker results (found 18)
[windows-jdk8-m3.5.x_build] [withMaven] junitPublisher - Archive test results for Maven artifact
org.apache.maven.plugins:maven-ant-plugin:2.5-SNAPSHOT generated by maven-surefire-plugin:test
(default-test): windows-jdk8-m3.5.x_build\target\surefire-reports\*.xml
[windows-jdk8-m3.5.x_build] Recording test results
[windows-jdk8-m3.5.x_build] [withMaven] openTasksPublisher - Scan Tasks for Maven artifact
org.apache.maven.plugins:maven-ant-plugin:2.5-SNAPSHOT in source directory windows-jdk8-m3.5.x_build\src\main\java
[windows-jdk8-m3.5.x_build] [TASKS] Scanning folder 'f:\jenkins\jenkins-slave\workspace\box_maven-ant-plugin_master-N743QKOWXTZ36LZCK2YK3A6N4ZY3UG7X5RV3MH7PEH646A2IMDHA'
for files matching the pattern 'windows-jdk8-m3.5.x_build\src\main\java\**\*' - excludes:
null
[windows-jdk8-m3.5.x_build] [TASKS] Found 5 files to scan for tasks
[windows-jdk8-m3.5.x_build] [TASKS] Found 8 open tasks.
[windows-jdk8-m3.5.x_build] Skipping warnings blame since pipelines do not have an SCM link.%n
[windows-jdk8-m3.5.x_build] [TASKS] Computing warning deltas based on reference build #6
[Pipeline] [windows-jdk8-m3.5.x_build] // withMaven
[Pipeline] [windows-jdk8-m3.5.x_build] cleanWs
[windows-jdk8-m3.5.x_build] [WS-CLEANUP] Deleting project workspace...[WS-CLEANUP] done
[Pipeline] [windows-jdk8-m3.5.x_build] }
[Pipeline] [windows-jdk8-m3.5.x_build] // stage
[Pipeline] [windows-jdk8-m3.5.x_build] }
[Pipeline] [windows-jdk8-m3.5.x_build] // node
[Pipeline] [windows-jdk8-m3.5.x_build] }
[windows-jdk8-m3.5.x_build] Failed in branch windows-jdk8-m3.5.x_build
[Pipeline] // parallel
[Pipeline] stage
[Pipeline] { (Notifications)
[Pipeline] echo
Build result: FAILURE
[Pipeline] jiraIssueSelector
Mime
  • Unnamed multipart/mixed (inline, None, 0 bytes)
View raw message