maven-notifications mailing list archives

Site index · List index
Message view « Date » · « Thread »
Top « Date » · « Thread »
From Apache Jenkins Server <jenk...@builds.apache.org>
Subject Build failed in Jenkins: Maven TLP » maven-compiler-plugin » MCOMPILER-335 #6
Date Thu, 12 Jul 2018 19:55:49 GMT
See https://builds.apache.org/job/maven-box/job/maven-compiler-plugin/job/MCOMPILER-335/6/

No changes.

All tests passed

Build log:
[...truncated 4.09 MB...]
[linux-jdk10-m3.5.x_build] [INFO] Build Summary:
[linux-jdk10-m3.5.x_build] [INFO]   Passed: 50, Failed: 0, Errors: 0, Skipped: 2
[linux-jdk10-m3.5.x_build] [INFO] -------------------------------------------------
[linux-jdk10-m3.5.x_build] [INFO] ------------------------------------------------------------------------
[linux-jdk10-m3.5.x_build] [INFO] BUILD SUCCESS
[linux-jdk10-m3.5.x_build] [INFO] ------------------------------------------------------------------------
[linux-jdk10-m3.5.x_build] [INFO] Total time: 05:01 min
[linux-jdk10-m3.5.x_build] [INFO] Finished at: 2018-07-12T19:53:27Z
[linux-jdk10-m3.5.x_build] [INFO] Final Memory: 51M/256M
[linux-jdk10-m3.5.x_build] [INFO] ------------------------------------------------------------------------
[linux-jdk10-m3.5.x_build] [INFO] [jenkins-event-spy] Generated /home/jenkins/jenkins-slave/workspace/mpiler-plugin_MCOMPILER-335-VHQSXD2POT6OA2TVE7EHJ22XUOLAHEKCXK5ZPBJJH4NL5QODG5ZQ@tmp/withMavenb12cf708/maven-spy-20180712-194826-993920115056011050738.log
[windows-jdk10-m3.5.x_build] [INFO] run post-build script verify.groovy
[windows-jdk10-m3.5.x_build] [INFO]           MCOMPILER-192\pom.xml ............................ SUCCESS (6.8 s)
[windows-jdk10-m3.5.x_build] [INFO] Building: MCOMPILER-197\pom.xml
[windows-jdk10-m3.5.x_build] [INFO]           MCOMPILER-197\pom.xml ............................ SKIPPED due to JRE version
[windows-jdk10-m3.5.x_build] [INFO] Building: MCOMPILER-203-processorpath\pom.xml
[windows-jdk9-m3.5.x_build] [INFO] run post-build script verify.groovy
[windows-jdk9-m3.5.x_build] [INFO]           mcompiler-179\pom.xml ............................ SUCCESS (7.3 s)
[windows-jdk9-m3.5.x_build] [INFO] Building: mcompiler-182\pom.xml
[windows-jdk10-m3.5.x_build] [INFO]           MCOMPILER-203-processorpath\pom.xml .............. SUCCESS (17.6 s)
[windows-jdk10-m3.5.x_build] [INFO] Building: mcompiler-21_class-remove\pom.xml
[windows-jdk9-m3.5.x_build] [INFO] run post-build script verify.groovy
[windows-jdk9-m3.5.x_build] [INFO]           mcompiler-182\pom.xml ............................ SUCCESS (31.0 s)
[windows-jdk9-m3.5.x_build] [INFO] Building: MCOMPILER-190\pom.xml
[windows-jdk10-m3.5.x_build] [INFO] run post-build script verify.groovy
[windows-jdk10-m3.5.x_build] [INFO]           mcompiler-21_class-remove\pom.xml ................ SUCCESS (19.3 s)
[windows-jdk10-m3.5.x_build] [INFO] Building: mcompiler-21_methodname-change\pom.xml
[windows-jdk9-m3.5.x_build] [INFO]           MCOMPILER-190\pom.xml ............................ SUCCESS (8.7 s)
[windows-jdk9-m3.5.x_build] [INFO] Building: MCOMPILER-192\pom.xml
[windows-jdk9-m3.5.x_build] [INFO] run post-build script verify.groovy
[windows-jdk9-m3.5.x_build] [INFO]           MCOMPILER-192\pom.xml ............................ SUCCESS (7.9 s)
[windows-jdk9-m3.5.x_build] [INFO] Building: MCOMPILER-197\pom.xml
[windows-jdk9-m3.5.x_build] [INFO]           MCOMPILER-197\pom.xml ............................ SKIPPED due to JRE version
[windows-jdk9-m3.5.x_build] [INFO] Building: MCOMPILER-203-processorpath\pom.xml
[windows-jdk10-m3.5.x_build] [INFO] run post-build script verify.groovy
[windows-jdk10-m3.5.x_build] [INFO]           mcompiler-21_methodname-change\pom.xml ........... SUCCESS (20.5 s)
[windows-jdk10-m3.5.x_build] [INFO] Building: MCOMPILER-224\pom.xml
[Pipeline] [linux-jdk7-m3.3.x_build] }
[Pipeline] [linux-jdk7-m3.5.x_build] }
[Pipeline] [windows-jdk7-m3.2.x_build] }
[Pipeline] [windows-jdk7-m3.0.x_build] }
[Pipeline] [windows-jdk8-m3.5.x_build] }
[windows-jdk8-m3.5.x_build] [withMaven] artifactsPublisher - Archive artifact windows-jdk8-m3.5.x_build\pom.xml under org\apache\maven\plugins\maven-compiler-plugin\3.7.1-SNAPSHOT\maven-compiler-plugin-3.7.1-SNAPSHOT.pom
[windows-jdk8-m3.5.x_build] [withMaven] artifactsPublisher - Archive artifact windows-jdk8-m3.5.x_build\target\maven-compiler-plugin-3.7.1-SNAPSHOT.jar under org\apache\maven\plugins\maven-compiler-plugin\3.7.1-SNAPSHOT\maven-compiler-plugin-3.7.1-SNAPSHOT.jar
[windows-jdk8-m3.5.x_build] [Fast Archiver] No prior successful build to compare, so performing full copy of artifacts
[windows-jdk8-m3.5.x_build] [withMaven] invokerPublisher - Archive invoker results for Maven artifact MavenArtifact{org.apache.maven.plugins:maven-compiler-plugin::3.7.1-SNAPSHOT(version: 3.7.1-SNAPSHOT, snapshot:false) } generated by PluginInvocation{org.apache.maven.plugins:maven-invoker-plugin:3.0.1@integration-test  integration-test}: windows-jdk8-m3.5.x_build\target\invoker-reports\*.xml
[windows-jdk8-m3.5.x_build] performing MavenInvokerRecorder, reportsFilenamePattern:'**/windows-jdk8-m3.5.x_build\target\invoker-reports/BUILD*.xml', invokerBuildDir:'**/windows-jdk8-m3.5.x_build\target\it'
[windows-jdk8-m3.5.x_build] Found reports:[f:\jenkins\jenkins-slave\workspace\mpiler-plugin_MCOMPILER-335-VHQSXD2POT6OA2TVE7EHJ22XUOLAHEKCXK5ZPBJJH4NL5QODG5ZQ\windows-jdk8-m3.5.x_build\target\invoker-reports\BUILD-MCOMPILER-129.xml, f:\jenkins\jenkins-slave\workspace\mpiler-plugin_MCOMPILER-335-VHQSXD2POT6OA2TVE7EHJ22XUOLAHEKCXK5ZPBJJH4NL5QODG5ZQ\windows-jdk8-m3.5.x_build\target\invoker-reports\BUILD-MCOMPILER-157.xml, f:\jenkins\jenkins-slave\workspace\mpiler-plugin_MCOMPILER-335-VHQSXD2POT6OA2TVE7EHJ22XUOLAHEKCXK5ZPBJJH4NL5QODG5ZQ\windows-jdk8-m3.5.x_build\target\invoker-reports\BUILD-MCOMPILER-170.xml, f:\jenkins\jenkins-slave\workspace\mpiler-plugin_MCOMPILER-335-VHQSXD2POT6OA2TVE7EHJ22XUOLAHEKCXK5ZPBJJH4NL5QODG5ZQ\windows-jdk8-m3.5.x_build\target\invoker-reports\BUILD-MCOMPILER-190.xml, f:\jenkins\jenkins-slave\workspace\mpiler-plugin_MCOMPILER-335-VHQSXD2POT6OA2TVE7EHJ22XUOLAHEKCXK5ZPBJJH4NL5QODG5ZQ\windows-jdk8-m3.5.x_build\target\invoker-reports\BUILD-MCOMPILER-192.xml, f:\jenkins\jenkins-slave\workspace\mpiler-plugin_MCOMPILER-335-VHQSXD2POT6OA2TVE7EHJ22XUOLAHEKCXK5ZPBJJH4NL5QODG5ZQ\windows-jdk8-m3.5.x_build\target\invoker-reports\BUILD-MCOMPILER-197.xml, f:\jenkins\jenkins-slave\workspace\mpiler-plugin_MCOMPILER-335-VHQSXD2POT6OA2TVE7EHJ22XUOLAHEKCXK5ZPBJJH4NL5QODG5ZQ\windows-jdk8-m3.5.x_build\target\invoker-reports\BUILD-MCOMPILER-203-processorpath.xml, f:\jenkins\jenkins-slave\workspace\mpiler-plugin_MCOMPILER-335-VHQSXD2POT6OA2TVE7EHJ22XUOLAHEKCXK5ZPBJJH4NL5QODG5ZQ\windows-jdk8-m3.5.x_build\target\invoker-reports\BUILD-MCOMPILER-224.xml, f:\jenkins\jenkins-slave\workspace\mpiler-plugin_MCOMPILER-335-VHQSXD2POT6OA2TVE7EHJ22XUOLAHEKCXK5ZPBJJH4NL5QODG5ZQ\windows-jdk8-m3.5.x_build\target\invoker-reports\BUILD-MCOMPILER-228.xml, f:\jenkins\jenkins-slave\workspace\mpiler-plugin_MCOMPILER-335-VHQSXD2POT6OA2TVE7EHJ22XUOLAHEKCXK5ZPBJJH4NL5QODG5ZQ\windows-jdk8-m3.5.x_build\target\invoker-reports\BUILD-MCOMPILER-260_customArguments.xml, f:\jenkins\jenkins-slave\workspace\mpiler-plugin_MCOMPILER-335-VHQSXD2POT6OA2TVE7EHJ22XUOLAHEKCXK5ZPBJJH4NL5QODG5ZQ\windows-jdk8-m3.5.x_build\target\invoker-reports\BUILD-MCOMPILER-268_modulepath.xml, f:\jenkins\jenkins-slave\workspace\mpiler-plugin_MCOMPILER-335-VHQSXD2POT6OA2TVE7EHJ22XUOLAHEKCXK5ZPBJJH4NL5QODG5ZQ\windows-jdk8-m3.5.x_build\target\invoker-reports\BUILD-MCOMPILER-270_release.xml, f:\jenkins\jenkins-slave\workspace\mpiler-plugin_MCOMPILER-335-VHQSXD2POT6OA2TVE7EHJ22XUOLAHEKCXK5ZPBJJH4NL5QODG5ZQ\windows-jdk8-m3.5.x_build\target\invoker-reports\BUILD-MCOMPILER-275_separate-moduleinfo.xml, f:\jenkins\jenkins-slave\workspace\mpiler-plugin_MCOMPILER-335-VHQSXD2POT6OA2TVE7EHJ22XUOLAHEKCXK5ZPBJJH4NL5QODG5ZQ\windows-jdk8-m3.5.x_build\target\invoker-reports\BUILD-MCOMPILER-284.xml, f:\jenkins\jenkins-slave\workspace\mpiler-plugin_MCOMPILER-335-VHQSXD2POT6OA2TVE7EHJ22XUOLAHEKCXK5ZPBJJH4NL5QODG5ZQ\windows-jdk8-m3.5.x_build\target\invoker-reports\BUILD-MCOMPILER-294.xml, f:\jenkins\jenkins-slave\workspace\mpiler-plugin_MCOMPILER-335-VHQSXD2POT6OA2TVE7EHJ22XUOLAHEKCXK5ZPBJJH4NL5QODG5ZQ\windows-jdk8-m3.5.x_build\target\invoker-reports\BUILD-MCOMPILER-298.xml, f:\jenkins\jenkins-slave\workspace\mpiler-plugin_MCOMPILER-335-VHQSXD2POT6OA2TVE7EHJ22XUOLAHEKCXK5ZPBJJH4NL5QODG5ZQ\windows-jdk8-m3.5.x_build\target\invoker-reports\BUILD-MCOMPILER-321_pathexceptions.xml, f:\jenkins\jenkins-slave\workspace\mpiler-plugin_MCOMPILER-335-VHQSXD2POT6OA2TVE7EHJ22XUOLAHEKCXK5ZPBJJH4NL5QODG5ZQ\windows-jdk8-m3.5.x_build\target\invoker-reports\BUILD-MCOMPILER-322_release10.xml, f:\jenkins\jenkins-slave\workspace\mpiler-plugin_MCOMPILER-335-VHQSXD2POT6OA2TVE7EHJ22XUOLAHEKCXK5ZPBJJH4NL5QODG5ZQ\windows-jdk8-m3.5.x_build\target\invoker-reports\BUILD-MCOMPILER-328_multiReleaseOutput.xml, f:\jenkins\jenkins-slave\workspace\mpiler-plugin_MCOMPILER-335-VHQSXD2POT6OA2TVE7EHJ22XUOLAHEKCXK5ZPBJJH4NL5QODG5ZQ\windows-jdk8-m3.5.x_build\target\invoker-reports\BUILD-MCOMPILER-336_incremental-modulepath.xml, f:\jenkins\jenkins-slave\workspace\mpiler-plugin_MCOMPILER-335-VHQSXD2POT6OA2TVE7EHJ22XUOLAHEKCXK5ZPBJJH4NL5QODG5ZQ\windows-jdk8-m3.5.x_build\target\invoker-reports\BUILD-automodules-application.xml, f:\jenkins\jenkins-slave\workspace\mpiler-plugin_MCOMPILER-335-VHQSXD2POT6OA2TVE7EHJ22XUOLAHEKCXK5ZPBJJH4NL5QODG5ZQ\windows-jdk8-m3.5.x_build\target\invoker-reports\BUILD-automodules-library.xml, f:\jenkins\jenkins-slave\workspace\mpiler-plugin_MCOMPILER-335-VHQSXD2POT6OA2TVE7EHJ22XUOLAHEKCXK5ZPBJJH4NL5QODG5ZQ\windows-jdk8-m3.5.x_build\target\invoker-reports\BUILD-automodules-manifest.xml, f:\jenkins\jenkins-slave\workspace\mpiler-plugin_MCOMPILER-335-VHQSXD2POT6OA2TVE7EHJ22XUOLAHEKCXK5ZPBJJH4NL5QODG5ZQ\windows-jdk8-m3.5.x_build\target\invoker-reports\BUILD-automodules-transitive-module.xml, f:\jenkins\jenkins-slave\workspace\mpiler-plugin_MCOMPILER-335-VHQSXD2POT6OA2TVE7EHJ22XUOLAHEKCXK5ZPBJJH4NL5QODG5ZQ\windows-jdk8-m3.5.x_build\target\invoker-reports\BUILD-default-incremental-disable.xml, f:\jenkins\jenkins-slave\workspace\mpiler-plugin_MCOMPILER-335-VHQSXD2POT6OA2TVE7EHJ22XUOLAHEKCXK5ZPBJJH4NL5QODG5ZQ\windows-jdk8-m3.5.x_build\target\invoker-reports\BUILD-default.xml, f:\jenkins\jenkins-slave\workspace\mpiler-plugin_MCOMPILER-335-VHQSXD2POT6OA2TVE7EHJ22XUOLAHEKCXK5ZPBJJH4NL5QODG5ZQ\windows-jdk8-m3.5.x_build\target\invoker-reports\BUILD-error-prone-compiler.xml, f:\jenkins\jenkins-slave\workspace\mpiler-plugin_MCOMPILER-335-VHQSXD2POT6OA2TVE7EHJ22XUOLAHEKCXK5ZPBJJH4NL5QODG5ZQ\windows-jdk8-m3.5.x_build\target\invoker-reports\BUILD-groovy-project-with-new-plexus-compiler.xml, f:\jenkins\jenkins-slave\workspace\mpiler-plugin_MCOMPILER-335-VHQSXD2POT6OA2TVE7EHJ22XUOLAHEKCXK5ZPBJJH4NL5QODG5ZQ\windows-jdk8-m3.5.x_build\target\invoker-reports\BUILD-includes-excludes.xml, f:\jenkins\jenkins-slave\workspace\mpiler-plugin_MCOMPILER-335-VHQSXD2POT6OA2TVE7EHJ22XUOLAHEKCXK5ZPBJJH4NL5QODG5ZQ\windows-jdk8-m3.5.x_build\target\invoker-reports\BUILD-jdk16-annotation.xml, f:\jenkins\jenkins-slave\workspace\mpiler-plugin_MCOMPILER-335-VHQSXD2POT6OA2TVE7EHJ22XUOLAHEKCXK5ZPBJJH4NL5QODG5ZQ\windows-jdk8-m3.5.x_build\target\invoker-reports\BUILD-jdk9-exportsto.xml, f:\jenkins\jenkins-slave\workspace\mpiler-plugin_MCOMPILER-335-VHQSXD2POT6OA2TVE7EHJ22XUOLAHEKCXK5ZPBJJH4NL5QODG5ZQ\windows-jdk8-m3.5.x_build\target\invoker-reports\BUILD-jpms_add-exports.xml, f:\jenkins\jenkins-slave\workspace\mpiler-plugin_MCOMPILER-335-VHQSXD2POT6OA2TVE7EHJ22XUOLAHEKCXK5ZPBJJH4NL5QODG5ZQ\windows-jdk8-m3.5.x_build\target\invoker-reports\BUILD-jpms_compile-main-empty-test-bar.xml, f:\jenkins\jenkins-slave\workspace\mpiler-plugin_MCOMPILER-335-VHQSXD2POT6OA2TVE7EHJ22XUOLAHEKCXK5ZPBJJH4NL5QODG5ZQ\windows-jdk8-m3.5.x_build\target\invoker-reports\BUILD-jpms_compile-main-foo-test-bar.xml, f:\jenkins\jenkins-slave\workspace\mpiler-plugin_MCOMPILER-335-VHQSXD2POT6OA2TVE7EHJ22XUOLAHEKCXK5ZPBJJH4NL5QODG5ZQ\windows-jdk8-m3.5.x_build\target\invoker-reports\BUILD-jpms_compile-main-foo-test-foo.xml, f:\jenkins\jenkins-slave\workspace\mpiler-plugin_MCOMPILER-335-VHQSXD2POT6OA2TVE7EHJ22XUOLAHEKCXK5ZPBJJH4NL5QODG5ZQ\windows-jdk8-m3.5.x_build\target\invoker-reports\BUILD-jpms_patch-module.xml, f:\jenkins\jenkins-slave\workspace\mpiler-plugin_MCOMPILER-335-VHQSXD2POT6OA2TVE7EHJ22XUOLAHEKCXK5ZPBJJH4NL5QODG5ZQ\windows-jdk8-m3.5.x_build\target\invoker-reports\BUILD-mcompiler-106.xml, f:\jenkins\jenkins-slave\workspace\mpiler-plugin_MCOMPILER-335-VHQSXD2POT6OA2TVE7EHJ22XUOLAHEKCXK5ZPBJJH4NL5QODG5ZQ\windows-jdk8-m3.5.x_build\target\invoker-reports\BUILD-mcompiler-120.xml, f:\jenkins\jenkins-slave\workspace\mpiler-plugin_MCOMPILER-335-VHQSXD2POT6OA2TVE7EHJ22XUOLAHEKCXK5ZPBJJH4NL5QODG5ZQ\windows-jdk8-m3.5.x_build\target\invoker-reports\BUILD-mcompiler-135.xml, f:\jenkins\jenkins-slave\workspace\mpiler-plugin_MCOMPILER-335-VHQSXD2POT6OA2TVE7EHJ22XUOLAHEKCXK5ZPBJJH4NL5QODG5ZQ\windows-jdk8-m3.5.x_build\target\invoker-reports\BUILD-mcompiler-179.xml, f:\jenkins\jenkins-slave\workspace\mpiler-plugin_MCOMPILER-335-VHQSXD2POT6OA2TVE7EHJ22XUOLAHEKCXK5ZPBJJH4NL5QODG5ZQ\windows-jdk8-m3.5.x_build\target\invoker-reports\BUILD-mcompiler-182.xml, f:\jenkins\jenkins-slave\workspace\mpiler-plugin_MCOMPILER-335-VHQSXD2POT6OA2TVE7EHJ22XUOLAHEKCXK5ZPBJJH4NL5QODG5ZQ\windows-jdk8-m3.5.x_build\target\invoker-reports\BUILD-mcompiler-21_class-remove.xml, f:\jenkins\jenkins-slave\workspace\mpiler-plugin_MCOMPILER-335-VHQSXD2POT6OA2TVE7EHJ22XUOLAHEKCXK5ZPBJJH4NL5QODG5ZQ\windows-jdk8-m3.5.x_build\target\invoker-reports\BUILD-mcompiler-21_methodname-change.xml, f:\jenkins\jenkins-slave\workspace\mpiler-plugin_MCOMPILER-335-VHQSXD2POT6OA2TVE7EHJ22XUOLAHEKCXK5ZPBJJH4NL5QODG5ZQ\windows-jdk8-m3.5.x_build\target\invoker-reports\BUILD-multirelease-patterns_multimodule.xml, f:\jenkins\jenkins-slave\workspace\mpiler-plugin_MCOMPILER-335-VHQSXD2POT6OA2TVE7EHJ22XUOLAHEKCXK5ZPBJJH4NL5QODG5ZQ\windows-jdk8-m3.5.x_build\target\invoker-reports\BUILD-multirelease-patterns_multiproject.xml, f:\jenkins\jenkins-slave\workspace\mpiler-plugin_MCOMPILER-335-VHQSXD2POT6OA2TVE7EHJ22XUOLAHEKCXK5ZPBJJH4NL5QODG5ZQ\windows-jdk8-m3.5.x_build\target\invoker-reports\BUILD-multirelease-patterns_packaging-plugin.xml, f:\jenkins\jenkins-slave\workspace\mpiler-plugin_MCOMPILER-335-VHQSXD2POT6OA2TVE7EHJ22XUOLAHEKCXK5ZPBJJH4NL5QODG5ZQ\windows-jdk8-m3.5.x_build\target\invoker-reports\BUILD-multirelease-patterns_singleproject-runtime.xml, f:\jenkins\jenkins-slave\workspace\mpiler-plugin_MCOMPILER-335-VHQSXD2POT6OA2TVE7EHJ22XUOLAHEKCXK5ZPBJJH4NL5QODG5ZQ\windows-jdk8-m3.5.x_build\target\invoker-reports\BUILD-non-english-warnings.xml, f:\jenkins\jenkins-slave\workspace\mpiler-plugin_MCOMPILER-335-VHQSXD2POT6OA2TVE7EHJ22XUOLAHEKCXK5ZPBJJH4NL5QODG5ZQ\windows-jdk8-m3.5.x_build\target\invoker-reports\BUILD-setup_jar_automodule.xml, f:\jenkins\jenkins-slave\workspace\mpiler-plugin_MCOMPILER-335-VHQSXD2POT6OA2TVE7EHJ22XUOLAHEKCXK5ZPBJJH4NL5QODG5ZQ\windows-jdk8-m3.5.x_build\target\invoker-reports\BUILD-setup_jar_module.xml, f:\jenkins\jenkins-slave\workspace\mpiler-plugin_MCOMPILER-335-VHQSXD2POT6OA2TVE7EHJ22XUOLAHEKCXK5ZPBJJH4NL5QODG5ZQ\windows-jdk8-m3.5.x_build\target\invoker-reports\BUILD-setup_x.xml, f:\jenkins\jenkins-slave\workspace\mpiler-plugin_MCOMPILER-335-VHQSXD2POT6OA2TVE7EHJ22XUOLAHEKCXK5ZPBJJH4NL5QODG5ZQ\windows-jdk8-m3.5.x_build\target\invoker-reports\BUILD-test1.xml]
[windows-jdk8-m3.5.x_build] Found logs:[f:\jenkins\jenkins-slave\workspace\mpiler-plugin_MCOMPILER-335-VHQSXD2POT6OA2TVE7EHJ22XUOLAHEKCXK5ZPBJJH4NL5QODG5ZQ\windows-jdk8-m3.5.x_build\target\it\MCOMPILER-129\build.log, f:\jenkins\jenkins-slave\workspace\mpiler-plugin_MCOMPILER-335-VHQSXD2POT6OA2TVE7EHJ22XUOLAHEKCXK5ZPBJJH4NL5QODG5ZQ\windows-jdk8-m3.5.x_build\target\it\MCOMPILER-157\build.log, f:\jenkins\jenkins-slave\workspace\mpiler-plugin_MCOMPILER-335-VHQSXD2POT6OA2TVE7EHJ22XUOLAHEKCXK5ZPBJJH4NL5QODG5ZQ\windows-jdk8-m3.5.x_build\target\it\MCOMPILER-170\build.log, f:\jenkins\jenkins-slave\workspace\mpiler-plugin_MCOMPILER-335-VHQSXD2POT6OA2TVE7EHJ22XUOLAHEKCXK5ZPBJJH4NL5QODG5ZQ\windows-jdk8-m3.5.x_build\target\it\MCOMPILER-190\build.log, f:\jenkins\jenkins-slave\workspace\mpiler-plugin_MCOMPILER-335-VHQSXD2POT6OA2TVE7EHJ22XUOLAHEKCXK5ZPBJJH4NL5QODG5ZQ\windows-jdk8-m3.5.x_build\target\it\MCOMPILER-192\build.log, f:\jenkins\jenkins-slave\workspace\mpiler-plugin_MCOMPILER-335-VHQSXD2POT6OA2TVE7EHJ22XUOLAHEKCXK5ZPBJJH4NL5QODG5ZQ\windows-jdk8-m3.5.x_build\target\it\MCOMPILER-197\build.log, f:\jenkins\jenkins-slave\workspace\mpiler-plugin_MCOMPILER-335-VHQSXD2POT6OA2TVE7EHJ22XUOLAHEKCXK5ZPBJJH4NL5QODG5ZQ\windows-jdk8-m3.5.x_build\target\it\MCOMPILER-203-processorpath\build.log, f:\jenkins\jenkins-slave\workspace\mpiler-plugin_MCOMPILER-335-VHQSXD2POT6OA2TVE7EHJ22XUOLAHEKCXK5ZPBJJH4NL5QODG5ZQ\windows-jdk8-m3.5.x_build\target\it\MCOMPILER-224\build.log, f:\jenkins\jenkins-slave\workspace\mpiler-plugin_MCOMPILER-335-VHQSXD2POT6OA2TVE7EHJ22XUOLAHEKCXK5ZPBJJH4NL5QODG5ZQ\windows-jdk8-m3.5.x_build\target\it\MCOMPILER-228\build.log, f:\jenkins\jenkins-slave\workspace\mpiler-plugin_MCOMPILER-335-VHQSXD2POT6OA2TVE7EHJ22XUOLAHEKCXK5ZPBJJH4NL5QODG5ZQ\windows-jdk8-m3.5.x_build\target\it\MCOMPILER-260_customArguments\build.log, f:\jenkins\jenkins-slave\workspace\mpiler-plugin_MCOMPILER-335-VHQSXD2POT6OA2TVE7EHJ22XUOLAHEKCXK5ZPBJJH4NL5QODG5ZQ\windows-jdk8-m3.5.x_build\target\it\MCOMPILER-284\build.log, f:\jenkins\jenkins-slave\workspace\mpiler-plugin_MCOMPILER-335-VHQSXD2POT6OA2TVE7EHJ22XUOLAHEKCXK5ZPBJJH4NL5QODG5ZQ\windows-jdk8-m3.5.x_build\target\it\MCOMPILER-298\build.log, f:\jenkins\jenkins-slave\workspace\mpiler-plugin_MCOMPILER-335-VHQSXD2POT6OA2TVE7EHJ22XUOLAHEKCXK5ZPBJJH4NL5QODG5ZQ\windows-jdk8-m3.5.x_build\target\it\default-incremental-disable\build.log, f:\jenkins\jenkins-slave\workspace\mpiler-plugin_MCOMPILER-335-VHQSXD2POT6OA2TVE7EHJ22XUOLAHEKCXK5ZPBJJH4NL5QODG5ZQ\windows-jdk8-m3.5.x_build\target\it\default\build.log, f:\jenkins\jenkins-slave\workspace\mpiler-plugin_MCOMPILER-335-VHQSXD2POT6OA2TVE7EHJ22XUOLAHEKCXK5ZPBJJH4NL5QODG5ZQ\windows-jdk8-m3.5.x_build\target\it\error-prone-compiler\build.log, f:\jenkins\jenkins-slave\workspace\mpiler-plugin_MCOMPILER-335-VHQSXD2POT6OA2TVE7EHJ22XUOLAHEKCXK5ZPBJJH4NL5QODG5ZQ\windows-jdk8-m3.5.x_build\target\it\groovy-project-with-new-plexus-compiler\build.log, f:\jenkins\jenkins-slave\workspace\mpiler-plugin_MCOMPILER-335-VHQSXD2POT6OA2TVE7EHJ22XUOLAHEKCXK5ZPBJJH4NL5QODG5ZQ\windows-jdk8-m3.5.x_build\target\it\includes-excludes\build.log, f:\jenkins\jenkins-slave\workspace\mpiler-plugin_MCOMPILER-335-VHQSXD2POT6OA2TVE7EHJ22XUOLAHEKCXK5ZPBJJH4NL5QODG5ZQ\windows-jdk8-m3.5.x_build\target\it\jdk16-annotation\build.log, f:\jenkins\jenkins-slave\workspace\mpiler-plugin_MCOMPILER-335-VHQSXD2POT6OA2TVE7EHJ22XUOLAHEKCXK5ZPBJJH4NL5QODG5ZQ\windows-jdk8-m3.5.x_build\target\it\mcompiler-106\build.log, f:\jenkins\jenkins-slave\workspace\mpiler-plugin_MCOMPILER-335-VHQSXD2POT6OA2TVE7EHJ22XUOLAHEKCXK5ZPBJJH4NL5QODG5ZQ\windows-jdk8-m3.5.x_build\target\it\mcompiler-120\build.log, f:\jenkins\jenkins-slave\workspace\mpiler-plugin_MCOMPILER-335-VHQSXD2POT6OA2TVE7EHJ22XUOLAHEKCXK5ZPBJJH4NL5QODG5ZQ\windows-jdk8-m3.5.x_build\target\it\mcompiler-135\build.log, f:\jenkins\jenkins-slave\workspace\mpiler-plugin_MCOMPILER-335-VHQSXD2POT6OA2TVE7EHJ22XUOLAHEKCXK5ZPBJJH4NL5QODG5ZQ\windows-jdk8-m3.5.x_build\target\it\mcompiler-179\build.log, f:\jenkins\jenkins-slave\workspace\mpiler-plugin_MCOMPILER-335-VHQSXD2POT6OA2TVE7EHJ22XUOLAHEKCXK5ZPBJJH4NL5QODG5ZQ\windows-jdk8-m3.5.x_build\target\it\mcompiler-182\build.log, f:\jenkins\jenkins-slave\workspace\mpiler-plugin_MCOMPILER-335-VHQSXD2POT6OA2TVE7EHJ22XUOLAHEKCXK5ZPBJJH4NL5QODG5ZQ\windows-jdk8-m3.5.x_build\target\it\mcompiler-21_class-remove\build.log, f:\jenkins\jenkins-slave\workspace\mpiler-plugin_MCOMPILER-335-VHQSXD2POT6OA2TVE7EHJ22XUOLAHEKCXK5ZPBJJH4NL5QODG5ZQ\windows-jdk8-m3.5.x_build\target\it\mcompiler-21_methodname-change\build.log, f:\jenkins\jenkins-slave\workspace\mpiler-plugin_MCOMPILER-335-VHQSXD2POT6OA2TVE7EHJ22XUOLAHEKCXK5ZPBJJH4NL5QODG5ZQ\windows-jdk8-m3.5.x_build\target\it\multirelease-patterns\singleproject-runtime\build.log, f:\jenkins\jenkins-slave\workspace\mpiler-plugin_MCOMPILER-335-VHQSXD2POT6OA2TVE7EHJ22XUOLAHEKCXK5ZPBJJH4NL5QODG5ZQ\windows-jdk8-m3.5.x_build\target\it\non-english-warnings\build.log, f:\jenkins\jenkins-slave\workspace\mpiler-plugin_MCOMPILER-335-VHQSXD2POT6OA2TVE7EHJ22XUOLAHEKCXK5ZPBJJH4NL5QODG5ZQ\windows-jdk8-m3.5.x_build\target\it\test1\build.log]
[windows-jdk8-m3.5.x_build] Finished parsing Maven Invoker results (found 52)
[windows-jdk8-m3.5.x_build] [withMaven] junitPublisher - Archive test results for Maven artifact org.apache.maven.plugins:maven-compiler-plugin:3.7.1-SNAPSHOT generated by maven-surefire-plugin:test (default-test): windows-jdk8-m3.5.x_build\target\surefire-reports\*.xml
[windows-jdk8-m3.5.x_build] Recording test results
[windows-jdk8-m3.5.x_build] [withMaven] openTasksPublisher - Scan Tasks for Maven artifact org.apache.maven.plugins:maven-compiler-plugin:3.7.1-SNAPSHOT in source directory windows-jdk8-m3.5.x_build\src\main\java
[windows-jdk8-m3.5.x_build] [TASKS] Scanning folder 'f:\jenkins\jenkins-slave\workspace\mpiler-plugin_MCOMPILER-335-VHQSXD2POT6OA2TVE7EHJ22XUOLAHEKCXK5ZPBJJH4NL5QODG5ZQ' for files matching the pattern 'windows-jdk8-m3.5.x_build\src\main\java\**\*' - excludes: null
[windows-jdk8-m3.5.x_build] [TASKS] Found 9 files to scan for tasks
[windows-jdk8-m3.5.x_build] [TASKS] Found 6 open tasks.
[windows-jdk8-m3.5.x_build] Skipping warnings blame since pipelines do not have an SCM link.%n
[Pipeline] [linux-jdk7-m3.0.x_build] }
[Pipeline] [linux-jdk7-m3.2.x_build] }
[linux-jdk7-m3.2.x_build] [withMaven] artifactsPublisher - Archive artifact linux-jdk7-m3.2.x_build/pom.xml under org/apache/maven/plugins/maven-compiler-plugin/3.7.1-SNAPSHOT/maven-compiler-plugin-3.7.1-SNAPSHOT.pom
[linux-jdk7-m3.2.x_build] [withMaven] artifactsPublisher - Archive artifact linux-jdk7-m3.2.x_build/target/maven-compiler-plugin-3.7.1-SNAPSHOT.jar under org/apache/maven/plugins/maven-compiler-plugin/3.7.1-SNAPSHOT/maven-compiler-plugin-3.7.1-SNAPSHOT.jar
[linux-jdk7-m3.2.x_build] [Fast Archiver] No prior successful build to compare, so performing full copy of artifacts
[linux-jdk7-m3.2.x_build] [withMaven] invokerPublisher - Archive invoker results for Maven artifact MavenArtifact{org.apache.maven.plugins:maven-compiler-plugin::3.7.1-SNAPSHOT(version: 3.7.1-SNAPSHOT, snapshot:false) } generated by PluginInvocation{org.apache.maven.plugins:maven-invoker-plugin:3.0.1@integration-test  integration-test}: linux-jdk7-m3.2.x_build/target/invoker-reports/*.xml
[linux-jdk7-m3.2.x_build] performing MavenInvokerRecorder, reportsFilenamePattern:'**/linux-jdk7-m3.2.x_build/target/invoker-reports/BUILD*.xml', invokerBuildDir:'**/linux-jdk7-m3.2.x_build/target/it'
[linux-jdk7-m3.2.x_build] Found reports:[/home/jenkins/jenkins-slave/workspace/mpiler-plugin_MCOMPILER-335-VHQSXD2POT6OA2TVE7EHJ22XUOLAHEKCXK5ZPBJJH4NL5QODG5ZQ/linux-jdk7-m3.2.x_build/target/invoker-reports/BUILD-MCOMPILER-129.xml, /home/jenkins/jenkins-slave/workspace/mpiler-plugin_MCOMPILER-335-VHQSXD2POT6OA2TVE7EHJ22XUOLAHEKCXK5ZPBJJH4NL5QODG5ZQ/linux-jdk7-m3.2.x_build/target/invoker-reports/BUILD-MCOMPILER-157.xml, /home/jenkins/jenkins-slave/workspace/mpiler-plugin_MCOMPILER-335-VHQSXD2POT6OA2TVE7EHJ22XUOLAHEKCXK5ZPBJJH4NL5QODG5ZQ/linux-jdk7-m3.2.x_build/target/invoker-reports/BUILD-MCOMPILER-170.xml, /home/jenkins/jenkins-slave/workspace/mpiler-plugin_MCOMPILER-335-VHQSXD2POT6OA2TVE7EHJ22XUOLAHEKCXK5ZPBJJH4NL5QODG5ZQ/linux-jdk7-m3.2.x_build/target/invoker-reports/BUILD-MCOMPILER-190.xml, /home/jenkins/jenkins-slave/workspace/mpiler-plugin_MCOMPILER-335-VHQSXD2POT6OA2TVE7EHJ22XUOLAHEKCXK5ZPBJJH4NL5QODG5ZQ/linux-jdk7-m3.2.x_build/target/invoker-reports/BUILD-MCOMPILER-192.xml, /home/jenkins/jenkins-slave/workspace/mpiler-plugin_MCOMPILER-335-VHQSXD2POT6OA2TVE7EHJ22XUOLAHEKCXK5ZPBJJH4NL5QODG5ZQ/linux-jdk7-m3.2.x_build/target/invoker-reports/BUILD-MCOMPILER-197.xml, /home/jenkins/jenkins-slave/workspace/mpiler-plugin_MCOMPILER-335-VHQSXD2POT6OA2TVE7EHJ22XUOLAHEKCXK5ZPBJJH4NL5QODG5ZQ/linux-jdk7-m3.2.x_build/target/invoker-reports/BUILD-MCOMPILER-203-processorpath.xml, /home/jenkins/jenkins-slave/workspace/mpiler-plugin_MCOMPILER-335-VHQSXD2POT6OA2TVE7EHJ22XUOLAHEKCXK5ZPBJJH4NL5QODG5ZQ/linux-jdk7-m3.2.x_build/target/invoker-reports/BUILD-MCOMPILER-224.xml, /home/jenkins/jenkins-slave/workspace/mpiler-plugin_MCOMPILER-335-VHQSXD2POT6OA2TVE7EHJ22XUOLAHEKCXK5ZPBJJH4NL5QODG5ZQ/linux-jdk7-m3.2.x_build/target/invoker-reports/BUILD-MCOMPILER-228.xml, /home/jenkins/jenkins-slave/workspace/mpiler-plugin_MCOMPILER-335-VHQSXD2POT6OA2TVE7EHJ22XUOLAHEKCXK5ZPBJJH4NL5QODG5ZQ/linux-jdk7-m3.2.x_build/target/invoker-reports/BUILD-MCOMPILER-260_customArguments.xml, /home/jenkins/jenkins-slave/workspace/mpiler-plugin_MCOMPILER-335-VHQSXD2POT6OA2TVE7EHJ22XUOLAHEKCXK5ZPBJJH4NL5QODG5ZQ/linux-jdk7-m3.2.x_build/target/invoker-reports/BUILD-MCOMPILER-268_modulepath.xml, /home/jenkins/jenkins-slave/workspace/mpiler-plugin_MCOMPILER-335-VHQSXD2POT6OA2TVE7EHJ22XUOLAHEKCXK5ZPBJJH4NL5QODG5ZQ/linux-jdk7-m3.2.x_build/target/invoker-reports/BUILD-MCOMPILER-270_release.xml, /home/jenkins/jenkins-slave/workspace/mpiler-plugin_MCOMPILER-335-VHQSXD2POT6OA2TVE7EHJ22XUOLAHEKCXK5ZPBJJH4NL5QODG5ZQ/linux-jdk7-m3.2.x_build/target/invoker-reports/BUILD-MCOMPILER-275_separate-moduleinfo.xml, /home/jenkins/jenkins-slave/workspace/mpiler-plugin_MCOMPILER-335-VHQSXD2POT6OA2TVE7EHJ22XUOLAHEKCXK5ZPBJJH4NL5QODG5ZQ/linux-jdk7-m3.2.x_build/target/invoker-reports/BUILD-MCOMPILER-284.xml, /home/jenkins/jenkins-slave/workspace/mpiler-plugin_MCOMPILER-335-VHQSXD2POT6OA2TVE7EHJ22XUOLAHEKCXK5ZPBJJH4NL5QODG5ZQ/linux-jdk7-m3.2.x_build/target/invoker-reports/BUILD-MCOMPILER-294.xml, /home/jenkins/jenkins-slave/workspace/mpiler-plugin_MCOMPILER-335-VHQSXD2POT6OA2TVE7EHJ22XUOLAHEKCXK5ZPBJJH4NL5QODG5ZQ/linux-jdk7-m3.2.x_build/target/invoker-reports/BUILD-MCOMPILER-298.xml, /home/jenkins/jenkins-slave/workspace/mpiler-plugin_MCOMPILER-335-VHQSXD2POT6OA2TVE7EHJ22XUOLAHEKCXK5ZPBJJH4NL5QODG5ZQ/linux-jdk7-m3.2.x_build/target/invoker-reports/BUILD-MCOMPILER-321_pathexceptions.xml, /home/jenkins/jenkins-slave/workspace/mpiler-plugin_MCOMPILER-335-VHQSXD2POT6OA2TVE7EHJ22XUOLAHEKCXK5ZPBJJH4NL5QODG5ZQ/linux-jdk7-m3.2.x_build/target/invoker-reports/BUILD-MCOMPILER-322_release10.xml, /home/jenkins/jenkins-slave/workspace/mpiler-plugin_MCOMPILER-335-VHQSXD2POT6OA2TVE7EHJ22XUOLAHEKCXK5ZPBJJH4NL5QODG5ZQ/linux-jdk7-m3.2.x_build/target/invoker-reports/BUILD-MCOMPILER-328_multiReleaseOutput.xml, /home/jenkins/jenkins-slave/workspace/mpiler-plugin_MCOMPILER-335-VHQSXD2POT6OA2TVE7EHJ22XUOLAHEKCXK5ZPBJJH4NL5QODG5ZQ/linux-jdk7-m3.2.x_build/target/invoker-reports/BUILD-MCOMPILER-336_incremental-modulepath.xml, /home/jenkins/jenkins-slave/workspace/mpiler-plugin_MCOMPILER-335-VHQSXD2POT6OA2TVE7EHJ22XUOLAHEKCXK5ZPBJJH4NL5QODG5ZQ/linux-jdk7-m3.2.x_build/target/invoker-reports/BUILD-automodules-application.xml, /home/jenkins/jenkins-slave/workspace/mpiler-plugin_MCOMPILER-335-VHQSXD2POT6OA2TVE7EHJ22XUOLAHEKCXK5ZPBJJH4NL5QODG5ZQ/linux-jdk7-m3.2.x_build/target/invoker-reports/BUILD-automodules-library.xml, /home/jenkins/jenkins-slave/workspace/mpiler-plugin_MCOMPILER-335-VHQSXD2POT6OA2TVE7EHJ22XUOLAHEKCXK5ZPBJJH4NL5QODG5ZQ/linux-jdk7-m3.2.x_build/target/invoker-reports/BUILD-automodules-manifest.xml, /home/jenkins/jenkins-slave/workspace/mpiler-plugin_MCOMPILER-335-VHQSXD2POT6OA2TVE7EHJ22XUOLAHEKCXK5ZPBJJH4NL5QODG5ZQ/linux-jdk7-m3.2.x_build/target/invoker-reports/BUILD-automodules-transitive-module.xml, /home/jenkins/jenkins-slave/workspace/mpiler-plugin_MCOMPILER-335-VHQSXD2POT6OA2TVE7EHJ22XUOLAHEKCXK5ZPBJJH4NL5QODG5ZQ/linux-jdk7-m3.2.x_build/target/invoker-reports/BUILD-default-incremental-disable.xml, /home/jenkins/jenkins-slave/workspace/mpiler-plugin_MCOMPILER-335-VHQSXD2POT6OA2TVE7EHJ22XUOLAHEKCXK5ZPBJJH4NL5QODG5ZQ/linux-jdk7-m3.2.x_build/target/invoker-reports/BUILD-default.xml, /home/jenkins/jenkins-slave/workspace/mpiler-plugin_MCOMPILER-335-VHQSXD2POT6OA2TVE7EHJ22XUOLAHEKCXK5ZPBJJH4NL5QODG5ZQ/linux-jdk7-m3.2.x_build/target/invoker-reports/BUILD-error-prone-compiler.xml, /home/jenkins/jenkins-slave/workspace/mpiler-plugin_MCOMPILER-335-VHQSXD2POT6OA2TVE7EHJ22XUOLAHEKCXK5ZPBJJH4NL5QODG5ZQ/linux-jdk7-m3.2.x_build/target/invoker-reports/BUILD-groovy-project-with-new-plexus-compiler.xml, /home/jenkins/jenkins-slave/workspace/mpiler-plugin_MCOMPILER-335-VHQSXD2POT6OA2TVE7EHJ22XUOLAHEKCXK5ZPBJJH4NL5QODG5ZQ/linux-jdk7-m3.2.x_build/target/invoker-reports/BUILD-includes-excludes.xml, /home/jenkins/jenkins-slave/workspace/mpiler-plugin_MCOMPILER-335-VHQSXD2POT6OA2TVE7EHJ22XUOLAHEKCXK5ZPBJJH4NL5QODG5ZQ/linux-jdk7-m3.2.x_build/target/invoker-reports/BUILD-jdk16-annotation.xml, /home/jenkins/jenkins-slave/workspace/mpiler-plugin_MCOMPILER-335-VHQSXD2POT6OA2TVE7EHJ22XUOLAHEKCXK5ZPBJJH4NL5QODG5ZQ/linux-jdk7-m3.2.x_build/target/invoker-reports/BUILD-jdk9-exportsto.xml, /home/jenkins/jenkins-slave/workspace/mpiler-plugin_MCOMPILER-335-VHQSXD2POT6OA2TVE7EHJ22XUOLAHEKCXK5ZPBJJH4NL5QODG5ZQ/linux-jdk7-m3.2.x_build/target/invoker-reports/BUILD-jpms_add-exports.xml, /home/jenkins/jenkins-slave/workspace/mpiler-plugin_MCOMPILER-335-VHQSXD2POT6OA2TVE7EHJ22XUOLAHEKCXK5ZPBJJH4NL5QODG5ZQ/linux-jdk7-m3.2.x_build/target/invoker-reports/BUILD-jpms_compile-main-empty-test-bar.xml, /home/jenkins/jenkins-slave/workspace/mpiler-plugin_MCOMPILER-335-VHQSXD2POT6OA2TVE7EHJ22XUOLAHEKCXK5ZPBJJH4NL5QODG5ZQ/linux-jdk7-m3.2.x_build/target/invoker-reports/BUILD-jpms_compile-main-foo-test-bar.xml, /home/jenkins/jenkins-slave/workspace/mpiler-plugin_MCOMPILER-335-VHQSXD2POT6OA2TVE7EHJ22XUOLAHEKCXK5ZPBJJH4NL5QODG5ZQ/linux-jdk7-m3.2.x_build/target/invoker-reports/BUILD-jpms_compile-main-foo-test-foo.xml, /home/jenkins/jenkins-slave/workspace/mpiler-plugin_MCOMPILER-335-VHQSXD2POT6OA2TVE7EHJ22XUOLAHEKCXK5ZPBJJH4NL5QODG5ZQ/linux-jdk7-m3.2.x_build/target/invoker-reports/BUILD-jpms_patch-module.xml, /home/jenkins/jenkins-slave/workspace/mpiler-plugin_MCOMPILER-335-VHQSXD2POT6OA2TVE7EHJ22XUOLAHEKCXK5ZPBJJH4NL5QODG5ZQ/linux-jdk7-m3.2.x_build/target/invoker-reports/BUILD-mcompiler-106.xml, /home/jenkins/jenkins-slave/workspace/mpiler-plugin_MCOMPILER-335-VHQSXD2POT6OA2TVE7EHJ22XUOLAHEKCXK5ZPBJJH4NL5QODG5ZQ/linux-jdk7-m3.2.x_build/target/invoker-reports/BUILD-mcompiler-120.xml, /home/jenkins/jenkins-slave/workspace/mpiler-plugin_MCOMPILER-335-VHQSXD2POT6OA2TVE7EHJ22XUOLAHEKCXK5ZPBJJH4NL5QODG5ZQ/linux-jdk7-m3.2.x_build/target/invoker-reports/BUILD-mcompiler-135.xml, /home/jenkins/jenkins-slave/workspace/mpiler-plugin_MCOMPILER-335-VHQSXD2POT6OA2TVE7EHJ22XUOLAHEKCXK5ZPBJJH4NL5QODG5ZQ/linux-jdk7-m3.2.x_build/target/invoker-reports/BUILD-mcompiler-179.xml, /home/jenkins/jenkins-slave/workspace/mpiler-plugin_MCOMPILER-335-VHQSXD2POT6OA2TVE7EHJ22XUOLAHEKCXK5ZPBJJH4NL5QODG5ZQ/linux-jdk7-m3.2.x_build/target/invoker-reports/BUILD-mcompiler-182.xml, /home/jenkins/jenkins-slave/workspace/mpiler-plugin_MCOMPILER-335-VHQSXD2POT6OA2TVE7EHJ22XUOLAHEKCXK5ZPBJJH4NL5QODG5ZQ/linux-jdk7-m3.2.x_build/target/invoker-reports/BUILD-mcompiler-21_class-remove.xml, /home/jenkins/jenkins-slave/workspace/mpiler-plugin_MCOMPILER-335-VHQSXD2POT6OA2TVE7EHJ22XUOLAHEKCXK5ZPBJJH4NL5QODG5ZQ/linux-jdk7-m3.2.x_build/target/invoker-reports/BUILD-mcompiler-21_methodname-change.xml, /home/jenkins/jenkins-slave/workspace/mpiler-plugin_MCOMPILER-335-VHQSXD2POT6OA2TVE7EHJ22XUOLAHEKCXK5ZPBJJH4NL5QODG5ZQ/linux-jdk7-m3.2.x_build/target/invoker-reports/BUILD-multirelease-patterns_multimodule.xml, /home/jenkins/jenkins-slave/workspace/mpiler-plugin_MCOMPILER-335-VHQSXD2POT6OA2TVE7EHJ22XUOLAHEKCXK5ZPBJJH4NL5QODG5ZQ/linux-jdk7-m3.2.x_build/target/invoker-reports/BUILD-multirelease-patterns_multiproject.xml, /home/jenkins/jenkins-slave/workspace/mpiler-plugin_MCOMPILER-335-VHQSXD2POT6OA2TVE7EHJ22XUOLAHEKCXK5ZPBJJH4NL5QODG5ZQ/linux-jdk7-m3.2.x_build/target/invoker-reports/BUILD-multirelease-patterns_packaging-plugin.xml, /home/jenkins/jenkins-slave/workspace/mpiler-plugin_MCOMPILER-335-VHQSXD2POT6OA2TVE7EHJ22XUOLAHEKCXK5ZPBJJH4NL5QODG5ZQ/linux-jdk7-m3.2.x_build/target/invoker-reports/BUILD-multirelease-patterns_singleproject-runtime.xml, /home/jenkins/jenkins-slave/workspace/mpiler-plugin_MCOMPILER-335-VHQSXD2POT6OA2TVE7EHJ22XUOLAHEKCXK5ZPBJJH4NL5QODG5ZQ/linux-jdk7-m3.2.x_build/target/invoker-reports/BUILD-non-english-warnings.xml, /home/jenkins/jenkins-slave/workspace/mpiler-plugin_MCOMPILER-335-VHQSXD2POT6OA2TVE7EHJ22XUOLAHEKCXK5ZPBJJH4NL5QODG5ZQ/linux-jdk7-m3.2.x_build/target/invoker-reports/BUILD-setup_jar_automodule.xml, /home/jenkins/jenkins-slave/workspace/mpiler-plugin_MCOMPILER-335-VHQSXD2POT6OA2TVE7EHJ22XUOLAHEKCXK5ZPBJJH4NL5QODG5ZQ/linux-jdk7-m3.2.x_build/target/invoker-reports/BUILD-setup_jar_module.xml, /home/jenkins/jenkins-slave/workspace/mpiler-plugin_MCOMPILER-335-VHQSXD2POT6OA2TVE7EHJ22XUOLAHEKCXK5ZPBJJH4NL5QODG5ZQ/linux-jdk7-m3.2.x_build/target/invoker-reports/BUILD-setup_x.xml, /home/jenkins/jenkins-slave/workspace/mpiler-plugin_MCOMPILER-335-VHQSXD2POT6OA2TVE7EHJ22XUOLAHEKCXK5ZPBJJH4NL5QODG5ZQ/linux-jdk7-m3.2.x_build/target/invoker-reports/BUILD-test1.xml]
[linux-jdk7-m3.2.x_build] Found logs:[/home/jenkins/jenkins-slave/workspace/mpiler-plugin_MCOMPILER-335-VHQSXD2POT6OA2TVE7EHJ22XUOLAHEKCXK5ZPBJJH4NL5QODG5ZQ/linux-jdk7-m3.2.x_build/target/it/MCOMPILER-129/build.log, /home/jenkins/jenkins-slave/workspace/mpiler-plugin_MCOMPILER-335-VHQSXD2POT6OA2TVE7EHJ22XUOLAHEKCXK5ZPBJJH4NL5QODG5ZQ/linux-jdk7-m3.2.x_build/target/it/MCOMPILER-157/build.log, /home/jenkins/jenkins-slave/workspace/mpiler-plugin_MCOMPILER-335-VHQSXD2POT6OA2TVE7EHJ22XUOLAHEKCXK5ZPBJJH4NL5QODG5ZQ/linux-jdk7-m3.2.x_build/target/it/MCOMPILER-170/build.log, /home/jenkins/jenkins-slave/workspace/mpiler-plugin_MCOMPILER-335-VHQSXD2POT6OA2TVE7EHJ22XUOLAHEKCXK5ZPBJJH4NL5QODG5ZQ/linux-jdk7-m3.2.x_build/target/it/MCOMPILER-190/build.log, /home/jenkins/jenkins-slave/workspace/mpiler-plugin_MCOMPILER-335-VHQSXD2POT6OA2TVE7EHJ22XUOLAHEKCXK5ZPBJJH4NL5QODG5ZQ/linux-jdk7-m3.2.x_build/target/it/MCOMPILER-192/build.log, /home/jenkins/jenkins-slave/workspace/mpiler-plugin_MCOMPILER-335-VHQSXD2POT6OA2TVE7EHJ22XUOLAHEKCXK5ZPBJJH4NL5QODG5ZQ/linux-jdk7-m3.2.x_build/target/it/MCOMPILER-197/build.log, /home/jenkins/jenkins-slave/workspace/mpiler-plugin_MCOMPILER-335-VHQSXD2POT6OA2TVE7EHJ22XUOLAHEKCXK5ZPBJJH4NL5QODG5ZQ/linux-jdk7-m3.2.x_build/target/it/MCOMPILER-203-processorpath/build.log, /home/jenkins/jenkins-slave/workspace/mpiler-plugin_MCOMPILER-335-VHQSXD2POT6OA2TVE7EHJ22XUOLAHEKCXK5ZPBJJH4NL5QODG5ZQ/linux-jdk7-m3.2.x_build/target/it/MCOMPILER-224/build.log, /home/jenkins/jenkins-slave/workspace/mpiler-plugin_MCOMPILER-335-VHQSXD2POT6OA2TVE7EHJ22XUOLAHEKCXK5ZPBJJH4NL5QODG5ZQ/linux-jdk7-m3.2.x_build/target/it/MCOMPILER-260_customArguments/build.log, /home/jenkins/jenkins-slave/workspace/mpiler-plugin_MCOMPILER-335-VHQSXD2POT6OA2TVE7EHJ22XUOLAHEKCXK5ZPBJJH4NL5QODG5ZQ/linux-jdk7-m3.2.x_build/target/it/MCOMPILER-284/build.log, /home/jenkins/jenkins-slave/workspace/mpiler-plugin_MCOMPILER-335-VHQSXD2POT6OA2TVE7EHJ22XUOLAHEKCXK5ZPBJJH4NL5QODG5ZQ/linux-jdk7-m3.2.x_build/target/it/default-incremental-disable/build.log, /home/jenkins/jenkins-slave/workspace/mpiler-plugin_MCOMPILER-335-VHQSXD2POT6OA2TVE7EHJ22XUOLAHEKCXK5ZPBJJH4NL5QODG5ZQ/linux-jdk7-m3.2.x_build/target/it/default/build.log, /home/jenkins/jenkins-slave/workspace/mpiler-plugin_MCOMPILER-335-VHQSXD2POT6OA2TVE7EHJ22XUOLAHEKCXK5ZPBJJH4NL5QODG5ZQ/linux-jdk7-m3.2.x_build/target/it/groovy-project-with-new-plexus-compiler/build.log, /home/jenkins/jenkins-slave/workspace/mpiler-plugin_MCOMPILER-335-VHQSXD2POT6OA2TVE7EHJ22XUOLAHEKCXK5ZPBJJH4NL5QODG5ZQ/linux-jdk7-m3.2.x_build/target/it/includes-excludes/build.log, /home/jenkins/jenkins-slave/workspace/mpiler-plugin_MCOMPILER-335-VHQSXD2POT6OA2TVE7EHJ22XUOLAHEKCXK5ZPBJJH4NL5QODG5ZQ/linux-jdk7-m3.2.x_build/target/it/jdk16-annotation/build.log, /home/jenkins/jenkins-slave/workspace/mpiler-plugin_MCOMPILER-335-VHQSXD2POT6OA2TVE7EHJ22XUOLAHEKCXK5ZPBJJH4NL5QODG5ZQ/linux-jdk7-m3.2.x_build/target/it/mcompiler-106/build.log, /home/jenkins/jenkins-slave/workspace/mpiler-plugin_MCOMPILER-335-VHQSXD2POT6OA2TVE7EHJ22XUOLAHEKCXK5ZPBJJH4NL5QODG5ZQ/linux-jdk7-m3.2.x_build/target/it/mcompiler-120/build.log, /home/jenkins/jenkins-slave/workspace/mpiler-plugin_MCOMPILER-335-VHQSXD2POT6OA2TVE7EHJ22XUOLAHEKCXK5ZPBJJH4NL5QODG5ZQ/linux-jdk7-m3.2.x_build/target/it/mcompiler-135/build.log, /home/jenkins/jenkins-slave/workspace/mpiler-plugin_MCOMPILER-335-VHQSXD2POT6OA2TVE7EHJ22XUOLAHEKCXK5ZPBJJH4NL5QODG5ZQ/linux-jdk7-m3.2.x_build/target/it/mcompiler-179/build.log, /home/jenkins/jenkins-slave/workspace/mpiler-plugin_MCOMPILER-335-VHQSXD2POT6OA2TVE7EHJ22XUOLAHEKCXK5ZPBJJH4NL5QODG5ZQ/linux-jdk7-m3.2.x_build/target/it/mcompiler-182/build.log, /home/jenkins/jenkins-slave/workspace/mpiler-plugin_MCOMPILER-335-VHQSXD2POT6OA2TVE7EHJ22XUOLAHEKCXK5ZPBJJH4NL5QODG5ZQ/linux-jdk7-m3.2.x_build/target/it/mcompiler-21_class-remove/build.log, /home/jenkins/jenkins-slave/workspace/mpiler-plugin_MCOMPILER-335-VHQSXD2POT6OA2TVE7EHJ22XUOLAHEKCXK5ZPBJJH4NL5QODG5ZQ/linux-jdk7-m3.2.x_build/target/it/mcompiler-21_methodname-change/build.log, /home/jenkins/jenkins-slave/workspace/mpiler-plugin_MCOMPILER-335-VHQSXD2POT6OA2TVE7EHJ22XUOLAHEKCXK5ZPBJJH4NL5QODG5ZQ/linux-jdk7-m3.2.x_build/target/it/non-english-warnings/build.log, /home/jenkins/jenkins-slave/workspace/mpiler-plugin_MCOMPILER-335-VHQSXD2POT6OA2TVE7EHJ22XUOLAHEKCXK5ZPBJJH4NL5QODG5ZQ/linux-jdk7-m3.2.x_build/target/it/test1/build.log]
[linux-jdk7-m3.2.x_build] Finished parsing Maven Invoker results (found 52)
[linux-jdk7-m3.2.x_build] [withMaven] junitPublisher - Archive test results for Maven artifact org.apache.maven.plugins:maven-compiler-plugin:3.7.1-SNAPSHOT generated by maven-surefire-plugin:test (default-test): linux-jdk7-m3.2.x_build/target/surefire-reports/*.xml
[linux-jdk7-m3.2.x_build] Recording test results
[linux-jdk7-m3.2.x_build] [withMaven] openTasksPublisher - Scan Tasks for Maven artifact org.apache.maven.plugins:maven-compiler-plugin:3.7.1-SNAPSHOT in source directory linux-jdk7-m3.2.x_build/src/main/java
[linux-jdk7-m3.2.x_build] [TASKS] Scanning folder '/home/jenkins/jenkins-slave/workspace/mpiler-plugin_MCOMPILER-335-VHQSXD2POT6OA2TVE7EHJ22XUOLAHEKCXK5ZPBJJH4NL5QODG5ZQ' for files matching the pattern 'linux-jdk7-m3.2.x_build/src/main/java/**/*' - excludes: null
[linux-jdk7-m3.2.x_build] [TASKS] Found 9 files to scan for tasks
[linux-jdk7-m3.2.x_build] [TASKS] Found 6 open tasks.
[linux-jdk7-m3.2.x_build] Skipping warnings blame since pipelines do not have an SCM link.%n
[Pipeline] [linux-jdk9-m3.5.x_build] }
[linux-jdk9-m3.5.x_build] [withMaven] artifactsPublisher - Archive artifact linux-jdk9-m3.5.x_build/pom.xml under org/apache/maven/plugins/maven-compiler-plugin/3.7.1-SNAPSHOT/maven-compiler-plugin-3.7.1-SNAPSHOT.pom
[linux-jdk9-m3.5.x_build] [withMaven] artifactsPublisher - Archive artifact linux-jdk9-m3.5.x_build/target/maven-compiler-plugin-3.7.1-SNAPSHOT.jar under org/apache/maven/plugins/maven-compiler-plugin/3.7.1-SNAPSHOT/maven-compiler-plugin-3.7.1-SNAPSHOT.jar
[linux-jdk9-m3.5.x_build] [Fast Archiver] No prior successful build to compare, so performing full copy of artifacts
[linux-jdk9-m3.5.x_build] [withMaven] invokerPublisher - Archive invoker results for Maven artifact MavenArtifact{org.apache.maven.plugins:maven-compiler-plugin::3.7.1-SNAPSHOT(version: 3.7.1-SNAPSHOT, snapshot:false) } generated by PluginInvocation{org.apache.maven.plugins:maven-invoker-plugin:3.0.1@integration-test  integration-test}: linux-jdk9-m3.5.x_build/target/invoker-reports/*.xml
[linux-jdk9-m3.5.x_build] performing MavenInvokerRecorder, reportsFilenamePattern:'**/linux-jdk9-m3.5.x_build/target/invoker-reports/BUILD*.xml', invokerBuildDir:'**/linux-jdk9-m3.5.x_build/target/it'
[linux-jdk9-m3.5.x_build] Found reports:[/home/jenkins/jenkins-slave/workspace/mpiler-plugin_MCOMPILER-335-VHQSXD2POT6OA2TVE7EHJ22XUOLAHEKCXK5ZPBJJH4NL5QODG5ZQ@2/linux-jdk9-m3.5.x_build/target/invoker-reports/BUILD-MCOMPILER-129.xml, /home/jenkins/jenkins-slave/workspace/mpiler-plugin_MCOMPILER-335-VHQSXD2POT6OA2TVE7EHJ22XUOLAHEKCXK5ZPBJJH4NL5QODG5ZQ@2/linux-jdk9-m3.5.x_build/target/invoker-reports/BUILD-MCOMPILER-157.xml, /home/jenkins/jenkins-slave/workspace/mpiler-plugin_MCOMPILER-335-VHQSXD2POT6OA2TVE7EHJ22XUOLAHEKCXK5ZPBJJH4NL5QODG5ZQ@2/linux-jdk9-m3.5.x_build/target/invoker-reports/BUILD-MCOMPILER-170.xml, /home/jenkins/jenkins-slave/workspace/mpiler-plugin_MCOMPILER-335-VHQSXD2POT6OA2TVE7EHJ22XUOLAHEKCXK5ZPBJJH4NL5QODG5ZQ@2/linux-jdk9-m3.5.x_build/target/invoker-reports/BUILD-MCOMPILER-190.xml, /home/jenkins/jenkins-slave/workspace/mpiler-plugin_MCOMPILER-335-VHQSXD2POT6OA2TVE7EHJ22XUOLAHEKCXK5ZPBJJH4NL5QODG5ZQ@2/linux-jdk9-m3.5.x_build/target/invoker-reports/BUILD-MCOMPILER-192.xml, /home/jenkins/jenkins-slave/workspace/mpiler-plugin_MCOMPILER-335-VHQSXD2POT6OA2TVE7EHJ22XUOLAHEKCXK5ZPBJJH4NL5QODG5ZQ@2/linux-jdk9-m3.5.x_build/target/invoker-reports/BUILD-MCOMPILER-197.xml, /home/jenkins/jenkins-slave/workspace/mpiler-plugin_MCOMPILER-335-VHQSXD2POT6OA2TVE7EHJ22XUOLAHEKCXK5ZPBJJH4NL5QODG5ZQ@2/linux-jdk9-m3.5.x_build/target/invoker-reports/BUILD-MCOMPILER-203-processorpath.xml, /home/jenkins/jenkins-slave/workspace/mpiler-plugin_MCOMPILER-335-VHQSXD2POT6OA2TVE7EHJ22XUOLAHEKCXK5ZPBJJH4NL5QODG5ZQ@2/linux-jdk9-m3.5.x_build/target/invoker-reports/BUILD-MCOMPILER-224.xml, /home/jenkins/jenkins-slave/workspace/mpiler-plugin_MCOMPILER-335-VHQSXD2POT6OA2TVE7EHJ22XUOLAHEKCXK5ZPBJJH4NL5QODG5ZQ@2/linux-jdk9-m3.5.x_build/target/invoker-reports/BUILD-MCOMPILER-228.xml, /home/jenkins/jenkins-slave/workspace/mpiler-plugin_MCOMPILER-335-VHQSXD2POT6OA2TVE7EHJ22XUOLAHEKCXK5ZPBJJH4NL5QODG5ZQ@2/linux-jdk9-m3.5.x_build/target/invoker-reports/BUILD-MCOMPILER-260_customArguments.xml, /home/jenkins/jenkins-slave/workspace/mpiler-plugin_MCOMPILER-335-VHQSXD2POT6OA2TVE7EHJ22XUOLAHEKCXK5ZPBJJH4NL5QODG5ZQ@2/linux-jdk9-m3.5.x_build/target/invoker-reports/BUILD-MCOMPILER-268_modulepath.xml, /home/jenkins/jenkins-slave/workspace/mpiler-plugin_MCOMPILER-335-VHQSXD2POT6OA2TVE7EHJ22XUOLAHEKCXK5ZPBJJH4NL5QODG5ZQ@2/linux-jdk9-m3.5.x_build/target/invoker-reports/BUILD-MCOMPILER-270_release.xml, /home/jenkins/jenkins-slave/workspace/mpiler-plugin_MCOMPILER-335-VHQSXD2POT6OA2TVE7EHJ22XUOLAHEKCXK5ZPBJJH4NL5QODG5ZQ@2/linux-jdk9-m3.5.x_build/target/invoker-reports/BUILD-MCOMPILER-275_separate-moduleinfo.xml, /home/jenkins/jenkins-slave/workspace/mpiler-plugin_MCOMPILER-335-VHQSXD2POT6OA2TVE7EHJ22XUOLAHEKCXK5ZPBJJH4NL5QODG5ZQ@2/linux-jdk9-m3.5.x_build/target/invoker-reports/BUILD-MCOMPILER-284.xml, /home/jenkins/jenkins-slave/workspace/mpiler-plugin_MCOMPILER-335-VHQSXD2POT6OA2TVE7EHJ22XUOLAHEKCXK5ZPBJJH4NL5QODG5ZQ@2/linux-jdk9-m3.5.x_build/target/invoker-reports/BUILD-MCOMPILER-294.xml, /home/jenkins/jenkins-slave/workspace/mpiler-plugin_MCOMPILER-335-VHQSXD2POT6OA2TVE7EHJ22XUOLAHEKCXK5ZPBJJH4NL5QODG5ZQ@2/linux-jdk9-m3.5.x_build/target/invoker-reports/BUILD-MCOMPILER-298.xml, /home/jenkins/jenkins-slave/workspace/mpiler-plugin_MCOMPILER-335-VHQSXD2POT6OA2TVE7EHJ22XUOLAHEKCXK5ZPBJJH4NL5QODG5ZQ@2/linux-jdk9-m3.5.x_build/target/invoker-reports/BUILD-MCOMPILER-321_pathexceptions.xml, /home/jenkins/jenkins-slave/workspace/mpiler-plugin_MCOMPILER-335-VHQSXD2POT6OA2TVE7EHJ22XUOLAHEKCXK5ZPBJJH4NL5QODG5ZQ@2/linux-jdk9-m3.5.x_build/target/invoker-reports/BUILD-MCOMPILER-322_release10.xml, /home/jenkins/jenkins-slave/workspace/mpiler-plugin_MCOMPILER-335-VHQSXD2POT6OA2TVE7EHJ22XUOLAHEKCXK5ZPBJJH4NL5QODG5ZQ@2/linux-jdk9-m3.5.x_build/target/invoker-reports/BUILD-MCOMPILER-328_multiReleaseOutput.xml, /home/jenkins/jenkins-slave/workspace/mpiler-plugin_MCOMPILER-335-VHQSXD2POT6OA2TVE7EHJ22XUOLAHEKCXK5ZPBJJH4NL5QODG5ZQ@2/linux-jdk9-m3.5.x_build/target/invoker-reports/BUILD-MCOMPILER-336_incremental-modulepath.xml, /home/jenkins/jenkins-slave/workspace/mpiler-plugin_MCOMPILER-335-VHQSXD2POT6OA2TVE7EHJ22XUOLAHEKCXK5ZPBJJH4NL5QODG5ZQ@2/linux-jdk9-m3.5.x_build/target/invoker-reports/BUILD-automodules-application.xml, /home/jenkins/jenkins-slave/workspace/mpiler-plugin_MCOMPILER-335-VHQSXD2POT6OA2TVE7EHJ22XUOLAHEKCXK5ZPBJJH4NL5QODG5ZQ@2/linux-jdk9-m3.5.x_build/target/invoker-reports/BUILD-automodules-library.xml, /home/jenkins/jenkins-slave/workspace/mpiler-plugin_MCOMPILER-335-VHQSXD2POT6OA2TVE7EHJ22XUOLAHEKCXK5ZPBJJH4NL5QODG5ZQ@2/linux-jdk9-m3.5.x_build/target/invoker-reports/BUILD-automodules-manifest.xml, /home/jenkins/jenkins-slave/workspace/mpiler-plugin_MCOMPILER-335-VHQSXD2POT6OA2TVE7EHJ22XUOLAHEKCXK5ZPBJJH4NL5QODG5ZQ@2/linux-jdk9-m3.5.x_build/target/invoker-reports/BUILD-automodules-transitive-module.xml, /home/jenkins/jenkins-slave/workspace/mpiler-plugin_MCOMPILER-335-VHQSXD2POT6OA2TVE7EHJ22XUOLAHEKCXK5ZPBJJH4NL5QODG5ZQ@2/linux-jdk9-m3.5.x_build/target/invoker-reports/BUILD-default-incremental-disable.xml, /home/jenkins/jenkins-slave/workspace/mpiler-plugin_MCOMPILER-335-VHQSXD2POT6OA2TVE7EHJ22XUOLAHEKCXK5ZPBJJH4NL5QODG5ZQ@2/linux-jdk9-m3.5.x_build/target/invoker-reports/BUILD-default.xml, /home/jenkins/jenkins-slave/workspace/mpiler-plugin_MCOMPILER-335-VHQSXD2POT6OA2TVE7EHJ22XUOLAHEKCXK5ZPBJJH4NL5QODG5ZQ@2/linux-jdk9-m3.5.x_build/target/invoker-reports/BUILD-error-prone-compiler.xml, /home/jenkins/jenkins-slave/workspace/mpiler-plugin_MCOMPILER-335-VHQSXD2POT6OA2TVE7EHJ22XUOLAHEKCXK5ZPBJJH4NL5QODG5ZQ@2/linux-jdk9-m3.5.x_build/target/invoker-reports/BUILD-groovy-project-with-new-plexus-compiler.xml, /home/jenkins/jenkins-slave/workspace/mpiler-plugin_MCOMPILER-335-VHQSXD2POT6OA2TVE7EHJ22XUOLAHEKCXK5ZPBJJH4NL5QODG5ZQ@2/linux-jdk9-m3.5.x_build/target/invoker-reports/BUILD-includes-excludes.xml, /home/jenkins/jenkins-slave/workspace/mpiler-plugin_MCOMPILER-335-VHQSXD2POT6OA2TVE7EHJ22XUOLAHEKCXK5ZPBJJH4NL5QODG5ZQ@2/linux-jdk9-m3.5.x_build/target/invoker-reports/BUILD-jdk16-annotation.xml, /home/jenkins/jenkins-slave/workspace/mpiler-plugin_MCOMPILER-335-VHQSXD2POT6OA2TVE7EHJ22XUOLAHEKCXK5ZPBJJH4NL5QODG5ZQ@2/linux-jdk9-m3.5.x_build/target/invoker-reports/BUILD-jdk9-exportsto.xml, /home/jenkins/jenkins-slave/workspace/mpiler-plugin_MCOMPILER-335-VHQSXD2POT6OA2TVE7EHJ22XUOLAHEKCXK5ZPBJJH4NL5QODG5ZQ@2/linux-jdk9-m3.5.x_build/target/invoker-reports/BUILD-jpms_add-exports.xml, /home/jenkins/jenkins-slave/workspace/mpiler-plugin_MCOMPILER-335-VHQSXD2POT6OA2TVE7EHJ22XUOLAHEKCXK5ZPBJJH4NL5QODG5ZQ@2/linux-jdk9-m3.5.x_build/target/invoker-reports/BUILD-jpms_compile-main-empty-test-bar.xml, /home/jenkins/jenkins-slave/workspace/mpiler-plugin_MCOMPILER-335-VHQSXD2POT6OA2TVE7EHJ22XUOLAHEKCXK5ZPBJJH4NL5QODG5ZQ@2/linux-jdk9-m3.5.x_build/target/invoker-reports/BUILD-jpms_compile-main-foo-test-bar.xml, /home/jenkins/jenkins-slave/workspace/mpiler-plugin_MCOMPILER-335-VHQSXD2POT6OA2TVE7EHJ22XUOLAHEKCXK5ZPBJJH4NL5QODG5ZQ@2/linux-jdk9-m3.5.x_build/target/invoker-reports/BUILD-jpms_compile-main-foo-test-foo.xml, /home/jenkins/jenkins-slave/workspace/mpiler-plugin_MCOMPILER-335-VHQSXD2POT6OA2TVE7EHJ22XUOLAHEKCXK5ZPBJJH4NL5QODG5ZQ@2/linux-jdk9-m3.5.x_build/target/invoker-reports/BUILD-jpms_patch-module.xml, /home/jenkins/jenkins-slave/workspace/mpiler-plugin_MCOMPILER-335-VHQSXD2POT6OA2TVE7EHJ22XUOLAHEKCXK5ZPBJJH4NL5QODG5ZQ@2/linux-jdk9-m3.5.x_build/target/invoker-reports/BUILD-mcompiler-106.xml, /home/jenkins/jenkins-slave/workspace/mpiler-plugin_MCOMPILER-335-VHQSXD2POT6OA2TVE7EHJ22XUOLAHEKCXK5ZPBJJH4NL5QODG5ZQ@2/linux-jdk9-m3.5.x_build/target/invoker-reports/BUILD-mcompiler-120.xml, /home/jenkins/jenkins-slave/workspace/mpiler-plugin_MCOMPILER-335-VHQSXD2POT6OA2TVE7EHJ22XUOLAHEKCXK5ZPBJJH4NL5QODG5ZQ@2/linux-jdk9-m3.5.x_build/target/invoker-reports/BUILD-mcompiler-135.xml, /home/jenkins/jenkins-slave/workspace/mpiler-plugin_MCOMPILER-335-VHQSXD2POT6OA2TVE7EHJ22XUOLAHEKCXK5ZPBJJH4NL5QODG5ZQ@2/linux-jdk9-m3.5.x_build/target/invoker-reports/BUILD-mcompiler-179.xml, /home/jenkins/jenkins-slave/workspace/mpiler-plugin_MCOMPILER-335-VHQSXD2POT6OA2TVE7EHJ22XUOLAHEKCXK5ZPBJJH4NL5QODG5ZQ@2/linux-jdk9-m3.5.x_build/target/invoker-reports/BUILD-mcompiler-182.xml, /home/jenkins/jenkins-slave/workspace/mpiler-plugin_MCOMPILER-335-VHQSXD2POT6OA2TVE7EHJ22XUOLAHEKCXK5ZPBJJH4NL5QODG5ZQ@2/linux-jdk9-m3.5.x_build/target/invoker-reports/BUILD-mcompiler-21_class-remove.xml, /home/jenkins/jenkins-slave/workspace/mpiler-plugin_MCOMPILER-335-VHQSXD2POT6OA2TVE7EHJ22XUOLAHEKCXK5ZPBJJH4NL5QODG5ZQ@2/linux-jdk9-m3.5.x_build/target/invoker-reports/BUILD-mcompiler-21_methodname-change.xml, /home/jenkins/jenkins-slave/workspace/mpiler-plugin_MCOMPILER-335-VHQSXD2POT6OA2TVE7EHJ22XUOLAHEKCXK5ZPBJJH4NL5QODG5ZQ@2/linux-jdk9-m3.5.x_build/target/invoker-reports/BUILD-multirelease-patterns_multimodule.xml, /home/jenkins/jenkins-slave/workspace/mpiler-plugin_MCOMPILER-335-VHQSXD2POT6OA2TVE7EHJ22XUOLAHEKCXK5ZPBJJH4NL5QODG5ZQ@2/linux-jdk9-m3.5.x_build/target/invoker-reports/BUILD-multirelease-patterns_multiproject.xml, /home/jenkins/jenkins-slave/workspace/mpiler-plugin_MCOMPILER-335-VHQSXD2POT6OA2TVE7EHJ22XUOLAHEKCXK5ZPBJJH4NL5QODG5ZQ@2/linux-jdk9-m3.5.x_build/target/invoker-reports/BUILD-multirelease-patterns_packaging-plugin.xml, /home/jenkins/jenkins-slave/workspace/mpiler-plugin_MCOMPILER-335-VHQSXD2POT6OA2TVE7EHJ22XUOLAHEKCXK5ZPBJJH4NL5QODG5ZQ@2/linux-jdk9-m3.5.x_build/target/invoker-reports/BUILD-multirelease-patterns_singleproject-runtime.xml, /home/jenkins/jenkins-slave/workspace/mpiler-plugin_MCOMPILER-335-VHQSXD2POT6OA2TVE7EHJ22XUOLAHEKCXK5ZPBJJH4NL5QODG5ZQ@2/linux-jdk9-m3.5.x_build/target/invoker-reports/BUILD-non-english-warnings.xml, /home/jenkins/jenkins-slave/workspace/mpiler-plugin_MCOMPILER-335-VHQSXD2POT6OA2TVE7EHJ22XUOLAHEKCXK5ZPBJJH4NL5QODG5ZQ@2/linux-jdk9-m3.5.x_build/target/invoker-reports/BUILD-setup_jar_automodule.xml, /home/jenkins/jenkins-slave/workspace/mpiler-plugin_MCOMPILER-335-VHQSXD2POT6OA2TVE7EHJ22XUOLAHEKCXK5ZPBJJH4NL5QODG5ZQ@2/linux-jdk9-m3.5.x_build/target/invoker-reports/BUILD-setup_jar_module.xml, /home/jenkins/jenkins-slave/workspace/mpiler-plugin_MCOMPILER-335-VHQSXD2POT6OA2TVE7EHJ22XUOLAHEKCXK5ZPBJJH4NL5QODG5ZQ@2/linux-jdk9-m3.5.x_build/target/invoker-reports/BUILD-setup_x.xml, /home/jenkins/jenkins-slave/workspace/mpiler-plugin_MCOMPILER-335-VHQSXD2POT6OA2TVE7EHJ22XUOLAHEKCXK5ZPBJJH4NL5QODG5ZQ@2/linux-jdk9-m3.5.x_build/target/invoker-reports/BUILD-test1.xml]
[linux-jdk9-m3.5.x_build] Found logs:[/home/jenkins/jenkins-slave/workspace/mpiler-plugin_MCOMPILER-335-VHQSXD2POT6OA2TVE7EHJ22XUOLAHEKCXK5ZPBJJH4NL5QODG5ZQ@2/linux-jdk9-m3.5.x_build/target/it/MCOMPILER-129/build.log, /home/jenkins/jenkins-slave/workspace/mpiler-plugin_MCOMPILER-335-VHQSXD2POT6OA2TVE7EHJ22XUOLAHEKCXK5ZPBJJH4NL5QODG5ZQ@2/linux-jdk9-m3.5.x_build/target/it/MCOMPILER-157/build.log, /home/jenkins/jenkins-slave/workspace/mpiler-plugin_MCOMPILER-335-VHQSXD2POT6OA2TVE7EHJ22XUOLAHEKCXK5ZPBJJH4NL5QODG5ZQ@2/linux-jdk9-m3.5.x_build/target/it/MCOMPILER-170/build.log, /home/jenkins/jenkins-slave/workspace/mpiler-plugin_MCOMPILER-335-VHQSXD2POT6OA2TVE7EHJ22XUOLAHEKCXK5ZPBJJH4NL5QODG5ZQ@2/linux-jdk9-m3.5.x_build/target/it/MCOMPILER-190/build.log, /home/jenkins/jenkins-slave/workspace/mpiler-plugin_MCOMPILER-335-VHQSXD2POT6OA2TVE7EHJ22XUOLAHEKCXK5ZPBJJH4NL5QODG5ZQ@2/linux-jdk9-m3.5.x_build/target/it/MCOMPILER-192/build.log, /home/jenkins/jenkins-slave/workspace/mpiler-plugin_MCOMPILER-335-VHQSXD2POT6OA2TVE7EHJ22XUOLAHEKCXK5ZPBJJH4NL5QODG5ZQ@2/linux-jdk9-m3.5.x_build/target/it/MCOMPILER-203-processorpath/build.log, /home/jenkins/jenkins-slave/workspace/mpiler-plugin_MCOMPILER-335-VHQSXD2POT6OA2TVE7EHJ22XUOLAHEKCXK5ZPBJJH4NL5QODG5ZQ@2/linux-jdk9-m3.5.x_build/target/it/MCOMPILER-224/build.log, /home/jenkins/jenkins-slave/workspace/mpiler-plugin_MCOMPILER-335-VHQSXD2POT6OA2TVE7EHJ22XUOLAHEKCXK5ZPBJJH4NL5QODG5ZQ@2/linux-jdk9-m3.5.x_build/target/it/MCOMPILER-228/build.log, /home/jenkins/jenkins-slave/workspace/mpiler-plugin_MCOMPILER-335-VHQSXD2POT6OA2TVE7EHJ22XUOLAHEKCXK5ZPBJJH4NL5QODG5ZQ@2/linux-jdk9-m3.5.x_build/target/it/MCOMPILER-260_customArguments/build.log, /home/jenkins/jenkins-slave/workspace/mpiler-plugin_MCOMPILER-335-VHQSXD2POT6OA2TVE7EHJ22XUOLAHEKCXK5ZPBJJH4NL5QODG5ZQ@2/linux-jdk9-m3.5.x_build/target/it/MCOMPILER-268_modulepath/build.log, /home/jenkins/jenkins-slave/workspace/mpiler-plugin_MCOMPILER-335-VHQSXD2POT6OA2TVE7EHJ22XUOLAHEKCXK5ZPBJJH4NL5QODG5ZQ@2/linux-jdk9-m3.5.x_build/target/it/MCOMPILER-270_release/build.log, /home/jenkins/jenkins-slave/workspace/mpiler-plugin_MCOMPILER-335-VHQSXD2POT6OA2TVE7EHJ22XUOLAHEKCXK5ZPBJJH4NL5QODG5ZQ@2/linux-jdk9-m3.5.x_build/target/it/MCOMPILER-275_separate-moduleinfo/build.log, /home/jenkins/jenkins-slave/workspace/mpiler-plugin_MCOMPILER-335-VHQSXD2POT6OA2TVE7EHJ22XUOLAHEKCXK5ZPBJJH4NL5QODG5ZQ@2/linux-jdk9-m3.5.x_build/target/it/MCOMPILER-284/build.log, /home/jenkins/jenkins-slave/workspace/mpiler-plugin_MCOMPILER-335-VHQSXD2POT6OA2TVE7EHJ22XUOLAHEKCXK5ZPBJJH4NL5QODG5ZQ@2/linux-jdk9-m3.5.x_build/target/it/MCOMPILER-294/build.log, /home/jenkins/jenkins-slave/workspace/mpiler-plugin_MCOMPILER-335-VHQSXD2POT6OA2TVE7EHJ22XUOLAHEKCXK5ZPBJJH4NL5QODG5ZQ@2/linux-jdk9-m3.5.x_build/target/it/MCOMPILER-298/build.log, /home/jenkins/jenkins-slave/workspace/mpiler-plugin_MCOMPILER-335-VHQSXD2POT6OA2TVE7EHJ22XUOLAHEKCXK5ZPBJJH4NL5QODG5ZQ@2/linux-jdk9-m3.5.x_build/target/it/MCOMPILER-321_pathexceptions/build.log, /home/jenkins/jenkins-slave/workspace/mpiler-plugin_MCOMPILER-335-VHQSXD2POT6OA2TVE7EHJ22XUOLAHEKCXK5ZPBJJH4NL5QODG5ZQ@2/linux-jdk9-m3.5.x_build/target/it/MCOMPILER-328_multiReleaseOutput/build.log, /home/jenkins/jenkins-slave/workspace/mpiler-plugin_MCOMPILER-335-VHQSXD2POT6OA2TVE7EHJ22XUOLAHEKCXK5ZPBJJH4NL5QODG5ZQ@2/linux-jdk9-m3.5.x_build/target/it/MCOMPILER-336_incremental-modulepath/build.log, /home/jenkins/jenkins-slave/workspace/mpiler-plugin_MCOMPILER-335-VHQSXD2POT6OA2TVE7EHJ22XUOLAHEKCXK5ZPBJJH4NL5QODG5ZQ@2/linux-jdk9-m3.5.x_build/target/it/automodules-application/build.log, /home/jenkins/jenkins-slave/workspace/mpiler-plugin_MCOMPILER-335-VHQSXD2POT6OA2TVE7EHJ22XUOLAHEKCXK5ZPBJJH4NL5QODG5ZQ@2/linux-jdk9-m3.5.x_build/target/it/automodules-library/build.log, /home/jenkins/jenkins-slave/workspace/mpiler-plugin_MCOMPILER-335-VHQSXD2POT6OA2TVE7EHJ22XUOLAHEKCXK5ZPBJJH4NL5QODG5ZQ@2/linux-jdk9-m3.5.x_build/target/it/automodules-manifest/build.log, /home/jenkins/jenkins-slave/workspace/mpiler-plugin_MCOMPILER-335-VHQSXD2POT6OA2TVE7EHJ22XUOLAHEKCXK5ZPBJJH4NL5QODG5ZQ@2/linux-jdk9-m3.5.x_build/target/it/automodules-transitive-module/build.log, /home/jenkins/jenkins-slave/workspace/mpiler-plugin_MCOMPILER-335-VHQSXD2POT6OA2TVE7EHJ22XUOLAHEKCXK5ZPBJJH4NL5QODG5ZQ@2/linux-jdk9-m3.5.x_build/target/it/default-incremental-disable/build.log, /home/jenkins/jenkins-slave/workspace/mpiler-plugin_MCOMPILER-335-VHQSXD2POT6OA2TVE7EHJ22XUOLAHEKCXK5ZPBJJH4NL5QODG5ZQ@2/linux-jdk9-m3.5.x_build/target/it/default/build.log, /home/jenkins/jenkins-slave/workspace/mpiler-plugin_MCOMPILER-335-VHQSXD2POT6OA2TVE7EHJ22XUOLAHEKCXK5ZPBJJH4NL5QODG5ZQ@2/linux-jdk9-m3.5.x_build/target/it/error-prone-compiler/build.log, /home/jenkins/jenkins-slave/workspace/mpiler-plugin_MCOMPILER-335-VHQSXD2POT6OA2TVE7EHJ22XUOLAHEKCXK5ZPBJJH4NL5QODG5ZQ@2/linux-jdk9-m3.5.x_build/target/it/includes-excludes/build.log, /home/jenkins/jenkins-slave/workspace/mpiler-plugin_MCOMPILER-335-VHQSXD2POT6OA2TVE7EHJ22XUOLAHEKCXK5ZPBJJH4NL5QODG5ZQ@2/linux-jdk9-m3.5.x_build/target/it/jdk16-annotation/build.log, /home/jenkins/jenkins-slave/workspace/mpiler-plugin_MCOMPILER-335-VHQSXD2POT6OA2TVE7EHJ22XUOLAHEKCXK5ZPBJJH4NL5QODG5ZQ@2/linux-jdk9-m3.5.x_build/target/it/jdk9-exportsto/build.log, /home/jenkins/jenkins-slave/workspace/mpiler-plugin_MCOMPILER-335-VHQSXD2POT6OA2TVE7EHJ22XUOLAHEKCXK5ZPBJJH4NL5QODG5ZQ@2/linux-jdk9-m3.5.x_build/target/it/jpms_add-exports/build.log, /home/jenkins/jenkins-slave/workspace/mpiler-plugin_MCOMPILER-335-VHQSXD2POT6OA2TVE7EHJ22XUOLAHEKCXK5ZPBJJH4NL5QODG5ZQ@2/linux-jdk9-m3.5.x_build/target/it/jpms_compile-main-empty-test-bar/build.log, /home/jenkins/jenkins-slave/workspace/mpiler-plugin_MCOMPILER-335-VHQSXD2POT6OA2TVE7EHJ22XUOLAHEKCXK5ZPBJJH4NL5QODG5ZQ@2/linux-jdk9-m3.5.x_build/target/it/jpms_compile-main-foo-test-bar/build.log, /home/jenkins/jenkins-slave/workspace/mpiler-plugin_MCOMPILER-335-VHQSXD2POT6OA2TVE7EHJ22XUOLAHEKCXK5ZPBJJH4NL5QODG5ZQ@2/linux-jdk9-m3.5.x_build/target/it/jpms_compile-main-foo-test-foo/build.log, /home/jenkins/jenkins-slave/workspace/mpiler-plugin_MCOMPILER-335-VHQSXD2POT6OA2TVE7EHJ22XUOLAHEKCXK5ZPBJJH4NL5QODG5ZQ@2/linux-jdk9-m3.5.x_build/target/it/jpms_patch-module/build.log, /home/jenkins/jenkins-slave/workspace/mpiler-plugin_MCOMPILER-335-VHQSXD2POT6OA2TVE7EHJ22XUOLAHEKCXK5ZPBJJH4NL5QODG5ZQ@2/linux-jdk9-m3.5.x_build/target/it/mcompiler-106/build.log, /home/jenkins/jenkins-slave/workspace/mpiler-plugin_MCOMPILER-335-VHQSXD2POT6OA2TVE7EHJ22XUOLAHEKCXK5ZPBJJH4NL5QODG5ZQ@2/linux-jdk9-m3.5.x_build/target/it/mcompiler-120/build.log, /home/jenkins/jenkins-slave/workspace/mpiler-plugin_MCOMPILER-335-VHQSXD2POT6OA2TVE7EHJ22XUOLAHEKCXK5ZPBJJH4NL5QODG5ZQ@2/linux-jdk9-m3.5.x_build/target/it/mcompiler-135/build.log, /home/jenkins/jenkins-slave/workspace/mpiler-plugin_MCOMPILER-335-VHQSXD2POT6OA2TVE7EHJ22XUOLAHEKCXK5ZPBJJH4NL5QODG5ZQ@2/linux-jdk9-m3.5.x_build/target/it/mcompiler-179/build.log, /home/jenkins/jenkins-slave/workspace/mpiler-plugin_MCOMPILER-335-VHQSXD2POT6OA2TVE7EHJ22XUOLAHEKCXK5ZPBJJH4NL5QODG5ZQ@2/linux-jdk9-m3.5.x_build/target/it/mcompiler-182/build.log, /home/jenkins/jenkins-slave/workspace/mpiler-plugin_MCOMPILER-335-VHQSXD2POT6OA2TVE7EHJ22XUOLAHEKCXK5ZPBJJH4NL5QODG5ZQ@2/linux-jdk9-m3.5.x_build/target/it/mcompiler-21_class-remove/build.log, /home/jenkins/jenkins-slave/workspace/mpiler-plugin_MCOMPILER-335-VHQSXD2POT6OA2TVE7EHJ22XUOLAHEKCXK5ZPBJJH4NL5QODG5ZQ@2/linux-jdk9-m3.5.x_build/target/it/mcompiler-21_methodname-change/build.log, /home/jenkins/jenkins-slave/workspace/mpiler-plugin_MCOMPILER-335-VHQSXD2POT6OA2TVE7EHJ22XUOLAHEKCXK5ZPBJJH4NL5QODG5ZQ@2/linux-jdk9-m3.5.x_build/target/it/multirelease-patterns/multimodule/build.log, /home/jenkins/jenkins-slave/workspace/mpiler-plugin_MCOMPILER-335-VHQSXD2POT6OA2TVE7EHJ22XUOLAHEKCXK5ZPBJJH4NL5QODG5ZQ@2/linux-jdk9-m3.5.x_build/target/it/multirelease-patterns/multiproject/build.log, /home/jenkins/jenkins-slave/workspace/mpiler-plugin_MCOMPILER-335-VHQSXD2POT6OA2TVE7EHJ22XUOLAHEKCXK5ZPBJJH4NL5QODG5ZQ@2/linux-jdk9-m3.5.x_build/target/it/multirelease-patterns/packaging-plugin/build.log, /home/jenkins/jenkins-slave/workspace/mpiler-plugin_MCOMPILER-335-VHQSXD2POT6OA2TVE7EHJ22XUOLAHEKCXK5ZPBJJH4NL5QODG5ZQ@2/linux-jdk9-m3.5.x_build/target/it/multirelease-patterns/singleproject-runtime/build.log, /home/jenkins/jenkins-slave/workspace/mpiler-plugin_MCOMPILER-335-VHQSXD2POT6OA2TVE7EHJ22XUOLAHEKCXK5ZPBJJH4NL5QODG5ZQ@2/linux-jdk9-m3.5.x_build/target/it/non-english-warnings/build.log, /home/jenkins/jenkins-slave/workspace/mpiler-plugin_MCOMPILER-335-VHQSXD2POT6OA2TVE7EHJ22XUOLAHEKCXK5ZPBJJH4NL5QODG5ZQ@2/linux-jdk9-m3.5.x_build/target/it/setup_jar_automodule/build.log, /home/jenkins/jenkins-slave/workspace/mpiler-plugin_MCOMPILER-335-VHQSXD2POT6OA2TVE7EHJ22XUOLAHEKCXK5ZPBJJH4NL5QODG5ZQ@2/linux-jdk9-m3.5.x_build/target/it/setup_jar_module/build.log, /home/jenkins/jenkins-slave/workspace/mpiler-plugin_MCOMPILER-335-VHQSXD2POT6OA2TVE7EHJ22XUOLAHEKCXK5ZPBJJH4NL5QODG5ZQ@2/linux-jdk9-m3.5.x_build/target/it/setup_x/build.log, /home/jenkins/jenkins-slave/workspace/mpiler-plugin_MCOMPILER-335-VHQSXD2POT6OA2TVE7EHJ22XUOLAHEKCXK5ZPBJJH4NL5QODG5ZQ@2/linux-jdk9-m3.5.x_build/target/it/test1/build.log]
[linux-jdk9-m3.5.x_build] Finished parsing Maven Invoker results (found 52)
[linux-jdk9-m3.5.x_build] [withMaven] junitPublisher - Archive test results for Maven artifact org.apache.maven.plugins:maven-compiler-plugin:3.7.1-SNAPSHOT generated by maven-surefire-plugin:test (default-test): linux-jdk9-m3.5.x_build/target/surefire-reports/*.xml
[linux-jdk9-m3.5.x_build] Recording test results
[linux-jdk9-m3.5.x_build] [withMaven] openTasksPublisher - Scan Tasks for Maven artifact org.apache.maven.plugins:maven-compiler-plugin:3.7.1-SNAPSHOT in source directory linux-jdk9-m3.5.x_build/src/main/java
[linux-jdk9-m3.5.x_build] [TASKS] Scanning folder '/home/jenkins/jenkins-slave/workspace/mpiler-plugin_MCOMPILER-335-VHQSXD2POT6OA2TVE7EHJ22XUOLAHEKCXK5ZPBJJH4NL5QODG5ZQ@2' for files matching the pattern 'linux-jdk9-m3.5.x_build/src/main/java/**/*' - excludes: null
[linux-jdk9-m3.5.x_build] [TASKS] Found 9 files to scan for tasks
[linux-jdk9-m3.5.x_build] [TASKS] Found 6 open tasks.
[linux-jdk9-m3.5.x_build] Skipping warnings blame since pipelines do not have an SCM link.%n
[Pipeline] [linux-jdk7-m3.3.x_build] // node
[Pipeline] [linux-jdk7-m3.5.x_build] // node
[Pipeline] [windows-jdk7-m3.2.x_build] // node
[Pipeline] [windows-jdk7-m3.0.x_build] // node
[Pipeline] [windows-jdk8-m3.5.x_build] // withMaven
[Pipeline] [linux-jdk7-m3.0.x_build] // withMaven
[Pipeline] [linux-jdk7-m3.2.x_build] // withMaven
[Pipeline] [linux-jdk9-m3.5.x_build] // withMaven
[Pipeline] [linux-jdk7-m3.3.x_build] }
[Pipeline] [linux-jdk7-m3.5.x_build] }
[Pipeline] [windows-jdk7-m3.0.x_build] }
[Pipeline] [windows-jdk7-m3.2.x_build] }
[Pipeline] [windows-jdk8-m3.5.x_build] }
[Pipeline] [linux-jdk7-m3.0.x_build] }
[Pipeline] [linux-jdk7-m3.2.x_build] }
[Pipeline] [linux-jdk9-m3.5.x_build] }
[Pipeline] [linux-jdk10-m3.5.x_build] }
[Pipeline] [windows-jdk8-m3.5.x_build] // stage
[Pipeline] [linux-jdk7-m3.0.x_build] // stage
[Pipeline] [linux-jdk7-m3.2.x_build] // stage
[Pipeline] [linux-jdk9-m3.5.x_build] // stage
[Pipeline] [linux-jdk10-m3.5.x_build] // dir
[windows-jdk10-m3.5.x_build] [INFO] run post-build script verify.groovy
[windows-jdk10-m3.5.x_build] [INFO]           MCOMPILER-224\pom.xml ............................ SUCCESS (8.0 s)
[windows-jdk10-m3.5.x_build] [INFO] Building: MCOMPILER-228\pom.xml
[windows-jdk9-m3.5.x_build] [INFO]           MCOMPILER-203-processorpath\pom.xml .............. SUCCESS (18.8 s)
[windows-jdk9-m3.5.x_build] [INFO] Building: mcompiler-21_class-remove\pom.xml
[windows-jdk10-m3.5.x_build] [INFO]           MCOMPILER-228\pom.xml ............................ SUCCESS (6.8 s)
[windows-jdk10-m3.5.x_build] [INFO] Building: MCOMPILER-260_customArguments\pom.xml
[windows-jdk10-m3.5.x_build] [INFO]           MCOMPILER-260_customArguments\pom.xml ............ SUCCESS (5.8 s)
[windows-jdk10-m3.5.x_build] [INFO] Building: MCOMPILER-268_modulepath\pom.xml
[windows-jdk10-m3.5.x_build] [INFO] run post-build script verify.groovy
[windows-jdk10-m3.5.x_build] [INFO]           MCOMPILER-268_modulepath\pom.xml ................. SUCCESS (8.1 s)
[windows-jdk10-m3.5.x_build] [INFO] Building: MCOMPILER-270_release\pom.xml
[windows-jdk9-m3.5.x_build] [INFO] run post-build script verify.groovy
[windows-jdk9-m3.5.x_build] [INFO]           mcompiler-21_class-remove\pom.xml ................ SUCCESS (23.0 s)
[windows-jdk9-m3.5.x_build] [INFO] Building: mcompiler-21_methodname-change\pom.xml
[windows-jdk10-m3.5.x_build] [INFO] run post-build script verify.groovy
[windows-jdk10-m3.5.x_build] [INFO]           MCOMPILER-270_release\pom.xml .................... SUCCESS (6.3 s)
[windows-jdk10-m3.5.x_build] [INFO] Building: MCOMPILER-275_separate-moduleinfo\pom.xml
[Pipeline] [linux-jdk7-m3.0.x_build] }
[Pipeline] [linux-jdk7-m3.2.x_build] }
[Pipeline] [linux-jdk9-m3.5.x_build] }
[Pipeline] [windows-jdk8-m3.5.x_build] }
[Pipeline] [linux-jdk10-m3.5.x_build] }
[linux-jdk10-m3.5.x_build] [withMaven] artifactsPublisher - Archive artifact linux-jdk10-m3.5.x_build/pom.xml under org/apache/maven/plugins/maven-compiler-plugin/3.7.1-SNAPSHOT/maven-compiler-plugin-3.7.1-SNAPSHOT.pom
[linux-jdk10-m3.5.x_build] [withMaven] artifactsPublisher - Archive artifact linux-jdk10-m3.5.x_build/target/maven-compiler-plugin-3.7.1-SNAPSHOT.jar under org/apache/maven/plugins/maven-compiler-plugin/3.7.1-SNAPSHOT/maven-compiler-plugin-3.7.1-SNAPSHOT.jar
[linux-jdk10-m3.5.x_build] [Fast Archiver] No prior successful build to compare, so performing full copy of artifacts
[linux-jdk10-m3.5.x_build] [withMaven] invokerPublisher - Archive invoker results for Maven artifact MavenArtifact{org.apache.maven.plugins:maven-compiler-plugin::3.7.1-SNAPSHOT(version: 3.7.1-SNAPSHOT, snapshot:false) } generated by PluginInvocation{org.apache.maven.plugins:maven-invoker-plugin:3.0.1@integration-test  integration-test}: linux-jdk10-m3.5.x_build/target/invoker-reports/*.xml
[linux-jdk10-m3.5.x_build] performing MavenInvokerRecorder, reportsFilenamePattern:'**/linux-jdk10-m3.5.x_build/target/invoker-reports/BUILD*.xml', invokerBuildDir:'**/linux-jdk10-m3.5.x_build/target/it'
[linux-jdk10-m3.5.x_build] Found reports:[/home/jenkins/jenkins-slave/workspace/mpiler-plugin_MCOMPILER-335-VHQSXD2POT6OA2TVE7EHJ22XUOLAHEKCXK5ZPBJJH4NL5QODG5ZQ/linux-jdk10-m3.5.x_build/target/invoker-reports/BUILD-MCOMPILER-129.xml, /home/jenkins/jenkins-slave/workspace/mpiler-plugin_MCOMPILER-335-VHQSXD2POT6OA2TVE7EHJ22XUOLAHEKCXK5ZPBJJH4NL5QODG5ZQ/linux-jdk10-m3.5.x_build/target/invoker-reports/BUILD-MCOMPILER-157.xml, /home/jenkins/jenkins-slave/workspace/mpiler-plugin_MCOMPILER-335-VHQSXD2POT6OA2TVE7EHJ22XUOLAHEKCXK5ZPBJJH4NL5QODG5ZQ/linux-jdk10-m3.5.x_build/target/invoker-reports/BUILD-MCOMPILER-170.xml, /home/jenkins/jenkins-slave/workspace/mpiler-plugin_MCOMPILER-335-VHQSXD2POT6OA2TVE7EHJ22XUOLAHEKCXK5ZPBJJH4NL5QODG5ZQ/linux-jdk10-m3.5.x_build/target/invoker-reports/BUILD-MCOMPILER-190.xml, /home/jenkins/jenkins-slave/workspace/mpiler-plugin_MCOMPILER-335-VHQSXD2POT6OA2TVE7EHJ22XUOLAHEKCXK5ZPBJJH4NL5QODG5ZQ/linux-jdk10-m3.5.x_build/target/invoker-reports/BUILD-MCOMPILER-192.xml, /home/jenkins/jenkins-slave/workspace/mpiler-plugin_MCOMPILER-335-VHQSXD2POT6OA2TVE7EHJ22XUOLAHEKCXK5ZPBJJH4NL5QODG5ZQ/linux-jdk10-m3.5.x_build/target/invoker-reports/BUILD-MCOMPILER-197.xml, /home/jenkins/jenkins-slave/workspace/mpiler-plugin_MCOMPILER-335-VHQSXD2POT6OA2TVE7EHJ22XUOLAHEKCXK5ZPBJJH4NL5QODG5ZQ/linux-jdk10-m3.5.x_build/target/invoker-reports/BUILD-MCOMPILER-203-processorpath.xml, /home/jenkins/jenkins-slave/workspace/mpiler-plugin_MCOMPILER-335-VHQSXD2POT6OA2TVE7EHJ22XUOLAHEKCXK5ZPBJJH4NL5QODG5ZQ/linux-jdk10-m3.5.x_build/target/invoker-reports/BUILD-MCOMPILER-224.xml, /home/jenkins/jenkins-slave/workspace/mpiler-plugin_MCOMPILER-335-VHQSXD2POT6OA2TVE7EHJ22XUOLAHEKCXK5ZPBJJH4NL5QODG5ZQ/linux-jdk10-m3.5.x_build/target/invoker-reports/BUILD-MCOMPILER-228.xml, /home/jenkins/jenkins-slave/workspace/mpiler-plugin_MCOMPILER-335-VHQSXD2POT6OA2TVE7EHJ22XUOLAHEKCXK5ZPBJJH4NL5QODG5ZQ/linux-jdk10-m3.5.x_build/target/invoker-reports/BUILD-MCOMPILER-260_customArguments.xml, /home/jenkins/jenkins-slave/workspace/mpiler-plugin_MCOMPILER-335-VHQSXD2POT6OA2TVE7EHJ22XUOLAHEKCXK5ZPBJJH4NL5QODG5ZQ/linux-jdk10-m3.5.x_build/target/invoker-reports/BUILD-MCOMPILER-268_modulepath.xml, /home/jenkins/jenkins-slave/workspace/mpiler-plugin_MCOMPILER-335-VHQSXD2POT6OA2TVE7EHJ22XUOLAHEKCXK5ZPBJJH4NL5QODG5ZQ/linux-jdk10-m3.5.x_build/target/invoker-reports/BUILD-MCOMPILER-270_release.xml, /home/jenkins/jenkins-slave/workspace/mpiler-plugin_MCOMPILER-335-VHQSXD2POT6OA2TVE7EHJ22XUOLAHEKCXK5ZPBJJH4NL5QODG5ZQ/linux-jdk10-m3.5.x_build/target/invoker-reports/BUILD-MCOMPILER-275_separate-moduleinfo.xml, /home/jenkins/jenkins-slave/workspace/mpiler-plugin_MCOMPILER-335-VHQSXD2POT6OA2TVE7EHJ22XUOLAHEKCXK5ZPBJJH4NL5QODG5ZQ/linux-jdk10-m3.5.x_build/target/invoker-reports/BUILD-MCOMPILER-284.xml, /home/jenkins/jenkins-slave/workspace/mpiler-plugin_MCOMPILER-335-VHQSXD2POT6OA2TVE7EHJ22XUOLAHEKCXK5ZPBJJH4NL5QODG5ZQ/linux-jdk10-m3.5.x_build/target/invoker-reports/BUILD-MCOMPILER-294.xml, /home/jenkins/jenkins-slave/workspace/mpiler-plugin_MCOMPILER-335-VHQSXD2POT6OA2TVE7EHJ22XUOLAHEKCXK5ZPBJJH4NL5QODG5ZQ/linux-jdk10-m3.5.x_build/target/invoker-reports/BUILD-MCOMPILER-298.xml, /home/jenkins/jenkins-slave/workspace/mpiler-plugin_MCOMPILER-335-VHQSXD2POT6OA2TVE7EHJ22XUOLAHEKCXK5ZPBJJH4NL5QODG5ZQ/linux-jdk10-m3.5.x_build/target/invoker-reports/BUILD-MCOMPILER-321_pathexceptions.xml, /home/jenkins/jenkins-slave/workspace/mpiler-plugin_MCOMPILER-335-VHQSXD2POT6OA2TVE7EHJ22XUOLAHEKCXK5ZPBJJH4NL5QODG5ZQ/linux-jdk10-m3.5.x_build/target/invoker-reports/BUILD-MCOMPILER-322_release10.xml, /home/jenkins/jenkins-slave/workspace/mpiler-plugin_MCOMPILER-335-VHQSXD2POT6OA2TVE7EHJ22XUOLAHEKCXK5ZPBJJH4NL5QODG5ZQ/linux-jdk10-m3.5.x_build/target/invoker-reports/BUILD-MCOMPILER-328_multiReleaseOutput.xml, /home/jenkins/jenkins-slave/workspace/mpiler-plugin_MCOMPILER-335-VHQSXD2POT6OA2TVE7EHJ22XUOLAHEKCXK5ZPBJJH4NL5QODG5ZQ/linux-jdk10-m3.5.x_build/target/invoker-reports/BUILD-MCOMPILER-336_incremental-modulepath.xml, /home/jenkins/jenkins-slave/workspace/mpiler-plugin_MCOMPILER-335-VHQSXD2POT6OA2TVE7EHJ22XUOLAHEKCXK5ZPBJJH4NL5QODG5ZQ/linux-jdk10-m3.5.x_build/target/invoker-reports/BUILD-automodules-application.xml, /home/jenkins/jenkins-slave/workspace/mpiler-plugin_MCOMPILER-335-VHQSXD2POT6OA2TVE7EHJ22XUOLAHEKCXK5ZPBJJH4NL5QODG5ZQ/linux-jdk10-m3.5.x_build/target/invoker-reports/BUILD-automodules-library.xml, /home/jenkins/jenkins-slave/workspace/mpiler-plugin_MCOMPILER-335-VHQSXD2POT6OA2TVE7EHJ22XUOLAHEKCXK5ZPBJJH4NL5QODG5ZQ/linux-jdk10-m3.5.x_build/target/invoker-reports/BUILD-automodules-manifest.xml, /home/jenkins/jenkins-slave/workspace/mpiler-plugin_MCOMPILER-335-VHQSXD2POT6OA2TVE7EHJ22XUOLAHEKCXK5ZPBJJH4NL5QODG5ZQ/linux-jdk10-m3.5.x_build/target/invoker-reports/BUILD-automodules-transitive-module.xml, /home/jenkins/jenkins-slave/workspace/mpiler-plugin_MCOMPILER-335-VHQSXD2POT6OA2TVE7EHJ22XUOLAHEKCXK5ZPBJJH4NL5QODG5ZQ/linux-jdk10-m3.5.x_build/target/invoker-reports/BUILD-default-incremental-disable.xml, /home/jenkins/jenkins-slave/workspace/mpiler-plugin_MCOMPILER-335-VHQSXD2POT6OA2TVE7EHJ22XUOLAHEKCXK5ZPBJJH4NL5QODG5ZQ/linux-jdk10-m3.5.x_build/target/invoker-reports/BUILD-default.xml, /home/jenkins/jenkins-slave/workspace/mpiler-plugin_MCOMPILER-335-VHQSXD2POT6OA2TVE7EHJ22XUOLAHEKCXK5ZPBJJH4NL5QODG5ZQ/linux-jdk10-m3.5.x_build/target/invoker-reports/BUILD-error-prone-compiler.xml, /home/jenkins/jenkins-slave/workspace/mpiler-plugin_MCOMPILER-335-VHQSXD2POT6OA2TVE7EHJ22XUOLAHEKCXK5ZPBJJH4NL5QODG5ZQ/linux-jdk10-m3.5.x_build/target/invoker-reports/BUILD-groovy-project-with-new-plexus-compiler.xml, /home/jenkins/jenkins-slave/workspace/mpiler-plugin_MCOMPILER-335-VHQSXD2POT6OA2TVE7EHJ22XUOLAHEKCXK5ZPBJJH4NL5QODG5ZQ/linux-jdk10-m3.5.x_build/target/invoker-reports/BUILD-includes-excludes.xml, /home/jenkins/jenkins-slave/workspace/mpiler-plugin_MCOMPILER-335-VHQSXD2POT6OA2TVE7EHJ22XUOLAHEKCXK5ZPBJJH4NL5QODG5ZQ/linux-jdk10-m3.5.x_build/target/invoker-reports/BUILD-jdk16-annotation.xml, /home/jenkins/jenkins-slave/workspace/mpiler-plugin_MCOMPILER-335-VHQSXD2POT6OA2TVE7EHJ22XUOLAHEKCXK5ZPBJJH4NL5QODG5ZQ/linux-jdk10-m3.5.x_build/target/invoker-reports/BUILD-jdk9-exportsto.xml, /home/jenkins/jenkins-slave/workspace/mpiler-plugin_MCOMPILER-335-VHQSXD2POT6OA2TVE7EHJ22XUOLAHEKCXK5ZPBJJH4NL5QODG5ZQ/linux-jdk10-m3.5.x_build/target/invoker-reports/BUILD-jpms_add-exports.xml, /home/jenkins/jenkins-slave/workspace/mpiler-plugin_MCOMPILER-335-VHQSXD2POT6OA2TVE7EHJ22XUOLAHEKCXK5ZPBJJH4NL5QODG5ZQ/linux-jdk10-m3.5.x_build/target/invoker-reports/BUILD-jpms_compile-main-empty-test-bar.xml, /home/jenkins/jenkins-slave/workspace/mpiler-plugin_MCOMPILER-335-VHQSXD2POT6OA2TVE7EHJ22XUOLAHEKCXK5ZPBJJH4NL5QODG5ZQ/linux-jdk10-m3.5.x_build/target/invoker-reports/BUILD-jpms_compile-main-foo-test-bar.xml, /home/jenkins/jenkins-slave/workspace/mpiler-plugin_MCOMPILER-335-VHQSXD2POT6OA2TVE7EHJ22XUOLAHEKCXK5ZPBJJH4NL5QODG5ZQ/linux-jdk10-m3.5.x_build/target/invoker-reports/BUILD-jpms_compile-main-foo-test-foo.xml, /home/jenkins/jenkins-slave/workspace/mpiler-plugin_MCOMPILER-335-VHQSXD2POT6OA2TVE7EHJ22XUOLAHEKCXK5ZPBJJH4NL5QODG5ZQ/linux-jdk10-m3.5.x_build/target/invoker-reports/BUILD-jpms_patch-module.xml, /home/jenkins/jenkins-slave/workspace/mpiler-plugin_MCOMPILER-335-VHQSXD2POT6OA2TVE7EHJ22XUOLAHEKCXK5ZPBJJH4NL5QODG5ZQ/linux-jdk10-m3.5.x_build/target/invoker-reports/BUILD-mcompiler-106.xml, /home/jenkins/jenkins-slave/workspace/mpiler-plugin_MCOMPILER-335-VHQSXD2POT6OA2TVE7EHJ22XUOLAHEKCXK5ZPBJJH4NL5QODG5ZQ/linux-jdk10-m3.5.x_build/target/invoker-reports/BUILD-mcompiler-120.xml, /home/jenkins/jenkins-slave/workspace/mpiler-plugin_MCOMPILER-335-VHQSXD2POT6OA2TVE7EHJ22XUOLAHEKCXK5ZPBJJH4NL5QODG5ZQ/linux-jdk10-m3.5.x_build/target/invoker-reports/BUILD-mcompiler-135.xml, /home/jenkins/jenkins-slave/workspace/mpiler-plugin_MCOMPILER-335-VHQSXD2POT6OA2TVE7EHJ22XUOLAHEKCXK5ZPBJJH4NL5QODG5ZQ/linux-jdk10-m3.5.x_build/target/invoker-reports/BUILD-mcompiler-179.xml, /home/jenkins/jenkins-slave/workspace/mpiler-plugin_MCOMPILER-335-VHQSXD2POT6OA2TVE7EHJ22XUOLAHEKCXK5ZPBJJH4NL5QODG5ZQ/linux-jdk10-m3.5.x_build/target/invoker-reports/BUILD-mcompiler-182.xml, /home/jenkins/jenkins-slave/workspace/mpiler-plugin_MCOMPILER-335-VHQSXD2POT6OA2TVE7EHJ22XUOLAHEKCXK5ZPBJJH4NL5QODG5ZQ/linux-jdk10-m3.5.x_build/target/invoker-reports/BUILD-mcompiler-21_class-remove.xml, /home/jenkins/jenkins-slave/workspace/mpiler-plugin_MCOMPILER-335-VHQSXD2POT6OA2TVE7EHJ22XUOLAHEKCXK5ZPBJJH4NL5QODG5ZQ/linux-jdk10-m3.5.x_build/target/invoker-reports/BUILD-mcompiler-21_methodname-change.xml, /home/jenkins/jenkins-slave/workspace/mpiler-plugin_MCOMPILER-335-VHQSXD2POT6OA2TVE7EHJ22XUOLAHEKCXK5ZPBJJH4NL5QODG5ZQ/linux-jdk10-m3.5.x_build/target/invoker-reports/BUILD-multirelease-patterns_multimodule.xml, /home/jenkins/jenkins-slave/workspace/mpiler-plugin_MCOMPILER-335-VHQSXD2POT6OA2TVE7EHJ22XUOLAHEKCXK5ZPBJJH4NL5QODG5ZQ/linux-jdk10-m3.5.x_build/target/invoker-reports/BUILD-multirelease-patterns_multiproject.xml, /home/jenkins/jenkins-slave/workspace/mpiler-plugin_MCOMPILER-335-VHQSXD2POT6OA2TVE7EHJ22XUOLAHEKCXK5ZPBJJH4NL5QODG5ZQ/linux-jdk10-m3.5.x_build/target/invoker-reports/BUILD-multirelease-patterns_packaging-plugin.xml, /home/jenkins/jenkins-slave/workspace/mpiler-plugin_MCOMPILER-335-VHQSXD2POT6OA2TVE7EHJ22XUOLAHEKCXK5ZPBJJH4NL5QODG5ZQ/linux-jdk10-m3.5.x_build/target/invoker-reports/BUILD-multirelease-patterns_singleproject-runtime.xml, /home/jenkins/jenkins-slave/workspace/mpiler-plugin_MCOMPILER-335-VHQSXD2POT6OA2TVE7EHJ22XUOLAHEKCXK5ZPBJJH4NL5QODG5ZQ/linux-jdk10-m3.5.x_build/target/invoker-reports/BUILD-non-english-warnings.xml, /home/jenkins/jenkins-slave/workspace/mpiler-plugin_MCOMPILER-335-VHQSXD2POT6OA2TVE7EHJ22XUOLAHEKCXK5ZPBJJH4NL5QODG5ZQ/linux-jdk10-m3.5.x_build/target/invoker-reports/BUILD-setup_jar_automodule.xml, /home/jenkins/jenkins-slave/workspace/mpiler-plugin_MCOMPILER-335-VHQSXD2POT6OA2TVE7EHJ22XUOLAHEKCXK5ZPBJJH4NL5QODG5ZQ/linux-jdk10-m3.5.x_build/target/invoker-reports/BUILD-setup_jar_module.xml, /home/jenkins/jenkins-slave/workspace/mpiler-plugin_MCOMPILER-335-VHQSXD2POT6OA2TVE7EHJ22XUOLAHEKCXK5ZPBJJH4NL5QODG5ZQ/linux-jdk10-m3.5.x_build/target/invoker-reports/BUILD-setup_x.xml, /home/jenkins/jenkins-slave/workspace/mpiler-plugin_MCOMPILER-335-VHQSXD2POT6OA2TVE7EHJ22XUOLAHEKCXK5ZPBJJH4NL5QODG5ZQ/linux-jdk10-m3.5.x_build/target/invoker-reports/BUILD-test1.xml]
[linux-jdk10-m3.5.x_build] Found logs:[/home/jenkins/jenkins-slave/workspace/mpiler-plugin_MCOMPILER-335-VHQSXD2POT6OA2TVE7EHJ22XUOLAHEKCXK5ZPBJJH4NL5QODG5ZQ/linux-jdk10-m3.5.x_build/target/it/MCOMPILER-129/build.log, /home/jenkins/jenkins-slave/workspace/mpiler-plugin_MCOMPILER-335-VHQSXD2POT6OA2TVE7EHJ22XUOLAHEKCXK5ZPBJJH4NL5QODG5ZQ/linux-jdk10-m3.5.x_build/target/it/MCOMPILER-157/build.log, /home/jenkins/jenkins-slave/workspace/mpiler-plugin_MCOMPILER-335-VHQSXD2POT6OA2TVE7EHJ22XUOLAHEKCXK5ZPBJJH4NL5QODG5ZQ/linux-jdk10-m3.5.x_build/target/it/MCOMPILER-170/build.log, /home/jenkins/jenkins-slave/workspace/mpiler-plugin_MCOMPILER-335-VHQSXD2POT6OA2TVE7EHJ22XUOLAHEKCXK5ZPBJJH4NL5QODG5ZQ/linux-jdk10-m3.5.x_build/target/it/MCOMPILER-190/build.log, /home/jenkins/jenkins-slave/workspace/mpiler-plugin_MCOMPILER-335-VHQSXD2POT6OA2TVE7EHJ22XUOLAHEKCXK5ZPBJJH4NL5QODG5ZQ/linux-jdk10-m3.5.x_build/target/it/MCOMPILER-192/build.log, /home/jenkins/jenkins-slave/workspace/mpiler-plugin_MCOMPILER-335-VHQSXD2POT6OA2TVE7EHJ22XUOLAHEKCXK5ZPBJJH4NL5QODG5ZQ/linux-jdk10-m3.5.x_build/target/it/MCOMPILER-203-processorpath/build.log, /home/jenkins/jenkins-slave/workspace/mpiler-plugin_MCOMPILER-335-VHQSXD2POT6OA2TVE7EHJ22XUOLAHEKCXK5ZPBJJH4NL5QODG5ZQ/linux-jdk10-m3.5.x_build/target/it/MCOMPILER-224/build.log, /home/jenkins/jenkins-slave/workspace/mpiler-plugin_MCOMPILER-335-VHQSXD2POT6OA2TVE7EHJ22XUOLAHEKCXK5ZPBJJH4NL5QODG5ZQ/linux-jdk10-m3.5.x_build/target/it/MCOMPILER-228/build.log, /home/jenkins/jenkins-slave/workspace/mpiler-plugin_MCOMPILER-335-VHQSXD2POT6OA2TVE7EHJ22XUOLAHEKCXK5ZPBJJH4NL5QODG5ZQ/linux-jdk10-m3.5.x_build/target/it/MCOMPILER-260_customArguments/build.log, /home/jenkins/jenkins-slave/workspace/mpiler-plugin_MCOMPILER-335-VHQSXD2POT6OA2TVE7EHJ22XUOLAHEKCXK5ZPBJJH4NL5QODG5ZQ/linux-jdk10-m3.5.x_build/target/it/MCOMPILER-268_modulepath/build.log, /home/jenkins/jenkins-slave/workspace/mpiler-plugin_MCOMPILER-335-VHQSXD2POT6OA2TVE7EHJ22XUOLAHEKCXK5ZPBJJH4NL5QODG5ZQ/linux-jdk10-m3.5.x_build/target/it/MCOMPILER-270_release/build.log, /home/jenkins/jenkins-slave/workspace/mpiler-plugin_MCOMPILER-335-VHQSXD2POT6OA2TVE7EHJ22XUOLAHEKCXK5ZPBJJH4NL5QODG5ZQ/linux-jdk10-m3.5.x_build/target/it/MCOMPILER-275_separate-moduleinfo/build.log, /home/jenkins/jenkins-slave/workspace/mpiler-plugin_MCOMPILER-335-VHQSXD2POT6OA2TVE7EHJ22XUOLAHEKCXK5ZPBJJH4NL5QODG5ZQ/linux-jdk10-m3.5.x_build/target/it/MCOMPILER-284/build.log, /home/jenkins/jenkins-slave/workspace/mpiler-plugin_MCOMPILER-335-VHQSXD2POT6OA2TVE7EHJ22XUOLAHEKCXK5ZPBJJH4NL5QODG5ZQ/linux-jdk10-m3.5.x_build/target/it/MCOMPILER-294/build.log, /home/jenkins/jenkins-slave/workspace/mpiler-plugin_MCOMPILER-335-VHQSXD2POT6OA2TVE7EHJ22XUOLAHEKCXK5ZPBJJH4NL5QODG5ZQ/linux-jdk10-m3.5.x_build/target/it/MCOMPILER-298/build.log, /home/jenkins/jenkins-slave/workspace/mpiler-plugin_MCOMPILER-335-VHQSXD2POT6OA2TVE7EHJ22XUOLAHEKCXK5ZPBJJH4NL5QODG5ZQ/linux-jdk10-m3.5.x_build/target/it/MCOMPILER-321_pathexceptions/build.log, /home/jenkins/jenkins-slave/workspace/mpiler-plugin_MCOMPILER-335-VHQSXD2POT6OA2TVE7EHJ22XUOLAHEKCXK5ZPBJJH4NL5QODG5ZQ/linux-jdk10-m3.5.x_build/target/it/MCOMPILER-322_release10/build.log, /home/jenkins/jenkins-slave/workspace/mpiler-plugin_MCOMPILER-335-VHQSXD2POT6OA2TVE7EHJ22XUOLAHEKCXK5ZPBJJH4NL5QODG5ZQ/linux-jdk10-m3.5.x_build/target/it/MCOMPILER-328_multiReleaseOutput/build.log, /home/jenkins/jenkins-slave/workspace/mpiler-plugin_MCOMPILER-335-VHQSXD2POT6OA2TVE7EHJ22XUOLAHEKCXK5ZPBJJH4NL5QODG5ZQ/linux-jdk10-m3.5.x_build/target/it/MCOMPILER-336_incremental-modulepath/build.log, /home/jenkins/jenkins-slave/workspace/mpiler-plugin_MCOMPILER-335-VHQSXD2POT6OA2TVE7EHJ22XUOLAHEKCXK5ZPBJJH4NL5QODG5ZQ/linux-jdk10-m3.5.x_build/target/it/automodules-application/build.log, /home/jenkins/jenkins-slave/workspace/mpiler-plugin_MCOMPILER-335-VHQSXD2POT6OA2TVE7EHJ22XUOLAHEKCXK5ZPBJJH4NL5QODG5ZQ/linux-jdk10-m3.5.x_build/target/it/automodules-library/build.log, /home/jenkins/jenkins-slave/workspace/mpiler-plugin_MCOMPILER-335-VHQSXD2POT6OA2TVE7EHJ22XUOLAHEKCXK5ZPBJJH4NL5QODG5ZQ/linux-jdk10-m3.5.x_build/target/it/automodules-manifest/build.log, /home/jenkins/jenkins-slave/workspace/mpiler-plugin_MCOMPILER-335-VHQSXD2POT6OA2TVE7EHJ22XUOLAHEKCXK5ZPBJJH4NL5QODG5ZQ/linux-jdk10-m3.5.x_build/target/it/automodules-transitive-module/build.log, /home/jenkins/jenkins-slave/workspace/mpiler-plugin_MCOMPILER-335-VHQSXD2POT6OA2TVE7EHJ22XUOLAHEKCXK5ZPBJJH4NL5QODG5ZQ/linux-jdk10-m3.5.x_build/target/it/default-incremental-disable/build.log, /home/jenkins/jenkins-slave/workspace/mpiler-plugin_MCOMPILER-335-VHQSXD2POT6OA2TVE7EHJ22XUOLAHEKCXK5ZPBJJH4NL5QODG5ZQ/linux-jdk10-m3.5.x_build/target/it/default/build.log, /home/jenkins/jenkins-slave/workspace/mpiler-plugin_MCOMPILER-335-VHQSXD2POT6OA2TVE7EHJ22XUOLAHEKCXK5ZPBJJH4NL5QODG5ZQ/linux-jdk10-m3.5.x_build/target/it/error-prone-compiler/build.log, /home/jenkins/jenkins-slave/workspace/mpiler-plugin_MCOMPILER-335-VHQSXD2POT6OA2TVE7EHJ22XUOLAHEKCXK5ZPBJJH4NL5QODG5ZQ/linux-jdk10-m3.5.x_build/target/it/includes-excludes/build.log, /home/jenkins/jenkins-slave/workspace/mpiler-plugin_MCOMPILER-335-VHQSXD2POT6OA2TVE7EHJ22XUOLAHEKCXK5ZPBJJH4NL5QODG5ZQ/linux-jdk10-m3.5.x_build/target/it/jdk16-annotation/build.log, /home/jenkins/jenkins-slave/workspace/mpiler-plugin_MCOMPILER-335-VHQSXD2POT6OA2TVE7EHJ22XUOLAHEKCXK5ZPBJJH4NL5QODG5ZQ/linux-jdk10-m3.5.x_build/target/it/jdk9-exportsto/build.log, /home/jenkins/jenkins-slave/workspace/mpiler-plugin_MCOMPILER-335-VHQSXD2POT6OA2TVE7EHJ22XUOLAHEKCXK5ZPBJJH4NL5QODG5ZQ/linux-jdk10-m3.5.x_build/target/it/jpms_add-exports/build.log, /home/jenkins/jenkins-slave/workspace/mpiler-plugin_MCOMPILER-335-VHQSXD2POT6OA2TVE7EHJ22XUOLAHEKCXK5ZPBJJH4NL5QODG5ZQ/linux-jdk10-m3.5.x_build/target/it/jpms_compile-main-empty-test-bar/build.log, /home/jenkins/jenkins-slave/workspace/mpiler-plugin_MCOMPILER-335-VHQSXD2POT6OA2TVE7EHJ22XUOLAHEKCXK5ZPBJJH4NL5QODG5ZQ/linux-jdk10-m3.5.x_build/target/it/jpms_compile-main-foo-test-bar/build.log, /home/jenkins/jenkins-slave/workspace/mpiler-plugin_MCOMPILER-335-VHQSXD2POT6OA2TVE7EHJ22XUOLAHEKCXK5ZPBJJH4NL5QODG5ZQ/linux-jdk10-m3.5.x_build/target/it/jpms_compile-main-foo-test-foo/build.log, /home/jenkins/jenkins-slave/workspace/mpiler-plugin_MCOMPILER-335-VHQSXD2POT6OA2TVE7EHJ22XUOLAHEKCXK5ZPBJJH4NL5QODG5ZQ/linux-jdk10-m3.5.x_build/target/it/jpms_patch-module/build.log, /home/jenkins/jenkins-slave/workspace/mpiler-plugin_MCOMPILER-335-VHQSXD2POT6OA2TVE7EHJ22XUOLAHEKCXK5ZPBJJH4NL5QODG5ZQ/linux-jdk10-m3.5.x_build/target/it/mcompiler-106/build.log, /home/jenkins/jenkins-slave/workspace/mpiler-plugin_MCOMPILER-335-VHQSXD2POT6OA2TVE7EHJ22XUOLAHEKCXK5ZPBJJH4NL5QODG5ZQ/linux-jdk10-m3.5.x_build/target/it/mcompiler-120/build.log, /home/jenkins/jenkins-slave/workspace/mpiler-plugin_MCOMPILER-335-VHQSXD2POT6OA2TVE7EHJ22XUOLAHEKCXK5ZPBJJH4NL5QODG5ZQ/linux-jdk10-m3.5.x_build/target/it/mcompiler-135/build.log, /home/jenkins/jenkins-slave/workspace/mpiler-plugin_MCOMPILER-335-VHQSXD2POT6OA2TVE7EHJ22XUOLAHEKCXK5ZPBJJH4NL5QODG5ZQ/linux-jdk10-m3.5.x_build/target/it/mcompiler-179/build.log, /home/jenkins/jenkins-slave/workspace/mpiler-plugin_MCOMPILER-335-VHQSXD2POT6OA2TVE7EHJ22XUOLAHEKCXK5ZPBJJH4NL5QODG5ZQ/linux-jdk10-m3.5.x_build/target/it/mcompiler-182/build.log, /home/jenkins/jenkins-slave/workspace/mpiler-plugin_MCOMPILER-335-VHQSXD2POT6OA2TVE7EHJ22XUOLAHEKCXK5ZPBJJH4NL5QODG5ZQ/linux-jdk10-m3.5.x_build/target/it/mcompiler-21_class-remove/build.log, /home/jenkins/jenkins-slave/workspace/mpiler-plugin_MCOMPILER-335-VHQSXD2POT6OA2TVE7EHJ22XUOLAHEKCXK5ZPBJJH4NL5QODG5ZQ/linux-jdk10-m3.5.x_build/target/it/mcompiler-21_methodname-change/build.log, /home/jenkins/jenkins-slave/workspace/mpiler-plugin_MCOMPILER-335-VHQSXD2POT6OA2TVE7EHJ22XUOLAHEKCXK5ZPBJJH4NL5QODG5ZQ/linux-jdk10-m3.5.x_build/target/it/multirelease-patterns/multimodule/build.log, /home/jenkins/jenkins-slave/workspace/mpiler-plugin_MCOMPILER-335-VHQSXD2POT6OA2TVE7EHJ22XUOLAHEKCXK5ZPBJJH4NL5QODG5ZQ/linux-jdk10-m3.5.x_build/target/it/multirelease-patterns/multiproject/build.log, /home/jenkins/jenkins-slave/workspace/mpiler-plugin_MCOMPILER-335-VHQSXD2POT6OA2TVE7EHJ22XUOLAHEKCXK5ZPBJJH4NL5QODG5ZQ/linux-jdk10-m3.5.x_build/target/it/multirelease-patterns/packaging-plugin/build.log, /home/jenkins/jenkins-slave/workspace/mpiler-plugin_MCOMPILER-335-VHQSXD2POT6OA2TVE7EHJ22XUOLAHEKCXK5ZPBJJH4NL5QODG5ZQ/linux-jdk10-m3.5.x_build/target/it/multirelease-patterns/singleproject-runtime/build.log, /home/jenkins/jenkins-slave/workspace/mpiler-plugin_MCOMPILER-335-VHQSXD2POT6OA2TVE7EHJ22XUOLAHEKCXK5ZPBJJH4NL5QODG5ZQ/linux-jdk10-m3.5.x_build/target/it/non-english-warnings/build.log, /home/jenkins/jenkins-slave/workspace/mpiler-plugin_MCOMPILER-335-VHQSXD2POT6OA2TVE7EHJ22XUOLAHEKCXK5ZPBJJH4NL5QODG5ZQ/linux-jdk10-m3.5.x_build/target/it/setup_jar_automodule/build.log, /home/jenkins/jenkins-slave/workspace/mpiler-plugin_MCOMPILER-335-VHQSXD2POT6OA2TVE7EHJ22XUOLAHEKCXK5ZPBJJH4NL5QODG5ZQ/linux-jdk10-m3.5.x_build/target/it/setup_jar_module/build.log, /home/jenkins/jenkins-slave/workspace/mpiler-plugin_MCOMPILER-335-VHQSXD2POT6OA2TVE7EHJ22XUOLAHEKCXK5ZPBJJH4NL5QODG5ZQ/linux-jdk10-m3.5.x_build/target/it/setup_x/build.log, /home/jenkins/jenkins-slave/workspace/mpiler-plugin_MCOMPILER-335-VHQSXD2POT6OA2TVE7EHJ22XUOLAHEKCXK5ZPBJJH4NL5QODG5ZQ/linux-jdk10-m3.5.x_build/target/it/test1/build.log]
[linux-jdk10-m3.5.x_build] Finished parsing Maven Invoker results (found 52)
[linux-jdk10-m3.5.x_build] [withMaven] junitPublisher - Archive test results for Maven artifact org.apache.maven.plugins:maven-compiler-plugin:3.7.1-SNAPSHOT generated by maven-surefire-plugin:test (default-test): linux-jdk10-m3.5.x_build/target/surefire-reports/*.xml
[linux-jdk10-m3.5.x_build] Recording test results
[linux-jdk10-m3.5.x_build] [withMaven] openTasksPublisher - Scan Tasks for Maven artifact org.apache.maven.plugins:maven-compiler-plugin:3.7.1-SNAPSHOT in source directory linux-jdk10-m3.5.x_build/src/main/java
[linux-jdk10-m3.5.x_build] [TASKS] Scanning folder '/home/jenkins/jenkins-slave/workspace/mpiler-plugin_MCOMPILER-335-VHQSXD2POT6OA2TVE7EHJ22XUOLAHEKCXK5ZPBJJH4NL5QODG5ZQ' for files matching the pattern 'linux-jdk10-m3.5.x_build/src/main/java/**/*' - excludes: null
[linux-jdk10-m3.5.x_build] [TASKS] Found 9 files to scan for tasks
[linux-jdk10-m3.5.x_build] [TASKS] Found 6 open tasks.
[linux-jdk10-m3.5.x_build] Skipping warnings blame since pipelines do not have an SCM link.%n
[Pipeline] [linux-jdk7-m3.0.x_build] // node
[Pipeline] [linux-jdk7-m3.2.x_build] // node
[Pipeline] [linux-jdk9-m3.5.x_build] // node
[Pipeline] [windows-jdk8-m3.5.x_build] // node
[Pipeline] [linux-jdk10-m3.5.x_build] // withMaven
[Pipeline] [linux-jdk7-m3.0.x_build] }
[Pipeline] [linux-jdk7-m3.2.x_build] }
[Pipeline] [linux-jdk9-m3.5.x_build] }
[Pipeline] [windows-jdk8-m3.5.x_build] }
[Pipeline] [linux-jdk10-m3.5.x_build] }
[Pipeline] [linux-jdk10-m3.5.x_build] // stage
[Pipeline] [linux-jdk10-m3.5.x_build] }
[Pipeline] [linux-jdk10-m3.5.x_build] // node
[Pipeline] [linux-jdk10-m3.5.x_build] }
[windows-jdk10-m3.5.x_build] [INFO] run post-build script verify.groovy
[windows-jdk10-m3.5.x_build] [INFO]           MCOMPILER-275_separate-moduleinfo\pom.xml ........ SUCCESS (6.2 s)
[windows-jdk10-m3.5.x_build] [INFO] Building: MCOMPILER-284\pom.xml
[windows-jdk10-m3.5.x_build] [INFO] run post-build script verify.bsh
[windows-jdk10-m3.5.x_build] [INFO]           MCOMPILER-284\pom.xml ............................ SUCCESS (5.6 s)
[windows-jdk10-m3.5.x_build] [INFO] Building: MCOMPILER-294\pom.xml
[windows-jdk10-m3.5.x_build] [INFO]           MCOMPILER-294\pom.xml ............................ SUCCESS (6.3 s)
[windows-jdk10-m3.5.x_build] [INFO] Building: MCOMPILER-298\pom.xml
[windows-jdk9-m3.5.x_build] [INFO] run post-build script verify.groovy
[windows-jdk9-m3.5.x_build] [INFO]           mcompiler-21_methodname-change\pom.xml ........... SUCCESS (22.6 s)
[windows-jdk9-m3.5.x_build] [INFO] Building: MCOMPILER-224\pom.xml
[windows-jdk9-m3.5.x_build] [INFO] run post-build script verify.groovy
[windows-jdk9-m3.5.x_build] [INFO]           MCOMPILER-224\pom.xml ............................ SUCCESS (7.4 s)
[windows-jdk9-m3.5.x_build] [INFO] Building: MCOMPILER-228\pom.xml
[windows-jdk10-m3.5.x_build] [INFO]           MCOMPILER-298\pom.xml ............................ SUCCESS (10.1 s)
[windows-jdk10-m3.5.x_build] [INFO] Building: MCOMPILER-321_pathexceptions\pom.xml
[Pipeline] [windows-jdk7-m3.5.x_build] }
[Pipeline] [windows-jdk7-m3.3.x_build] }
[Pipeline] [windows-jdk7-m3.5.x_build] // dir
[Pipeline] [windows-jdk7-m3.3.x_build] // dir
[Pipeline] [windows-jdk7-m3.5.x_build] echo
[windows-jdk7-m3.5.x_build] [FAIL FAST] This is the first failure and likely root cause
[Pipeline] [windows-jdk7-m3.5.x_build] }
[Pipeline] [windows-jdk7-m3.3.x_build] echo
[windows-jdk7-m3.3.x_build] [FAIL FAST] windows-jdk7-m3.5.x_build had first failure, ignoring java.nio.channels.ClosedChannelException
[Pipeline] [windows-jdk7-m3.3.x_build] }
[Pipeline] [windows-jdk7-m3.5.x_build] // stage
[Pipeline] [windows-jdk7-m3.3.x_build] // stage
[Pipeline] [windows-jdk7-m3.5.x_build] }
[Pipeline] [windows-jdk7-m3.3.x_build] stage
[Pipeline] [windows-jdk7-m3.3.x_build] { (Build windows-jdk7-m3.3.x_build)
[Pipeline] [windows-jdk7-m3.5.x_build] // node
[Pipeline] [windows-jdk7-m3.5.x_build] }
[windows-jdk7-m3.5.x_build] Failed in branch windows-jdk7-m3.5.x_build
[Pipeline] [windows-jdk7-m3.3.x_build] echo
[windows-jdk7-m3.3.x_build] [FAIL FAST] windows-jdk7-m3.5.x_build has failed. Skipping windows-jdk7-m3.3.x_build.
[Pipeline] [windows-jdk7-m3.3.x_build] }
[windows-jdk9-m3.5.x_build] Sending interrupt signal to process
[windows-jdk10-m3.5.x_build] Sending interrupt signal to process
[Pipeline] [windows-jdk7-m3.3.x_build] // stage
[Pipeline] [windows-jdk7-m3.3.x_build] }
[Pipeline] [windows-jdk7-m3.3.x_build] // node
[Pipeline] [windows-jdk7-m3.3.x_build] }
[windows-jdk10-m3.5.x_build] [INFO] run post-build script verify.groovy
[windows-jdk9-m3.5.x_build] [INFO]           MCOMPILER-228\pom.xml ............................ FAILED (5.8 s)
[windows-jdk9-m3.5.x_build] [INFO]   The build exited with code -1. See f:\jenkins\jenkins-slave\workspace\mpiler-plugin_MCOMPILER-335-VHQSXD2POT6OA2TVE7EHJ22XUOLAHEKCXK5ZPBJJH4NL5QODG5ZQ\windows-jdk9-m3.5.x_build\target\it\MCOMPILER-228\build.log for details.
[windows-jdk9-m3.5.x_build] [INFO] Building: MCOMPILER-260_customArguments\pom.xml
[Pipeline] [windows-jdk9-m3.5.x_build] }
[Pipeline] [windows-jdk9-m3.5.x_build] // dir
[Pipeline] [windows-jdk9-m3.5.x_build] }
[windows-jdk9-m3.5.x_build] [withMaven] One or multiple Maven executions have been ignored by the Jenkins Pipeline Maven Plugin because they have been interrupted before completion (1). See Pipeline Maven Plugin FAQ for more details.
[Pipeline] [windows-jdk9-m3.5.x_build] // withMaven
[Pipeline] [windows-jdk9-m3.5.x_build] echo
[windows-jdk9-m3.5.x_build] [FAIL FAST] windows-jdk7-m3.5.x_build had first failure, ignoring script returned exit code -1
[Pipeline] [windows-jdk9-m3.5.x_build] }
[Pipeline] [windows-jdk9-m3.5.x_build] // stage
[Pipeline] [windows-jdk9-m3.5.x_build] }
[Pipeline] [windows-jdk9-m3.5.x_build] // node
[Pipeline] [windows-jdk9-m3.5.x_build] }
[windows-jdk10-m3.5.x_build] After 10s process did not stop
[Pipeline] [windows-jdk10-m3.5.x_build] }
[Pipeline] [windows-jdk10-m3.5.x_build] // dir
[Pipeline] [windows-jdk10-m3.5.x_build] }
[windows-jdk10-m3.5.x_build] [withMaven] One or multiple Maven executions have been ignored by the Jenkins Pipeline Maven Plugin because they have been interrupted before completion (1). See Pipeline Maven Plugin FAQ for more details.
[Pipeline] [windows-jdk10-m3.5.x_build] // withMaven
[Pipeline] [windows-jdk10-m3.5.x_build] echo
[windows-jdk10-m3.5.x_build] [FAIL FAST] windows-jdk7-m3.5.x_build had first failure, ignoring null
[Pipeline] [windows-jdk10-m3.5.x_build] }
[Pipeline] [windows-jdk10-m3.5.x_build] // stage
[Pipeline] [windows-jdk10-m3.5.x_build] }
[Pipeline] [windows-jdk10-m3.5.x_build] // node
[Pipeline] [windows-jdk10-m3.5.x_build] }
[Pipeline] // parallel
[Pipeline] echo
***** FAST FAILURE *****

Fast failure triggered by windows-jdk7-m3.5.x_build

***** FAST FAILURE *****
[Pipeline] stage
[Pipeline] { (Notifications)
[Pipeline] echo
Build result: FAILURE
[Pipeline] jiraIssueSelector
[Pipeline] emailext
Mime
  • Unnamed multipart/mixed (inline, None, 0 bytes)
View raw message