maven-notifications mailing list archives

Site index · List index
Message view « Date » · « Thread »
Top « Date » · « Thread »
From Apache Jenkins Server <jenk...@builds.apache.org>
Subject Build unstable in Jenkins: Maven TLP » maven-runtime » master #6
Date Sat, 14 Jul 2018 03:18:17 GMT
See https://builds.apache.org/job/maven-box/job/maven-runtime/job/master/6/

No changes.

80 tests failed.
FAILED:  org.apache.maven.shared.runtime.DefaultMavenRuntimeTest.testGetProjectsPropertiesWithSingleJar

Error Message:
Error building test project expected:<0> but was:<1>

Stack Trace:
junit.framework.AssertionFailedError: Error building test project expected:<0> but was:<1>
	at junit.framework.Assert.fail(Assert.java:47)
	at junit.framework.Assert.failNotEquals(Assert.java:282)
	at junit.framework.Assert.assertEquals(Assert.java:64)
	at junit.framework.Assert.assertEquals(Assert.java:201)
	at org.apache.maven.shared.runtime.DefaultMavenRuntimeTest.packageProject(DefaultMavenRuntimeTest.java:682)
	at org.apache.maven.shared.runtime.DefaultMavenRuntimeTest.setUp(DefaultMavenRuntimeTest.java:74)
	at junit.framework.TestCase.runBare(TestCase.java:125)
	at junit.framework.TestResult$1.protect(TestResult.java:106)
	at junit.framework.TestResult.runProtected(TestResult.java:124)
	at junit.framework.TestResult.run(TestResult.java:109)
	at junit.framework.TestCase.run(TestCase.java:118)
	at junit.framework.TestSuite.runTest(TestSuite.java:208)
	at junit.framework.TestSuite.run(TestSuite.java:203)
	at sun.reflect.NativeMethodAccessorImpl.invoke0(Native Method)
	at sun.reflect.NativeMethodAccessorImpl.invoke(NativeMethodAccessorImpl.java:57)
	at sun.reflect.DelegatingMethodAccessorImpl.invoke(DelegatingMethodAccessorImpl.java:43)
	at java.lang.reflect.Method.invoke(Method.java:606)
	at org.apache.maven.surefire.junit.JUnitTestSet.execute(JUnitTestSet.java:99)
	at org.apache.maven.surefire.junit.JUnit3Provider.executeTestSet(JUnit3Provider.java:136)
	at org.apache.maven.surefire.junit.JUnit3Provider.invoke(JUnit3Provider.java:109)
	at org.apache.maven.surefire.booter.ForkedBooter.invokeProviderInSameClassLoader(ForkedBooter.java:290)
	at org.apache.maven.surefire.booter.ForkedBooter.runSuitesInProcess(ForkedBooter.java:242)
	at org.apache.maven.surefire.booter.ForkedBooter.main(ForkedBooter.java:121)


FAILED:  org.apache.maven.shared.runtime.DefaultMavenRuntimeTest.testGetProjectsPropertiesWithMultipleJars

Error Message:
Error building test project expected:<0> but was:<1>

Stack Trace:
junit.framework.AssertionFailedError: Error building test project expected:<0> but was:<1>
	at junit.framework.Assert.fail(Assert.java:47)
	at junit.framework.Assert.failNotEquals(Assert.java:282)
	at junit.framework.Assert.assertEquals(Assert.java:64)
	at junit.framework.Assert.assertEquals(Assert.java:201)
	at org.apache.maven.shared.runtime.DefaultMavenRuntimeTest.packageProject(DefaultMavenRuntimeTest.java:682)
	at org.apache.maven.shared.runtime.DefaultMavenRuntimeTest.setUp(DefaultMavenRuntimeTest.java:74)
	at junit.framework.TestCase.runBare(TestCase.java:125)
	at junit.framework.TestResult$1.protect(TestResult.java:106)
	at junit.framework.TestResult.runProtected(TestResult.java:124)
	at junit.framework.TestResult.run(TestResult.java:109)
	at junit.framework.TestCase.run(TestCase.java:118)
	at junit.framework.TestSuite.runTest(TestSuite.java:208)
	at junit.framework.TestSuite.run(TestSuite.java:203)
	at sun.reflect.NativeMethodAccessorImpl.invoke0(Native Method)
	at sun.reflect.NativeMethodAccessorImpl.invoke(NativeMethodAccessorImpl.java:57)
	at sun.reflect.DelegatingMethodAccessorImpl.invoke(DelegatingMethodAccessorImpl.java:43)
	at java.lang.reflect.Method.invoke(Method.java:606)
	at org.apache.maven.surefire.junit.JUnitTestSet.execute(JUnitTestSet.java:99)
	at org.apache.maven.surefire.junit.JUnit3Provider.executeTestSet(JUnit3Provider.java:136)
	at org.apache.maven.surefire.junit.JUnit3Provider.invoke(JUnit3Provider.java:109)
	at org.apache.maven.surefire.booter.ForkedBooter.invokeProviderInSameClassLoader(ForkedBooter.java:290)
	at org.apache.maven.surefire.booter.ForkedBooter.runSuitesInProcess(ForkedBooter.java:242)
	at org.apache.maven.surefire.booter.ForkedBooter.main(ForkedBooter.java:121)


FAILED:  org.apache.maven.shared.runtime.DefaultMavenRuntimeTest.testGetProjectsPropertiesWithMultipleVersions

Error Message:
Error building test project expected:<0> but was:<1>

Stack Trace:
junit.framework.AssertionFailedError: Error building test project expected:<0> but was:<1>
	at junit.framework.Assert.fail(Assert.java:47)
	at junit.framework.Assert.failNotEquals(Assert.java:282)
	at junit.framework.Assert.assertEquals(Assert.java:64)
	at junit.framework.Assert.assertEquals(Assert.java:201)
	at org.apache.maven.shared.runtime.DefaultMavenRuntimeTest.packageProject(DefaultMavenRuntimeTest.java:682)
	at org.apache.maven.shared.runtime.DefaultMavenRuntimeTest.setUp(DefaultMavenRuntimeTest.java:74)
	at junit.framework.TestCase.runBare(TestCase.java:125)
	at junit.framework.TestResult$1.protect(TestResult.java:106)
	at junit.framework.TestResult.runProtected(TestResult.java:124)
	at junit.framework.TestResult.run(TestResult.java:109)
	at junit.framework.TestCase.run(TestCase.java:118)
	at junit.framework.TestSuite.runTest(TestSuite.java:208)
	at junit.framework.TestSuite.run(TestSuite.java:203)
	at sun.reflect.NativeMethodAccessorImpl.invoke0(Native Method)
	at sun.reflect.NativeMethodAccessorImpl.invoke(NativeMethodAccessorImpl.java:57)
	at sun.reflect.DelegatingMethodAccessorImpl.invoke(DelegatingMethodAccessorImpl.java:43)
	at java.lang.reflect.Method.invoke(Method.java:606)
	at org.apache.maven.surefire.junit.JUnitTestSet.execute(JUnitTestSet.java:99)
	at org.apache.maven.surefire.junit.JUnit3Provider.executeTestSet(JUnit3Provider.java:136)
	at org.apache.maven.surefire.junit.JUnit3Provider.invoke(JUnit3Provider.java:109)
	at org.apache.maven.surefire.booter.ForkedBooter.invokeProviderInSameClassLoader(ForkedBooter.java:290)
	at org.apache.maven.surefire.booter.ForkedBooter.runSuitesInProcess(ForkedBooter.java:242)
	at org.apache.maven.surefire.booter.ForkedBooter.main(ForkedBooter.java:121)


FAILED:  org.apache.maven.shared.runtime.DefaultMavenRuntimeTest.testGetProjectsPropertiesWithMultipleVersionsReversed

Error Message:
Error building test project expected:<0> but was:<1>

Stack Trace:
junit.framework.AssertionFailedError: Error building test project expected:<0> but was:<1>
	at junit.framework.Assert.fail(Assert.java:47)
	at junit.framework.Assert.failNotEquals(Assert.java:282)
	at junit.framework.Assert.assertEquals(Assert.java:64)
	at junit.framework.Assert.assertEquals(Assert.java:201)
	at org.apache.maven.shared.runtime.DefaultMavenRuntimeTest.packageProject(DefaultMavenRuntimeTest.java:682)
	at org.apache.maven.shared.runtime.DefaultMavenRuntimeTest.setUp(DefaultMavenRuntimeTest.java:74)
	at junit.framework.TestCase.runBare(TestCase.java:125)
	at junit.framework.TestResult$1.protect(TestResult.java:106)
	at junit.framework.TestResult.runProtected(TestResult.java:124)
	at junit.framework.TestResult.run(TestResult.java:109)
	at junit.framework.TestCase.run(TestCase.java:118)
	at junit.framework.TestSuite.runTest(TestSuite.java:208)
	at junit.framework.TestSuite.run(TestSuite.java:203)
	at sun.reflect.NativeMethodAccessorImpl.invoke0(Native Method)
	at sun.reflect.NativeMethodAccessorImpl.invoke(NativeMethodAccessorImpl.java:57)
	at sun.reflect.DelegatingMethodAccessorImpl.invoke(DelegatingMethodAccessorImpl.java:43)
	at java.lang.reflect.Method.invoke(Method.java:606)
	at org.apache.maven.surefire.junit.JUnitTestSet.execute(JUnitTestSet.java:99)
	at org.apache.maven.surefire.junit.JUnit3Provider.executeTestSet(JUnit3Provider.java:136)
	at org.apache.maven.surefire.junit.JUnit3Provider.invoke(JUnit3Provider.java:109)
	at org.apache.maven.surefire.booter.ForkedBooter.invokeProviderInSameClassLoader(ForkedBooter.java:290)
	at org.apache.maven.surefire.booter.ForkedBooter.runSuitesInProcess(ForkedBooter.java:242)
	at org.apache.maven.surefire.booter.ForkedBooter.main(ForkedBooter.java:121)


FAILED:  org.apache.maven.shared.runtime.DefaultMavenRuntimeTest.testGetProjectsPropertiesWithParentDelegation

Error Message:
Error building test project expected:<0> but was:<1>

Stack Trace:
junit.framework.AssertionFailedError: Error building test project expected:<0> but was:<1>
	at junit.framework.Assert.fail(Assert.java:47)
	at junit.framework.Assert.failNotEquals(Assert.java:282)
	at junit.framework.Assert.assertEquals(Assert.java:64)
	at junit.framework.Assert.assertEquals(Assert.java:201)
	at org.apache.maven.shared.runtime.DefaultMavenRuntimeTest.packageProject(DefaultMavenRuntimeTest.java:682)
	at org.apache.maven.shared.runtime.DefaultMavenRuntimeTest.setUp(DefaultMavenRuntimeTest.java:74)
	at junit.framework.TestCase.runBare(TestCase.java:125)
	at junit.framework.TestResult$1.protect(TestResult.java:106)
	at junit.framework.TestResult.runProtected(TestResult.java:124)
	at junit.framework.TestResult.run(TestResult.java:109)
	at junit.framework.TestCase.run(TestCase.java:118)
	at junit.framework.TestSuite.runTest(TestSuite.java:208)
	at junit.framework.TestSuite.run(TestSuite.java:203)
	at sun.reflect.NativeMethodAccessorImpl.invoke0(Native Method)
	at sun.reflect.NativeMethodAccessorImpl.invoke(NativeMethodAccessorImpl.java:57)
	at sun.reflect.DelegatingMethodAccessorImpl.invoke(DelegatingMethodAccessorImpl.java:43)
	at java.lang.reflect.Method.invoke(Method.java:606)
	at org.apache.maven.surefire.junit.JUnitTestSet.execute(JUnitTestSet.java:99)
	at org.apache.maven.surefire.junit.JUnit3Provider.executeTestSet(JUnit3Provider.java:136)
	at org.apache.maven.surefire.junit.JUnit3Provider.invoke(JUnit3Provider.java:109)
	at org.apache.maven.surefire.booter.ForkedBooter.invokeProviderInSameClassLoader(ForkedBooter.java:290)
	at org.apache.maven.surefire.booter.ForkedBooter.runSuitesInProcess(ForkedBooter.java:242)
	at org.apache.maven.surefire.booter.ForkedBooter.main(ForkedBooter.java:121)


FAILED:  org.apache.maven.shared.runtime.DefaultMavenRuntimeTest.testGetProjectsPropertiesWithChildDelegation

Error Message:
Error building test project expected:<0> but was:<1>

Stack Trace:
junit.framework.AssertionFailedError: Error building test project expected:<0> but was:<1>
	at junit.framework.Assert.fail(Assert.java:47)
	at junit.framework.Assert.failNotEquals(Assert.java:282)
	at junit.framework.Assert.assertEquals(Assert.java:64)
	at junit.framework.Assert.assertEquals(Assert.java:201)
	at org.apache.maven.shared.runtime.DefaultMavenRuntimeTest.packageProject(DefaultMavenRuntimeTest.java:682)
	at org.apache.maven.shared.runtime.DefaultMavenRuntimeTest.setUp(DefaultMavenRuntimeTest.java:74)
	at junit.framework.TestCase.runBare(TestCase.java:125)
	at junit.framework.TestResult$1.protect(TestResult.java:106)
	at junit.framework.TestResult.runProtected(TestResult.java:124)
	at junit.framework.TestResult.run(TestResult.java:109)
	at junit.framework.TestCase.run(TestCase.java:118)
	at junit.framework.TestSuite.runTest(TestSuite.java:208)
	at junit.framework.TestSuite.run(TestSuite.java:203)
	at sun.reflect.NativeMethodAccessorImpl.invoke0(Native Method)
	at sun.reflect.NativeMethodAccessorImpl.invoke(NativeMethodAccessorImpl.java:57)
	at sun.reflect.DelegatingMethodAccessorImpl.invoke(DelegatingMethodAccessorImpl.java:43)
	at java.lang.reflect.Method.invoke(Method.java:606)
	at org.apache.maven.surefire.junit.JUnitTestSet.execute(JUnitTestSet.java:99)
	at org.apache.maven.surefire.junit.JUnit3Provider.executeTestSet(JUnit3Provider.java:136)
	at org.apache.maven.surefire.junit.JUnit3Provider.invoke(JUnit3Provider.java:109)
	at org.apache.maven.surefire.booter.ForkedBooter.invokeProviderInSameClassLoader(ForkedBooter.java:290)
	at org.apache.maven.surefire.booter.ForkedBooter.runSuitesInProcess(ForkedBooter.java:242)
	at org.apache.maven.surefire.booter.ForkedBooter.main(ForkedBooter.java:121)


FAILED:  org.apache.maven.shared.runtime.DefaultMavenRuntimeTest.testGetProjectWithFileUrl

Error Message:
Error building test project expected:<0> but was:<1>

Stack Trace:
junit.framework.AssertionFailedError: Error building test project expected:<0> but was:<1>
	at junit.framework.Assert.fail(Assert.java:47)
	at junit.framework.Assert.failNotEquals(Assert.java:282)
	at junit.framework.Assert.assertEquals(Assert.java:64)
	at junit.framework.Assert.assertEquals(Assert.java:201)
	at org.apache.maven.shared.runtime.DefaultMavenRuntimeTest.packageProject(DefaultMavenRuntimeTest.java:682)
	at org.apache.maven.shared.runtime.DefaultMavenRuntimeTest.setUp(DefaultMavenRuntimeTest.java:74)
	at junit.framework.TestCase.runBare(TestCase.java:125)
	at junit.framework.TestResult$1.protect(TestResult.java:106)
	at junit.framework.TestResult.runProtected(TestResult.java:124)
	at junit.framework.TestResult.run(TestResult.java:109)
	at junit.framework.TestCase.run(TestCase.java:118)
	at junit.framework.TestSuite.runTest(TestSuite.java:208)
	at junit.framework.TestSuite.run(TestSuite.java:203)
	at sun.reflect.NativeMethodAccessorImpl.invoke0(Native Method)
	at sun.reflect.NativeMethodAccessorImpl.invoke(NativeMethodAccessorImpl.java:57)
	at sun.reflect.DelegatingMethodAccessorImpl.invoke(DelegatingMethodAccessorImpl.java:43)
	at java.lang.reflect.Method.invoke(Method.java:606)
	at org.apache.maven.surefire.junit.JUnitTestSet.execute(JUnitTestSet.java:99)
	at org.apache.maven.surefire.junit.JUnit3Provider.executeTestSet(JUnit3Provider.java:136)
	at org.apache.maven.surefire.junit.JUnit3Provider.invoke(JUnit3Provider.java:109)
	at org.apache.maven.surefire.booter.ForkedBooter.invokeProviderInSameClassLoader(ForkedBooter.java:290)
	at org.apache.maven.surefire.booter.ForkedBooter.runSuitesInProcess(ForkedBooter.java:242)
	at org.apache.maven.surefire.booter.ForkedBooter.main(ForkedBooter.java:121)


FAILED:  org.apache.maven.shared.runtime.DefaultMavenRuntimeTest.testGetProjectWithJarUrl

Error Message:
Error building test project expected:<0> but was:<1>

Stack Trace:
junit.framework.AssertionFailedError: Error building test project expected:<0> but was:<1>
	at junit.framework.Assert.fail(Assert.java:47)
	at junit.framework.Assert.failNotEquals(Assert.java:282)
	at junit.framework.Assert.assertEquals(Assert.java:64)
	at junit.framework.Assert.assertEquals(Assert.java:201)
	at org.apache.maven.shared.runtime.DefaultMavenRuntimeTest.packageProject(DefaultMavenRuntimeTest.java:682)
	at org.apache.maven.shared.runtime.DefaultMavenRuntimeTest.setUp(DefaultMavenRuntimeTest.java:74)
	at junit.framework.TestCase.runBare(TestCase.java:125)
	at junit.framework.TestResult$1.protect(TestResult.java:106)
	at junit.framework.TestResult.runProtected(TestResult.java:124)
	at junit.framework.TestResult.run(TestResult.java:109)
	at junit.framework.TestCase.run(TestCase.java:118)
	at junit.framework.TestSuite.runTest(TestSuite.java:208)
	at junit.framework.TestSuite.run(TestSuite.java:203)
	at sun.reflect.NativeMethodAccessorImpl.invoke0(Native Method)
	at sun.reflect.NativeMethodAccessorImpl.invoke(NativeMethodAccessorImpl.java:57)
	at sun.reflect.DelegatingMethodAccessorImpl.invoke(DelegatingMethodAccessorImpl.java:43)
	at java.lang.reflect.Method.invoke(Method.java:606)
	at org.apache.maven.surefire.junit.JUnitTestSet.execute(JUnitTestSet.java:99)
	at org.apache.maven.surefire.junit.JUnit3Provider.executeTestSet(JUnit3Provider.java:136)
	at org.apache.maven.surefire.junit.JUnit3Provider.invoke(JUnit3Provider.java:109)
	at org.apache.maven.surefire.booter.ForkedBooter.invokeProviderInSameClassLoader(ForkedBooter.java:290)
	at org.apache.maven.surefire.booter.ForkedBooter.runSuitesInProcess(ForkedBooter.java:242)
	at org.apache.maven.surefire.booter.ForkedBooter.main(ForkedBooter.java:121)


FAILED:  org.apache.maven.shared.runtime.DefaultMavenRuntimeTest.testGetProjectWithJarEntryUrl

Error Message:
Error building test project expected:<0> but was:<1>

Stack Trace:
junit.framework.AssertionFailedError: Error building test project expected:<0> but was:<1>
	at junit.framework.Assert.fail(Assert.java:47)
	at junit.framework.Assert.failNotEquals(Assert.java:282)
	at junit.framework.Assert.assertEquals(Assert.java:64)
	at junit.framework.Assert.assertEquals(Assert.java:201)
	at org.apache.maven.shared.runtime.DefaultMavenRuntimeTest.packageProject(DefaultMavenRuntimeTest.java:682)
	at org.apache.maven.shared.runtime.DefaultMavenRuntimeTest.setUp(DefaultMavenRuntimeTest.java:74)
	at junit.framework.TestCase.runBare(TestCase.java:125)
	at junit.framework.TestResult$1.protect(TestResult.java:106)
	at junit.framework.TestResult.runProtected(TestResult.java:124)
	at junit.framework.TestResult.run(TestResult.java:109)
	at junit.framework.TestCase.run(TestCase.java:118)
	at junit.framework.TestSuite.runTest(TestSuite.java:208)
	at junit.framework.TestSuite.run(TestSuite.java:203)
	at sun.reflect.NativeMethodAccessorImpl.invoke0(Native Method)
	at sun.reflect.NativeMethodAccessorImpl.invoke(NativeMethodAccessorImpl.java:57)
	at sun.reflect.DelegatingMethodAccessorImpl.invoke(DelegatingMethodAccessorImpl.java:43)
	at java.lang.reflect.Method.invoke(Method.java:606)
	at org.apache.maven.surefire.junit.JUnitTestSet.execute(JUnitTestSet.java:99)
	at org.apache.maven.surefire.junit.JUnit3Provider.executeTestSet(JUnit3Provider.java:136)
	at org.apache.maven.surefire.junit.JUnit3Provider.invoke(JUnit3Provider.java:109)
	at org.apache.maven.surefire.booter.ForkedBooter.invokeProviderInSameClassLoader(ForkedBooter.java:290)
	at org.apache.maven.surefire.booter.ForkedBooter.runSuitesInProcess(ForkedBooter.java:242)
	at org.apache.maven.surefire.booter.ForkedBooter.main(ForkedBooter.java:121)


FAILED:  org.apache.maven.shared.runtime.DefaultMavenRuntimeTest.testGetProjectWithDefaultPackageClass

Error Message:
Error building test project expected:<0> but was:<1>

Stack Trace:
junit.framework.AssertionFailedError: Error building test project expected:<0> but was:<1>
	at junit.framework.Assert.fail(Assert.java:47)
	at junit.framework.Assert.failNotEquals(Assert.java:282)
	at junit.framework.Assert.assertEquals(Assert.java:64)
	at junit.framework.Assert.assertEquals(Assert.java:201)
	at org.apache.maven.shared.runtime.DefaultMavenRuntimeTest.packageProject(DefaultMavenRuntimeTest.java:682)
	at org.apache.maven.shared.runtime.DefaultMavenRuntimeTest.setUp(DefaultMavenRuntimeTest.java:74)
	at junit.framework.TestCase.runBare(TestCase.java:125)
	at junit.framework.TestResult$1.protect(TestResult.java:106)
	at junit.framework.TestResult.runProtected(TestResult.java:124)
	at junit.framework.TestResult.run(TestResult.java:109)
	at junit.framework.TestCase.run(TestCase.java:118)
	at junit.framework.TestSuite.runTest(TestSuite.java:208)
	at junit.framework.TestSuite.run(TestSuite.java:203)
	at sun.reflect.NativeMethodAccessorImpl.invoke0(Native Method)
	at sun.reflect.NativeMethodAccessorImpl.invoke(NativeMethodAccessorImpl.java:57)
	at sun.reflect.DelegatingMethodAccessorImpl.invoke(DelegatingMethodAccessorImpl.java:43)
	at java.lang.reflect.Method.invoke(Method.java:606)
	at org.apache.maven.surefire.junit.JUnitTestSet.execute(JUnitTestSet.java:99)
	at org.apache.maven.surefire.junit.JUnit3Provider.executeTestSet(JUnit3Provider.java:136)
	at org.apache.maven.surefire.junit.JUnit3Provider.invoke(JUnit3Provider.java:109)
	at org.apache.maven.surefire.booter.ForkedBooter.invokeProviderInSameClassLoader(ForkedBooter.java:290)
	at org.apache.maven.surefire.booter.ForkedBooter.runSuitesInProcess(ForkedBooter.java:242)
	at org.apache.maven.surefire.booter.ForkedBooter.main(ForkedBooter.java:121)


FAILED:  org.apache.maven.shared.runtime.DefaultMavenRuntimeTest.testGetProjectWithPackagedClass

Error Message:
Error building test project expected:<0> but was:<1>

Stack Trace:
junit.framework.AssertionFailedError: Error building test project expected:<0> but was:<1>
	at junit.framework.Assert.fail(Assert.java:47)
	at junit.framework.Assert.failNotEquals(Assert.java:282)
	at junit.framework.Assert.assertEquals(Assert.java:64)
	at junit.framework.Assert.assertEquals(Assert.java:201)
	at org.apache.maven.shared.runtime.DefaultMavenRuntimeTest.packageProject(DefaultMavenRuntimeTest.java:682)
	at org.apache.maven.shared.runtime.DefaultMavenRuntimeTest.setUp(DefaultMavenRuntimeTest.java:74)
	at junit.framework.TestCase.runBare(TestCase.java:125)
	at junit.framework.TestResult$1.protect(TestResult.java:106)
	at junit.framework.TestResult.runProtected(TestResult.java:124)
	at junit.framework.TestResult.run(TestResult.java:109)
	at junit.framework.TestCase.run(TestCase.java:118)
	at junit.framework.TestSuite.runTest(TestSuite.java:208)
	at junit.framework.TestSuite.run(TestSuite.java:203)
	at sun.reflect.NativeMethodAccessorImpl.invoke0(Native Method)
	at sun.reflect.NativeMethodAccessorImpl.invoke(NativeMethodAccessorImpl.java:57)
	at sun.reflect.DelegatingMethodAccessorImpl.invoke(DelegatingMethodAccessorImpl.java:43)
	at java.lang.reflect.Method.invoke(Method.java:606)
	at org.apache.maven.surefire.junit.JUnitTestSet.execute(JUnitTestSet.java:99)
	at org.apache.maven.surefire.junit.JUnit3Provider.executeTestSet(JUnit3Provider.java:136)
	at org.apache.maven.surefire.junit.JUnit3Provider.invoke(JUnit3Provider.java:109)
	at org.apache.maven.surefire.booter.ForkedBooter.invokeProviderInSameClassLoader(ForkedBooter.java:290)
	at org.apache.maven.surefire.booter.ForkedBooter.runSuitesInProcess(ForkedBooter.java:242)
	at org.apache.maven.surefire.booter.ForkedBooter.main(ForkedBooter.java:121)


FAILED:  org.apache.maven.shared.runtime.DefaultMavenRuntimeTest.testGetProjectWithSubPackagedClass

Error Message:
Error building test project expected:<0> but was:<1>

Stack Trace:
junit.framework.AssertionFailedError: Error building test project expected:<0> but was:<1>
	at junit.framework.Assert.fail(Assert.java:47)
	at junit.framework.Assert.failNotEquals(Assert.java:282)
	at junit.framework.Assert.assertEquals(Assert.java:64)
	at junit.framework.Assert.assertEquals(Assert.java:201)
	at org.apache.maven.shared.runtime.DefaultMavenRuntimeTest.packageProject(DefaultMavenRuntimeTest.java:682)
	at org.apache.maven.shared.runtime.DefaultMavenRuntimeTest.setUp(DefaultMavenRuntimeTest.java:74)
	at junit.framework.TestCase.runBare(TestCase.java:125)
	at junit.framework.TestResult$1.protect(TestResult.java:106)
	at junit.framework.TestResult.runProtected(TestResult.java:124)
	at junit.framework.TestResult.run(TestResult.java:109)
	at junit.framework.TestCase.run(TestCase.java:118)
	at junit.framework.TestSuite.runTest(TestSuite.java:208)
	at junit.framework.TestSuite.run(TestSuite.java:203)
	at sun.reflect.NativeMethodAccessorImpl.invoke0(Native Method)
	at sun.reflect.NativeMethodAccessorImpl.invoke(NativeMethodAccessorImpl.java:57)
	at sun.reflect.DelegatingMethodAccessorImpl.invoke(DelegatingMethodAccessorImpl.java:43)
	at java.lang.reflect.Method.invoke(Method.java:606)
	at org.apache.maven.surefire.junit.JUnitTestSet.execute(JUnitTestSet.java:99)
	at org.apache.maven.surefire.junit.JUnit3Provider.executeTestSet(JUnit3Provider.java:136)
	at org.apache.maven.surefire.junit.JUnit3Provider.invoke(JUnit3Provider.java:109)
	at org.apache.maven.surefire.booter.ForkedBooter.invokeProviderInSameClassLoader(ForkedBooter.java:290)
	at org.apache.maven.surefire.booter.ForkedBooter.runSuitesInProcess(ForkedBooter.java:242)
	at org.apache.maven.surefire.booter.ForkedBooter.main(ForkedBooter.java:121)


FAILED:  org.apache.maven.shared.runtime.DefaultMavenRuntimeTest.testGetProjectWithMultipleVersions

Error Message:
Error building test project expected:<0> but was:<1>

Stack Trace:
junit.framework.AssertionFailedError: Error building test project expected:<0> but was:<1>
	at junit.framework.Assert.fail(Assert.java:47)
	at junit.framework.Assert.failNotEquals(Assert.java:282)
	at junit.framework.Assert.assertEquals(Assert.java:64)
	at junit.framework.Assert.assertEquals(Assert.java:201)
	at org.apache.maven.shared.runtime.DefaultMavenRuntimeTest.packageProject(DefaultMavenRuntimeTest.java:682)
	at org.apache.maven.shared.runtime.DefaultMavenRuntimeTest.setUp(DefaultMavenRuntimeTest.java:74)
	at junit.framework.TestCase.runBare(TestCase.java:125)
	at junit.framework.TestResult$1.protect(TestResult.java:106)
	at junit.framework.TestResult.runProtected(TestResult.java:124)
	at junit.framework.TestResult.run(TestResult.java:109)
	at junit.framework.TestCase.run(TestCase.java:118)
	at junit.framework.TestSuite.runTest(TestSuite.java:208)
	at junit.framework.TestSuite.run(TestSuite.java:203)
	at sun.reflect.NativeMethodAccessorImpl.invoke0(Native Method)
	at sun.reflect.NativeMethodAccessorImpl.invoke(NativeMethodAccessorImpl.java:57)
	at sun.reflect.DelegatingMethodAccessorImpl.invoke(DelegatingMethodAccessorImpl.java:43)
	at java.lang.reflect.Method.invoke(Method.java:606)
	at org.apache.maven.surefire.junit.JUnitTestSet.execute(JUnitTestSet.java:99)
	at org.apache.maven.surefire.junit.JUnit3Provider.executeTestSet(JUnit3Provider.java:136)
	at org.apache.maven.surefire.junit.JUnit3Provider.invoke(JUnit3Provider.java:109)
	at org.apache.maven.surefire.booter.ForkedBooter.invokeProviderInSameClassLoader(ForkedBooter.java:290)
	at org.apache.maven.surefire.booter.ForkedBooter.runSuitesInProcess(ForkedBooter.java:242)
	at org.apache.maven.surefire.booter.ForkedBooter.main(ForkedBooter.java:121)


FAILED:  org.apache.maven.shared.runtime.DefaultMavenRuntimeTest.testGetProjectWithMultipleVersionsReversed

Error Message:
Error building test project expected:<0> but was:<1>

Stack Trace:
junit.framework.AssertionFailedError: Error building test project expected:<0> but was:<1>
	at junit.framework.Assert.fail(Assert.java:47)
	at junit.framework.Assert.failNotEquals(Assert.java:282)
	at junit.framework.Assert.assertEquals(Assert.java:64)
	at junit.framework.Assert.assertEquals(Assert.java:201)
	at org.apache.maven.shared.runtime.DefaultMavenRuntimeTest.packageProject(DefaultMavenRuntimeTest.java:682)
	at org.apache.maven.shared.runtime.DefaultMavenRuntimeTest.setUp(DefaultMavenRuntimeTest.java:74)
	at junit.framework.TestCase.runBare(TestCase.java:125)
	at junit.framework.TestResult$1.protect(TestResult.java:106)
	at junit.framework.TestResult.runProtected(TestResult.java:124)
	at junit.framework.TestResult.run(TestResult.java:109)
	at junit.framework.TestCase.run(TestCase.java:118)
	at junit.framework.TestSuite.runTest(TestSuite.java:208)
	at junit.framework.TestSuite.run(TestSuite.java:203)
	at sun.reflect.NativeMethodAccessorImpl.invoke0(Native Method)
	at sun.reflect.NativeMethodAccessorImpl.invoke(NativeMethodAccessorImpl.java:57)
	at sun.reflect.DelegatingMethodAccessorImpl.invoke(DelegatingMethodAccessorImpl.java:43)
	at java.lang.reflect.Method.invoke(Method.java:606)
	at org.apache.maven.surefire.junit.JUnitTestSet.execute(JUnitTestSet.java:99)
	at org.apache.maven.surefire.junit.JUnit3Provider.executeTestSet(JUnit3Provider.java:136)
	at org.apache.maven.surefire.junit.JUnit3Provider.invoke(JUnit3Provider.java:109)
	at org.apache.maven.surefire.booter.ForkedBooter.invokeProviderInSameClassLoader(ForkedBooter.java:290)
	at org.apache.maven.surefire.booter.ForkedBooter.runSuitesInProcess(ForkedBooter.java:242)
	at org.apache.maven.surefire.booter.ForkedBooter.main(ForkedBooter.java:121)


FAILED:  org.apache.maven.shared.runtime.DefaultMavenRuntimeTest.testGetProjectWithParentDelegation

Error Message:
Error building test project expected:<0> but was:<1>

Stack Trace:
junit.framework.AssertionFailedError: Error building test project expected:<0> but was:<1>
	at junit.framework.Assert.fail(Assert.java:47)
	at junit.framework.Assert.failNotEquals(Assert.java:282)
	at junit.framework.Assert.assertEquals(Assert.java:64)
	at junit.framework.Assert.assertEquals(Assert.java:201)
	at org.apache.maven.shared.runtime.DefaultMavenRuntimeTest.packageProject(DefaultMavenRuntimeTest.java:682)
	at org.apache.maven.shared.runtime.DefaultMavenRuntimeTest.setUp(DefaultMavenRuntimeTest.java:74)
	at junit.framework.TestCase.runBare(TestCase.java:125)
	at junit.framework.TestResult$1.protect(TestResult.java:106)
	at junit.framework.TestResult.runProtected(TestResult.java:124)
	at junit.framework.TestResult.run(TestResult.java:109)
	at junit.framework.TestCase.run(TestCase.java:118)
	at junit.framework.TestSuite.runTest(TestSuite.java:208)
	at junit.framework.TestSuite.run(TestSuite.java:203)
	at sun.reflect.NativeMethodAccessorImpl.invoke0(Native Method)
	at sun.reflect.NativeMethodAccessorImpl.invoke(NativeMethodAccessorImpl.java:57)
	at sun.reflect.DelegatingMethodAccessorImpl.invoke(DelegatingMethodAccessorImpl.java:43)
	at java.lang.reflect.Method.invoke(Method.java:606)
	at org.apache.maven.surefire.junit.JUnitTestSet.execute(JUnitTestSet.java:99)
	at org.apache.maven.surefire.junit.JUnit3Provider.executeTestSet(JUnit3Provider.java:136)
	at org.apache.maven.surefire.junit.JUnit3Provider.invoke(JUnit3Provider.java:109)
	at org.apache.maven.surefire.booter.ForkedBooter.invokeProviderInSameClassLoader(ForkedBooter.java:290)
	at org.apache.maven.surefire.booter.ForkedBooter.runSuitesInProcess(ForkedBooter.java:242)
	at org.apache.maven.surefire.booter.ForkedBooter.main(ForkedBooter.java:121)


FAILED:  org.apache.maven.shared.runtime.DefaultMavenRuntimeTest.testGetProjectWithChildDelegation

Error Message:
Error building test project expected:<0> but was:<1>

Stack Trace:
junit.framework.AssertionFailedError: Error building test project expected:<0> but was:<1>
	at junit.framework.Assert.fail(Assert.java:47)
	at junit.framework.Assert.failNotEquals(Assert.java:282)
	at junit.framework.Assert.assertEquals(Assert.java:64)
	at junit.framework.Assert.assertEquals(Assert.java:201)
	at org.apache.maven.shared.runtime.DefaultMavenRuntimeTest.packageProject(DefaultMavenRuntimeTest.java:682)
	at org.apache.maven.shared.runtime.DefaultMavenRuntimeTest.setUp(DefaultMavenRuntimeTest.java:74)
	at junit.framework.TestCase.runBare(TestCase.java:125)
	at junit.framework.TestResult$1.protect(TestResult.java:106)
	at junit.framework.TestResult.runProtected(TestResult.java:124)
	at junit.framework.TestResult.run(TestResult.java:109)
	at junit.framework.TestCase.run(TestCase.java:118)
	at junit.framework.TestSuite.runTest(TestSuite.java:208)
	at junit.framework.TestSuite.run(TestSuite.java:203)
	at sun.reflect.NativeMethodAccessorImpl.invoke0(Native Method)
	at sun.reflect.NativeMethodAccessorImpl.invoke(NativeMethodAccessorImpl.java:57)
	at sun.reflect.DelegatingMethodAccessorImpl.invoke(DelegatingMethodAccessorImpl.java:43)
	at java.lang.reflect.Method.invoke(Method.java:606)
	at org.apache.maven.surefire.junit.JUnitTestSet.execute(JUnitTestSet.java:99)
	at org.apache.maven.surefire.junit.JUnit3Provider.executeTestSet(JUnit3Provider.java:136)
	at org.apache.maven.surefire.junit.JUnit3Provider.invoke(JUnit3Provider.java:109)
	at org.apache.maven.surefire.booter.ForkedBooter.invokeProviderInSameClassLoader(ForkedBooter.java:290)
	at org.apache.maven.surefire.booter.ForkedBooter.runSuitesInProcess(ForkedBooter.java:242)
	at org.apache.maven.surefire.booter.ForkedBooter.main(ForkedBooter.java:121)


FAILED:  org.apache.maven.shared.runtime.DefaultMavenRuntimeTest.testGetProjectsWithSingleJar

Error Message:
Error building test project expected:<0> but was:<1>

Stack Trace:
junit.framework.AssertionFailedError: Error building test project expected:<0> but was:<1>
	at junit.framework.Assert.fail(Assert.java:47)
	at junit.framework.Assert.failNotEquals(Assert.java:282)
	at junit.framework.Assert.assertEquals(Assert.java:64)
	at junit.framework.Assert.assertEquals(Assert.java:201)
	at org.apache.maven.shared.runtime.DefaultMavenRuntimeTest.packageProject(DefaultMavenRuntimeTest.java:682)
	at org.apache.maven.shared.runtime.DefaultMavenRuntimeTest.setUp(DefaultMavenRuntimeTest.java:74)
	at junit.framework.TestCase.runBare(TestCase.java:125)
	at junit.framework.TestResult$1.protect(TestResult.java:106)
	at junit.framework.TestResult.runProtected(TestResult.java:124)
	at junit.framework.TestResult.run(TestResult.java:109)
	at junit.framework.TestCase.run(TestCase.java:118)
	at junit.framework.TestSuite.runTest(TestSuite.java:208)
	at junit.framework.TestSuite.run(TestSuite.java:203)
	at sun.reflect.NativeMethodAccessorImpl.invoke0(Native Method)
	at sun.reflect.NativeMethodAccessorImpl.invoke(NativeMethodAccessorImpl.java:57)
	at sun.reflect.DelegatingMethodAccessorImpl.invoke(DelegatingMethodAccessorImpl.java:43)
	at java.lang.reflect.Method.invoke(Method.java:606)
	at org.apache.maven.surefire.junit.JUnitTestSet.execute(JUnitTestSet.java:99)
	at org.apache.maven.surefire.junit.JUnit3Provider.executeTestSet(JUnit3Provider.java:136)
	at org.apache.maven.surefire.junit.JUnit3Provider.invoke(JUnit3Provider.java:109)
	at org.apache.maven.surefire.booter.ForkedBooter.invokeProviderInSameClassLoader(ForkedBooter.java:290)
	at org.apache.maven.surefire.booter.ForkedBooter.runSuitesInProcess(ForkedBooter.java:242)
	at org.apache.maven.surefire.booter.ForkedBooter.main(ForkedBooter.java:121)


FAILED:  org.apache.maven.shared.runtime.DefaultMavenRuntimeTest.testGetProjectsWithMultipleJars

Error Message:
Error building test project expected:<0> but was:<1>

Stack Trace:
junit.framework.AssertionFailedError: Error building test project expected:<0> but was:<1>
	at junit.framework.Assert.fail(Assert.java:47)
	at junit.framework.Assert.failNotEquals(Assert.java:282)
	at junit.framework.Assert.assertEquals(Assert.java:64)
	at junit.framework.Assert.assertEquals(Assert.java:201)
	at org.apache.maven.shared.runtime.DefaultMavenRuntimeTest.packageProject(DefaultMavenRuntimeTest.java:682)
	at org.apache.maven.shared.runtime.DefaultMavenRuntimeTest.setUp(DefaultMavenRuntimeTest.java:74)
	at junit.framework.TestCase.runBare(TestCase.java:125)
	at junit.framework.TestResult$1.protect(TestResult.java:106)
	at junit.framework.TestResult.runProtected(TestResult.java:124)
	at junit.framework.TestResult.run(TestResult.java:109)
	at junit.framework.TestCase.run(TestCase.java:118)
	at junit.framework.TestSuite.runTest(TestSuite.java:208)
	at junit.framework.TestSuite.run(TestSuite.java:203)
	at sun.reflect.NativeMethodAccessorImpl.invoke0(Native Method)
	at sun.reflect.NativeMethodAccessorImpl.invoke(NativeMethodAccessorImpl.java:57)
	at sun.reflect.DelegatingMethodAccessorImpl.invoke(DelegatingMethodAccessorImpl.java:43)
	at java.lang.reflect.Method.invoke(Method.java:606)
	at org.apache.maven.surefire.junit.JUnitTestSet.execute(JUnitTestSet.java:99)
	at org.apache.maven.surefire.junit.JUnit3Provider.executeTestSet(JUnit3Provider.java:136)
	at org.apache.maven.surefire.junit.JUnit3Provider.invoke(JUnit3Provider.java:109)
	at org.apache.maven.surefire.booter.ForkedBooter.invokeProviderInSameClassLoader(ForkedBooter.java:290)
	at org.apache.maven.surefire.booter.ForkedBooter.runSuitesInProcess(ForkedBooter.java:242)
	at org.apache.maven.surefire.booter.ForkedBooter.main(ForkedBooter.java:121)


FAILED:  org.apache.maven.shared.runtime.DefaultMavenRuntimeTest.testGetProjectsWithMultipleVersions

Error Message:
Error building test project expected:<0> but was:<1>

Stack Trace:
junit.framework.AssertionFailedError: Error building test project expected:<0> but was:<1>
	at junit.framework.Assert.fail(Assert.java:47)
	at junit.framework.Assert.failNotEquals(Assert.java:282)
	at junit.framework.Assert.assertEquals(Assert.java:64)
	at junit.framework.Assert.assertEquals(Assert.java:201)
	at org.apache.maven.shared.runtime.DefaultMavenRuntimeTest.packageProject(DefaultMavenRuntimeTest.java:682)
	at org.apache.maven.shared.runtime.DefaultMavenRuntimeTest.setUp(DefaultMavenRuntimeTest.java:74)
	at junit.framework.TestCase.runBare(TestCase.java:125)
	at junit.framework.TestResult$1.protect(TestResult.java:106)
	at junit.framework.TestResult.runProtected(TestResult.java:124)
	at junit.framework.TestResult.run(TestResult.java:109)
	at junit.framework.TestCase.run(TestCase.java:118)
	at junit.framework.TestSuite.runTest(TestSuite.java:208)
	at junit.framework.TestSuite.run(TestSuite.java:203)
	at sun.reflect.NativeMethodAccessorImpl.invoke0(Native Method)
	at sun.reflect.NativeMethodAccessorImpl.invoke(NativeMethodAccessorImpl.java:57)
	at sun.reflect.DelegatingMethodAccessorImpl.invoke(DelegatingMethodAccessorImpl.java:43)
	at java.lang.reflect.Method.invoke(Method.java:606)
	at org.apache.maven.surefire.junit.JUnitTestSet.execute(JUnitTestSet.java:99)
	at org.apache.maven.surefire.junit.JUnit3Provider.executeTestSet(JUnit3Provider.java:136)
	at org.apache.maven.surefire.junit.JUnit3Provider.invoke(JUnit3Provider.java:109)
	at org.apache.maven.surefire.booter.ForkedBooter.invokeProviderInSameClassLoader(ForkedBooter.java:290)
	at org.apache.maven.surefire.booter.ForkedBooter.runSuitesInProcess(ForkedBooter.java:242)
	at org.apache.maven.surefire.booter.ForkedBooter.main(ForkedBooter.java:121)


FAILED:  org.apache.maven.shared.runtime.DefaultMavenRuntimeTest.testGetProjectsWithMultipleVersionsReversed

Error Message:
Error building test project expected:<0> but was:<1>

Stack Trace:
junit.framework.AssertionFailedError: Error building test project expected:<0> but was:<1>
	at junit.framework.Assert.fail(Assert.java:47)
	at junit.framework.Assert.failNotEquals(Assert.java:282)
	at junit.framework.Assert.assertEquals(Assert.java:64)
	at junit.framework.Assert.assertEquals(Assert.java:201)
	at org.apache.maven.shared.runtime.DefaultMavenRuntimeTest.packageProject(DefaultMavenRuntimeTest.java:682)
	at org.apache.maven.shared.runtime.DefaultMavenRuntimeTest.setUp(DefaultMavenRuntimeTest.java:74)
	at junit.framework.TestCase.runBare(TestCase.java:125)
	at junit.framework.TestResult$1.protect(TestResult.java:106)
	at junit.framework.TestResult.runProtected(TestResult.java:124)
	at junit.framework.TestResult.run(TestResult.java:109)
	at junit.framework.TestCase.run(TestCase.java:118)
	at junit.framework.TestSuite.runTest(TestSuite.java:208)
	at junit.framework.TestSuite.run(TestSuite.java:203)
	at sun.reflect.NativeMethodAccessorImpl.invoke0(Native Method)
	at sun.reflect.NativeMethodAccessorImpl.invoke(NativeMethodAccessorImpl.java:57)
	at sun.reflect.DelegatingMethodAccessorImpl.invoke(DelegatingMethodAccessorImpl.java:43)
	at java.lang.reflect.Method.invoke(Method.java:606)
	at org.apache.maven.surefire.junit.JUnitTestSet.execute(JUnitTestSet.java:99)
	at org.apache.maven.surefire.junit.JUnit3Provider.executeTestSet(JUnit3Provider.java:136)
	at org.apache.maven.surefire.junit.JUnit3Provider.invoke(JUnit3Provider.java:109)
	at org.apache.maven.surefire.booter.ForkedBooter.invokeProviderInSameClassLoader(ForkedBooter.java:290)
	at org.apache.maven.surefire.booter.ForkedBooter.runSuitesInProcess(ForkedBooter.java:242)
	at org.apache.maven.surefire.booter.ForkedBooter.main(ForkedBooter.java:121)


FAILED:  org.apache.maven.shared.runtime.DefaultMavenRuntimeTest.testGetProjectPropertiesWithFileUrl

Error Message:
Error building test project expected:<0> but was:<1>

Stack Trace:
junit.framework.AssertionFailedError: Error building test project expected:<0> but was:<1>
	at junit.framework.Assert.fail(Assert.java:47)
	at junit.framework.Assert.failNotEquals(Assert.java:282)
	at junit.framework.Assert.assertEquals(Assert.java:64)
	at junit.framework.Assert.assertEquals(Assert.java:201)
	at org.apache.maven.shared.runtime.DefaultMavenRuntimeTest.packageProject(DefaultMavenRuntimeTest.java:682)
	at org.apache.maven.shared.runtime.DefaultMavenRuntimeTest.setUp(DefaultMavenRuntimeTest.java:74)
	at junit.framework.TestCase.runBare(TestCase.java:125)
	at junit.framework.TestResult$1.protect(TestResult.java:106)
	at junit.framework.TestResult.runProtected(TestResult.java:124)
	at junit.framework.TestResult.run(TestResult.java:109)
	at junit.framework.TestCase.run(TestCase.java:118)
	at junit.framework.TestSuite.runTest(TestSuite.java:208)
	at junit.framework.TestSuite.run(TestSuite.java:203)
	at sun.reflect.NativeMethodAccessorImpl.invoke0(Native Method)
	at sun.reflect.NativeMethodAccessorImpl.invoke(NativeMethodAccessorImpl.java:57)
	at sun.reflect.DelegatingMethodAccessorImpl.invoke(DelegatingMethodAccessorImpl.java:43)
	at java.lang.reflect.Method.invoke(Method.java:606)
	at org.apache.maven.surefire.junit.JUnitTestSet.execute(JUnitTestSet.java:99)
	at org.apache.maven.surefire.junit.JUnit3Provider.executeTestSet(JUnit3Provider.java:136)
	at org.apache.maven.surefire.junit.JUnit3Provider.invoke(JUnit3Provider.java:109)
	at org.apache.maven.surefire.booter.ForkedBooter.invokeProviderInSameClassLoader(ForkedBooter.java:290)
	at org.apache.maven.surefire.booter.ForkedBooter.runSuitesInProcess(ForkedBooter.java:242)
	at org.apache.maven.surefire.booter.ForkedBooter.main(ForkedBooter.java:121)


FAILED:  org.apache.maven.shared.runtime.DefaultMavenRuntimeTest.testGetProjectPropertiesWithPackagedClass

Error Message:
Error building test project expected:<0> but was:<1>

Stack Trace:
junit.framework.AssertionFailedError: Error building test project expected:<0> but was:<1>
	at junit.framework.Assert.fail(Assert.java:47)
	at junit.framework.Assert.failNotEquals(Assert.java:282)
	at junit.framework.Assert.assertEquals(Assert.java:64)
	at junit.framework.Assert.assertEquals(Assert.java:201)
	at org.apache.maven.shared.runtime.DefaultMavenRuntimeTest.packageProject(DefaultMavenRuntimeTest.java:682)
	at org.apache.maven.shared.runtime.DefaultMavenRuntimeTest.setUp(DefaultMavenRuntimeTest.java:74)
	at junit.framework.TestCase.runBare(TestCase.java:125)
	at junit.framework.TestResult$1.protect(TestResult.java:106)
	at junit.framework.TestResult.runProtected(TestResult.java:124)
	at junit.framework.TestResult.run(TestResult.java:109)
	at junit.framework.TestCase.run(TestCase.java:118)
	at junit.framework.TestSuite.runTest(TestSuite.java:208)
	at junit.framework.TestSuite.run(TestSuite.java:203)
	at sun.reflect.NativeMethodAccessorImpl.invoke0(Native Method)
	at sun.reflect.NativeMethodAccessorImpl.invoke(NativeMethodAccessorImpl.java:57)
	at sun.reflect.DelegatingMethodAccessorImpl.invoke(DelegatingMethodAccessorImpl.java:43)
	at java.lang.reflect.Method.invoke(Method.java:606)
	at org.apache.maven.surefire.junit.JUnitTestSet.execute(JUnitTestSet.java:99)
	at org.apache.maven.surefire.junit.JUnit3Provider.executeTestSet(JUnit3Provider.java:136)
	at org.apache.maven.surefire.junit.JUnit3Provider.invoke(JUnit3Provider.java:109)
	at org.apache.maven.surefire.booter.ForkedBooter.invokeProviderInSameClassLoader(ForkedBooter.java:290)
	at org.apache.maven.surefire.booter.ForkedBooter.runSuitesInProcess(ForkedBooter.java:242)
	at org.apache.maven.surefire.booter.ForkedBooter.main(ForkedBooter.java:121)


FAILED:  org.apache.maven.shared.runtime.DefaultMavenRuntimeTest.testGetProjectPropertiesWithSubPackagedClass

Error Message:
Error building test project expected:<0> but was:<1>

Stack Trace:
junit.framework.AssertionFailedError: Error building test project expected:<0> but was:<1>
	at junit.framework.Assert.fail(Assert.java:47)
	at junit.framework.Assert.failNotEquals(Assert.java:282)
	at junit.framework.Assert.assertEquals(Assert.java:64)
	at junit.framework.Assert.assertEquals(Assert.java:201)
	at org.apache.maven.shared.runtime.DefaultMavenRuntimeTest.packageProject(DefaultMavenRuntimeTest.java:682)
	at org.apache.maven.shared.runtime.DefaultMavenRuntimeTest.setUp(DefaultMavenRuntimeTest.java:74)
	at junit.framework.TestCase.runBare(TestCase.java:125)
	at junit.framework.TestResult$1.protect(TestResult.java:106)
	at junit.framework.TestResult.runProtected(TestResult.java:124)
	at junit.framework.TestResult.run(TestResult.java:109)
	at junit.framework.TestCase.run(TestCase.java:118)
	at junit.framework.TestSuite.runTest(TestSuite.java:208)
	at junit.framework.TestSuite.run(TestSuite.java:203)
	at sun.reflect.NativeMethodAccessorImpl.invoke0(Native Method)
	at sun.reflect.NativeMethodAccessorImpl.invoke(NativeMethodAccessorImpl.java:57)
	at sun.reflect.DelegatingMethodAccessorImpl.invoke(DelegatingMethodAccessorImpl.java:43)
	at java.lang.reflect.Method.invoke(Method.java:606)
	at org.apache.maven.surefire.junit.JUnitTestSet.execute(JUnitTestSet.java:99)
	at org.apache.maven.surefire.junit.JUnit3Provider.executeTestSet(JUnit3Provider.java:136)
	at org.apache.maven.surefire.junit.JUnit3Provider.invoke(JUnit3Provider.java:109)
	at org.apache.maven.surefire.booter.ForkedBooter.invokeProviderInSameClassLoader(ForkedBooter.java:290)
	at org.apache.maven.surefire.booter.ForkedBooter.runSuitesInProcess(ForkedBooter.java:242)
	at org.apache.maven.surefire.booter.ForkedBooter.main(ForkedBooter.java:121)


FAILED:  org.apache.maven.shared.runtime.DefaultMavenRuntimeTest.testGetProjectPropertiesWithMultipleVersions

Error Message:
Error building test project expected:<0> but was:<1>

Stack Trace:
junit.framework.AssertionFailedError: Error building test project expected:<0> but was:<1>
	at junit.framework.Assert.fail(Assert.java:47)
	at junit.framework.Assert.failNotEquals(Assert.java:282)
	at junit.framework.Assert.assertEquals(Assert.java:64)
	at junit.framework.Assert.assertEquals(Assert.java:201)
	at org.apache.maven.shared.runtime.DefaultMavenRuntimeTest.packageProject(DefaultMavenRuntimeTest.java:682)
	at org.apache.maven.shared.runtime.DefaultMavenRuntimeTest.setUp(DefaultMavenRuntimeTest.java:74)
	at junit.framework.TestCase.runBare(TestCase.java:125)
	at junit.framework.TestResult$1.protect(TestResult.java:106)
	at junit.framework.TestResult.runProtected(TestResult.java:124)
	at junit.framework.TestResult.run(TestResult.java:109)
	at junit.framework.TestCase.run(TestCase.java:118)
	at junit.framework.TestSuite.runTest(TestSuite.java:208)
	at junit.framework.TestSuite.run(TestSuite.java:203)
	at sun.reflect.NativeMethodAccessorImpl.invoke0(Native Method)
	at sun.reflect.NativeMethodAccessorImpl.invoke(NativeMethodAccessorImpl.java:57)
	at sun.reflect.DelegatingMethodAccessorImpl.invoke(DelegatingMethodAccessorImpl.java:43)
	at java.lang.reflect.Method.invoke(Method.java:606)
	at org.apache.maven.surefire.junit.JUnitTestSet.execute(JUnitTestSet.java:99)
	at org.apache.maven.surefire.junit.JUnit3Provider.executeTestSet(JUnit3Provider.java:136)
	at org.apache.maven.surefire.junit.JUnit3Provider.invoke(JUnit3Provider.java:109)
	at org.apache.maven.surefire.booter.ForkedBooter.invokeProviderInSameClassLoader(ForkedBooter.java:290)
	at org.apache.maven.surefire.booter.ForkedBooter.runSuitesInProcess(ForkedBooter.java:242)
	at org.apache.maven.surefire.booter.ForkedBooter.main(ForkedBooter.java:121)


FAILED:  org.apache.maven.shared.runtime.DefaultMavenRuntimeTest.testGetProjectPropertiesWithMultipleVersionsReversed

Error Message:
Error building test project expected:<0> but was:<1>

Stack Trace:
junit.framework.AssertionFailedError: Error building test project expected:<0> but was:<1>
	at junit.framework.Assert.fail(Assert.java:47)
	at junit.framework.Assert.failNotEquals(Assert.java:282)
	at junit.framework.Assert.assertEquals(Assert.java:64)
	at junit.framework.Assert.assertEquals(Assert.java:201)
	at org.apache.maven.shared.runtime.DefaultMavenRuntimeTest.packageProject(DefaultMavenRuntimeTest.java:682)
	at org.apache.maven.shared.runtime.DefaultMavenRuntimeTest.setUp(DefaultMavenRuntimeTest.java:74)
	at junit.framework.TestCase.runBare(TestCase.java:125)
	at junit.framework.TestResult$1.protect(TestResult.java:106)
	at junit.framework.TestResult.runProtected(TestResult.java:124)
	at junit.framework.TestResult.run(TestResult.java:109)
	at junit.framework.TestCase.run(TestCase.java:118)
	at junit.framework.TestSuite.runTest(TestSuite.java:208)
	at junit.framework.TestSuite.run(TestSuite.java:203)
	at sun.reflect.NativeMethodAccessorImpl.invoke0(Native Method)
	at sun.reflect.NativeMethodAccessorImpl.invoke(NativeMethodAccessorImpl.java:57)
	at sun.reflect.DelegatingMethodAccessorImpl.invoke(DelegatingMethodAccessorImpl.java:43)
	at java.lang.reflect.Method.invoke(Method.java:606)
	at org.apache.maven.surefire.junit.JUnitTestSet.execute(JUnitTestSet.java:99)
	at org.apache.maven.surefire.junit.JUnit3Provider.executeTestSet(JUnit3Provider.java:136)
	at org.apache.maven.surefire.junit.JUnit3Provider.invoke(JUnit3Provider.java:109)
	at org.apache.maven.surefire.booter.ForkedBooter.invokeProviderInSameClassLoader(ForkedBooter.java:290)
	at org.apache.maven.surefire.booter.ForkedBooter.runSuitesInProcess(ForkedBooter.java:242)
	at org.apache.maven.surefire.booter.ForkedBooter.main(ForkedBooter.java:121)


FAILED:  org.apache.maven.shared.runtime.DefaultMavenRuntimeTest.testGetProjectPropertiesWithParentDelegation

Error Message:
Error building test project expected:<0> but was:<1>

Stack Trace:
junit.framework.AssertionFailedError: Error building test project expected:<0> but was:<1>
	at junit.framework.Assert.fail(Assert.java:47)
	at junit.framework.Assert.failNotEquals(Assert.java:282)
	at junit.framework.Assert.assertEquals(Assert.java:64)
	at junit.framework.Assert.assertEquals(Assert.java:201)
	at org.apache.maven.shared.runtime.DefaultMavenRuntimeTest.packageProject(DefaultMavenRuntimeTest.java:682)
	at org.apache.maven.shared.runtime.DefaultMavenRuntimeTest.setUp(DefaultMavenRuntimeTest.java:74)
	at junit.framework.TestCase.runBare(TestCase.java:125)
	at junit.framework.TestResult$1.protect(TestResult.java:106)
	at junit.framework.TestResult.runProtected(TestResult.java:124)
	at junit.framework.TestResult.run(TestResult.java:109)
	at junit.framework.TestCase.run(TestCase.java:118)
	at junit.framework.TestSuite.runTest(TestSuite.java:208)
	at junit.framework.TestSuite.run(TestSuite.java:203)
	at sun.reflect.NativeMethodAccessorImpl.invoke0(Native Method)
	at sun.reflect.NativeMethodAccessorImpl.invoke(NativeMethodAccessorImpl.java:57)
	at sun.reflect.DelegatingMethodAccessorImpl.invoke(DelegatingMethodAccessorImpl.java:43)
	at java.lang.reflect.Method.invoke(Method.java:606)
	at org.apache.maven.surefire.junit.JUnitTestSet.execute(JUnitTestSet.java:99)
	at org.apache.maven.surefire.junit.JUnit3Provider.executeTestSet(JUnit3Provider.java:136)
	at org.apache.maven.surefire.junit.JUnit3Provider.invoke(JUnit3Provider.java:109)
	at org.apache.maven.surefire.booter.ForkedBooter.invokeProviderInSameClassLoader(ForkedBooter.java:290)
	at org.apache.maven.surefire.booter.ForkedBooter.runSuitesInProcess(ForkedBooter.java:242)
	at org.apache.maven.surefire.booter.ForkedBooter.main(ForkedBooter.java:121)


FAILED:  org.apache.maven.shared.runtime.DefaultMavenRuntimeTest.testGetProjectPropertiesWithChildDelegation

Error Message:
Error building test project expected:<0> but was:<1>

Stack Trace:
junit.framework.AssertionFailedError: Error building test project expected:<0> but was:<1>
	at junit.framework.Assert.fail(Assert.java:47)
	at junit.framework.Assert.failNotEquals(Assert.java:282)
	at junit.framework.Assert.assertEquals(Assert.java:64)
	at junit.framework.Assert.assertEquals(Assert.java:201)
	at org.apache.maven.shared.runtime.DefaultMavenRuntimeTest.packageProject(DefaultMavenRuntimeTest.java:682)
	at org.apache.maven.shared.runtime.DefaultMavenRuntimeTest.setUp(DefaultMavenRuntimeTest.java:74)
	at junit.framework.TestCase.runBare(TestCase.java:125)
	at junit.framework.TestResult$1.protect(TestResult.java:106)
	at junit.framework.TestResult.runProtected(TestResult.java:124)
	at junit.framework.TestResult.run(TestResult.java:109)
	at junit.framework.TestCase.run(TestCase.java:118)
	at junit.framework.TestSuite.runTest(TestSuite.java:208)
	at junit.framework.TestSuite.run(TestSuite.java:203)
	at sun.reflect.NativeMethodAccessorImpl.invoke0(Native Method)
	at sun.reflect.NativeMethodAccessorImpl.invoke(NativeMethodAccessorImpl.java:57)
	at sun.reflect.DelegatingMethodAccessorImpl.invoke(DelegatingMethodAccessorImpl.java:43)
	at java.lang.reflect.Method.invoke(Method.java:606)
	at org.apache.maven.surefire.junit.JUnitTestSet.execute(JUnitTestSet.java:99)
	at org.apache.maven.surefire.junit.JUnit3Provider.executeTestSet(JUnit3Provider.java:136)
	at org.apache.maven.surefire.junit.JUnit3Provider.invoke(JUnit3Provider.java:109)
	at org.apache.maven.surefire.booter.ForkedBooter.invokeProviderInSameClassLoader(ForkedBooter.java:290)
	at org.apache.maven.surefire.booter.ForkedBooter.runSuitesInProcess(ForkedBooter.java:242)
	at org.apache.maven.surefire.booter.ForkedBooter.main(ForkedBooter.java:121)


FAILED:  org.apache.maven.shared.runtime.DefaultMavenRuntimeTest.testGetProjectPropertiesWithJarUrl

Error Message:
Error building test project expected:<0> but was:<1>

Stack Trace:
junit.framework.AssertionFailedError: Error building test project expected:<0> but was:<1>
	at junit.framework.Assert.fail(Assert.java:47)
	at junit.framework.Assert.failNotEquals(Assert.java:282)
	at junit.framework.Assert.assertEquals(Assert.java:64)
	at junit.framework.Assert.assertEquals(Assert.java:201)
	at org.apache.maven.shared.runtime.DefaultMavenRuntimeTest.packageProject(DefaultMavenRuntimeTest.java:682)
	at org.apache.maven.shared.runtime.DefaultMavenRuntimeTest.setUp(DefaultMavenRuntimeTest.java:74)
	at junit.framework.TestCase.runBare(TestCase.java:125)
	at junit.framework.TestResult$1.protect(TestResult.java:106)
	at junit.framework.TestResult.runProtected(TestResult.java:124)
	at junit.framework.TestResult.run(TestResult.java:109)
	at junit.framework.TestCase.run(TestCase.java:118)
	at junit.framework.TestSuite.runTest(TestSuite.java:208)
	at junit.framework.TestSuite.run(TestSuite.java:203)
	at sun.reflect.NativeMethodAccessorImpl.invoke0(Native Method)
	at sun.reflect.NativeMethodAccessorImpl.invoke(NativeMethodAccessorImpl.java:57)
	at sun.reflect.DelegatingMethodAccessorImpl.invoke(DelegatingMethodAccessorImpl.java:43)
	at java.lang.reflect.Method.invoke(Method.java:606)
	at org.apache.maven.surefire.junit.JUnitTestSet.execute(JUnitTestSet.java:99)
	at org.apache.maven.surefire.junit.JUnit3Provider.executeTestSet(JUnit3Provider.java:136)
	at org.apache.maven.surefire.junit.JUnit3Provider.invoke(JUnit3Provider.java:109)
	at org.apache.maven.surefire.booter.ForkedBooter.invokeProviderInSameClassLoader(ForkedBooter.java:290)
	at org.apache.maven.surefire.booter.ForkedBooter.runSuitesInProcess(ForkedBooter.java:242)
	at org.apache.maven.surefire.booter.ForkedBooter.main(ForkedBooter.java:121)


FAILED:  org.apache.maven.shared.runtime.DefaultMavenRuntimeTest.testGetProjectPropertiesWithJarEntryUrl

Error Message:
Error building test project expected:<0> but was:<1>

Stack Trace:
junit.framework.AssertionFailedError: Error building test project expected:<0> but was:<1>
	at junit.framework.Assert.fail(Assert.java:47)
	at junit.framework.Assert.failNotEquals(Assert.java:282)
	at junit.framework.Assert.assertEquals(Assert.java:64)
	at junit.framework.Assert.assertEquals(Assert.java:201)
	at org.apache.maven.shared.runtime.DefaultMavenRuntimeTest.packageProject(DefaultMavenRuntimeTest.java:682)
	at org.apache.maven.shared.runtime.DefaultMavenRuntimeTest.setUp(DefaultMavenRuntimeTest.java:74)
	at junit.framework.TestCase.runBare(TestCase.java:125)
	at junit.framework.TestResult$1.protect(TestResult.java:106)
	at junit.framework.TestResult.runProtected(TestResult.java:124)
	at junit.framework.TestResult.run(TestResult.java:109)
	at junit.framework.TestCase.run(TestCase.java:118)
	at junit.framework.TestSuite.runTest(TestSuite.java:208)
	at junit.framework.TestSuite.run(TestSuite.java:203)
	at sun.reflect.NativeMethodAccessorImpl.invoke0(Native Method)
	at sun.reflect.NativeMethodAccessorImpl.invoke(NativeMethodAccessorImpl.java:57)
	at sun.reflect.DelegatingMethodAccessorImpl.invoke(DelegatingMethodAccessorImpl.java:43)
	at java.lang.reflect.Method.invoke(Method.java:606)
	at org.apache.maven.surefire.junit.JUnitTestSet.execute(JUnitTestSet.java:99)
	at org.apache.maven.surefire.junit.JUnit3Provider.executeTestSet(JUnit3Provider.java:136)
	at org.apache.maven.surefire.junit.JUnit3Provider.invoke(JUnit3Provider.java:109)
	at org.apache.maven.surefire.booter.ForkedBooter.invokeProviderInSameClassLoader(ForkedBooter.java:290)
	at org.apache.maven.surefire.booter.ForkedBooter.runSuitesInProcess(ForkedBooter.java:242)
	at org.apache.maven.surefire.booter.ForkedBooter.main(ForkedBooter.java:121)


FAILED:  org.apache.maven.shared.runtime.DefaultMavenRuntimeTest.testGetProjectPropertiesWithDefaultPackageClass

Error Message:
Error building test project expected:<0> but was:<1>

Stack Trace:
junit.framework.AssertionFailedError: Error building test project expected:<0> but was:<1>
	at junit.framework.Assert.fail(Assert.java:47)
	at junit.framework.Assert.failNotEquals(Assert.java:282)
	at junit.framework.Assert.assertEquals(Assert.java:64)
	at junit.framework.Assert.assertEquals(Assert.java:201)
	at org.apache.maven.shared.runtime.DefaultMavenRuntimeTest.packageProject(DefaultMavenRuntimeTest.java:682)
	at org.apache.maven.shared.runtime.DefaultMavenRuntimeTest.setUp(DefaultMavenRuntimeTest.java:74)
	at junit.framework.TestCase.runBare(TestCase.java:125)
	at junit.framework.TestResult$1.protect(TestResult.java:106)
	at junit.framework.TestResult.runProtected(TestResult.java:124)
	at junit.framework.TestResult.run(TestResult.java:109)
	at junit.framework.TestCase.run(TestCase.java:118)
	at junit.framework.TestSuite.runTest(TestSuite.java:208)
	at junit.framework.TestSuite.run(TestSuite.java:203)
	at sun.reflect.NativeMethodAccessorImpl.invoke0(Native Method)
	at sun.reflect.NativeMethodAccessorImpl.invoke(NativeMethodAccessorImpl.java:57)
	at sun.reflect.DelegatingMethodAccessorImpl.invoke(DelegatingMethodAccessorImpl.java:43)
	at java.lang.reflect.Method.invoke(Method.java:606)
	at org.apache.maven.surefire.junit.JUnitTestSet.execute(JUnitTestSet.java:99)
	at org.apache.maven.surefire.junit.JUnit3Provider.executeTestSet(JUnit3Provider.java:136)
	at org.apache.maven.surefire.junit.JUnit3Provider.invoke(JUnit3Provider.java:109)
	at org.apache.maven.surefire.booter.ForkedBooter.invokeProviderInSameClassLoader(ForkedBooter.java:290)
	at org.apache.maven.surefire.booter.ForkedBooter.runSuitesInProcess(ForkedBooter.java:242)
	at org.apache.maven.surefire.booter.ForkedBooter.main(ForkedBooter.java:121)


FAILED:  org.apache.maven.shared.runtime.DefaultMavenRuntimeTest.testGetProjectsWithParentDelegation

Error Message:
Error building test project expected:<0> but was:<1>

Stack Trace:
junit.framework.AssertionFailedError: Error building test project expected:<0> but was:<1>
	at junit.framework.Assert.fail(Assert.java:47)
	at junit.framework.Assert.failNotEquals(Assert.java:282)
	at junit.framework.Assert.assertEquals(Assert.java:64)
	at junit.framework.Assert.assertEquals(Assert.java:201)
	at org.apache.maven.shared.runtime.DefaultMavenRuntimeTest.packageProject(DefaultMavenRuntimeTest.java:682)
	at org.apache.maven.shared.runtime.DefaultMavenRuntimeTest.setUp(DefaultMavenRuntimeTest.java:74)
	at junit.framework.TestCase.runBare(TestCase.java:125)
	at junit.framework.TestResult$1.protect(TestResult.java:106)
	at junit.framework.TestResult.runProtected(TestResult.java:124)
	at junit.framework.TestResult.run(TestResult.java:109)
	at junit.framework.TestCase.run(TestCase.java:118)
	at junit.framework.TestSuite.runTest(TestSuite.java:208)
	at junit.framework.TestSuite.run(TestSuite.java:203)
	at sun.reflect.NativeMethodAccessorImpl.invoke0(Native Method)
	at sun.reflect.NativeMethodAccessorImpl.invoke(NativeMethodAccessorImpl.java:57)
	at sun.reflect.DelegatingMethodAccessorImpl.invoke(DelegatingMethodAccessorImpl.java:43)
	at java.lang.reflect.Method.invoke(Method.java:606)
	at org.apache.maven.surefire.junit.JUnitTestSet.execute(JUnitTestSet.java:99)
	at org.apache.maven.surefire.junit.JUnit3Provider.executeTestSet(JUnit3Provider.java:136)
	at org.apache.maven.surefire.junit.JUnit3Provider.invoke(JUnit3Provider.java:109)
	at org.apache.maven.surefire.booter.ForkedBooter.invokeProviderInSameClassLoader(ForkedBooter.java:290)
	at org.apache.maven.surefire.booter.ForkedBooter.runSuitesInProcess(ForkedBooter.java:242)
	at org.apache.maven.surefire.booter.ForkedBooter.main(ForkedBooter.java:121)


FAILED:  org.apache.maven.shared.runtime.DefaultMavenRuntimeTest.testGetProjectsWithChildDelegation

Error Message:
Error building test project expected:<0> but was:<1>

Stack Trace:
junit.framework.AssertionFailedError: Error building test project expected:<0> but was:<1>
	at junit.framework.Assert.fail(Assert.java:47)
	at junit.framework.Assert.failNotEquals(Assert.java:282)
	at junit.framework.Assert.assertEquals(Assert.java:64)
	at junit.framework.Assert.assertEquals(Assert.java:201)
	at org.apache.maven.shared.runtime.DefaultMavenRuntimeTest.packageProject(DefaultMavenRuntimeTest.java:682)
	at org.apache.maven.shared.runtime.DefaultMavenRuntimeTest.setUp(DefaultMavenRuntimeTest.java:74)
	at junit.framework.TestCase.runBare(TestCase.java:125)
	at junit.framework.TestResult$1.protect(TestResult.java:106)
	at junit.framework.TestResult.runProtected(TestResult.java:124)
	at junit.framework.TestResult.run(TestResult.java:109)
	at junit.framework.TestCase.run(TestCase.java:118)
	at junit.framework.TestSuite.runTest(TestSuite.java:208)
	at junit.framework.TestSuite.run(TestSuite.java:203)
	at sun.reflect.NativeMethodAccessorImpl.invoke0(Native Method)
	at sun.reflect.NativeMethodAccessorImpl.invoke(NativeMethodAccessorImpl.java:57)
	at sun.reflect.DelegatingMethodAccessorImpl.invoke(DelegatingMethodAccessorImpl.java:43)
	at java.lang.reflect.Method.invoke(Method.java:606)
	at org.apache.maven.surefire.junit.JUnitTestSet.execute(JUnitTestSet.java:99)
	at org.apache.maven.surefire.junit.JUnit3Provider.executeTestSet(JUnit3Provider.java:136)
	at org.apache.maven.surefire.junit.JUnit3Provider.invoke(JUnit3Provider.java:109)
	at org.apache.maven.surefire.booter.ForkedBooter.invokeProviderInSameClassLoader(ForkedBooter.java:290)
	at org.apache.maven.surefire.booter.ForkedBooter.runSuitesInProcess(ForkedBooter.java:242)
	at org.apache.maven.surefire.booter.ForkedBooter.main(ForkedBooter.java:121)


FAILED:  org.apache.maven.shared.runtime.DefaultMavenRuntimeTest.testGetSortedProjectsWithSingleJar

Error Message:
Error building test project expected:<0> but was:<1>

Stack Trace:
junit.framework.AssertionFailedError: Error building test project expected:<0> but was:<1>
	at junit.framework.Assert.fail(Assert.java:47)
	at junit.framework.Assert.failNotEquals(Assert.java:282)
	at junit.framework.Assert.assertEquals(Assert.java:64)
	at junit.framework.Assert.assertEquals(Assert.java:201)
	at org.apache.maven.shared.runtime.DefaultMavenRuntimeTest.packageProject(DefaultMavenRuntimeTest.java:682)
	at org.apache.maven.shared.runtime.DefaultMavenRuntimeTest.setUp(DefaultMavenRuntimeTest.java:74)
	at junit.framework.TestCase.runBare(TestCase.java:125)
	at junit.framework.TestResult$1.protect(TestResult.java:106)
	at junit.framework.TestResult.runProtected(TestResult.java:124)
	at junit.framework.TestResult.run(TestResult.java:109)
	at junit.framework.TestCase.run(TestCase.java:118)
	at junit.framework.TestSuite.runTest(TestSuite.java:208)
	at junit.framework.TestSuite.run(TestSuite.java:203)
	at sun.reflect.NativeMethodAccessorImpl.invoke0(Native Method)
	at sun.reflect.NativeMethodAccessorImpl.invoke(NativeMethodAccessorImpl.java:57)
	at sun.reflect.DelegatingMethodAccessorImpl.invoke(DelegatingMethodAccessorImpl.java:43)
	at java.lang.reflect.Method.invoke(Method.java:606)
	at org.apache.maven.surefire.junit.JUnitTestSet.execute(JUnitTestSet.java:99)
	at org.apache.maven.surefire.junit.JUnit3Provider.executeTestSet(JUnit3Provider.java:136)
	at org.apache.maven.surefire.junit.JUnit3Provider.invoke(JUnit3Provider.java:109)
	at org.apache.maven.surefire.booter.ForkedBooter.invokeProviderInSameClassLoader(ForkedBooter.java:290)
	at org.apache.maven.surefire.booter.ForkedBooter.runSuitesInProcess(ForkedBooter.java:242)
	at org.apache.maven.surefire.booter.ForkedBooter.main(ForkedBooter.java:121)


FAILED:  org.apache.maven.shared.runtime.DefaultMavenRuntimeTest.testGetSortedProjectsWithMultipleJars

Error Message:
Error building test project expected:<0> but was:<1>

Stack Trace:
junit.framework.AssertionFailedError: Error building test project expected:<0> but was:<1>
	at junit.framework.Assert.fail(Assert.java:47)
	at junit.framework.Assert.failNotEquals(Assert.java:282)
	at junit.framework.Assert.assertEquals(Assert.java:64)
	at junit.framework.Assert.assertEquals(Assert.java:201)
	at org.apache.maven.shared.runtime.DefaultMavenRuntimeTest.packageProject(DefaultMavenRuntimeTest.java:682)
	at org.apache.maven.shared.runtime.DefaultMavenRuntimeTest.setUp(DefaultMavenRuntimeTest.java:74)
	at junit.framework.TestCase.runBare(TestCase.java:125)
	at junit.framework.TestResult$1.protect(TestResult.java:106)
	at junit.framework.TestResult.runProtected(TestResult.java:124)
	at junit.framework.TestResult.run(TestResult.java:109)
	at junit.framework.TestCase.run(TestCase.java:118)
	at junit.framework.TestSuite.runTest(TestSuite.java:208)
	at junit.framework.TestSuite.run(TestSuite.java:203)
	at sun.reflect.NativeMethodAccessorImpl.invoke0(Native Method)
	at sun.reflect.NativeMethodAccessorImpl.invoke(NativeMethodAccessorImpl.java:57)
	at sun.reflect.DelegatingMethodAccessorImpl.invoke(DelegatingMethodAccessorImpl.java:43)
	at java.lang.reflect.Method.invoke(Method.java:606)
	at org.apache.maven.surefire.junit.JUnitTestSet.execute(JUnitTestSet.java:99)
	at org.apache.maven.surefire.junit.JUnit3Provider.executeTestSet(JUnit3Provider.java:136)
	at org.apache.maven.surefire.junit.JUnit3Provider.invoke(JUnit3Provider.java:109)
	at org.apache.maven.surefire.booter.ForkedBooter.invokeProviderInSameClassLoader(ForkedBooter.java:290)
	at org.apache.maven.surefire.booter.ForkedBooter.runSuitesInProcess(ForkedBooter.java:242)
	at org.apache.maven.surefire.booter.ForkedBooter.main(ForkedBooter.java:121)


FAILED:  org.apache.maven.shared.runtime.DefaultMavenRuntimeTest.testGetSortedProjectsWithDependentJars

Error Message:
Error building test project expected:<0> but was:<1>

Stack Trace:
junit.framework.AssertionFailedError: Error building test project expected:<0> but was:<1>
	at junit.framework.Assert.fail(Assert.java:47)
	at junit.framework.Assert.failNotEquals(Assert.java:282)
	at junit.framework.Assert.assertEquals(Assert.java:64)
	at junit.framework.Assert.assertEquals(Assert.java:201)
	at org.apache.maven.shared.runtime.DefaultMavenRuntimeTest.packageProject(DefaultMavenRuntimeTest.java:682)
	at org.apache.maven.shared.runtime.DefaultMavenRuntimeTest.setUp(DefaultMavenRuntimeTest.java:74)
	at junit.framework.TestCase.runBare(TestCase.java:125)
	at junit.framework.TestResult$1.protect(TestResult.java:106)
	at junit.framework.TestResult.runProtected(TestResult.java:124)
	at junit.framework.TestResult.run(TestResult.java:109)
	at junit.framework.TestCase.run(TestCase.java:118)
	at junit.framework.TestSuite.runTest(TestSuite.java:208)
	at junit.framework.TestSuite.run(TestSuite.java:203)
	at sun.reflect.NativeMethodAccessorImpl.invoke0(Native Method)
	at sun.reflect.NativeMethodAccessorImpl.invoke(NativeMethodAccessorImpl.java:57)
	at sun.reflect.DelegatingMethodAccessorImpl.invoke(DelegatingMethodAccessorImpl.java:43)
	at java.lang.reflect.Method.invoke(Method.java:606)
	at org.apache.maven.surefire.junit.JUnitTestSet.execute(JUnitTestSet.java:99)
	at org.apache.maven.surefire.junit.JUnit3Provider.executeTestSet(JUnit3Provider.java:136)
	at org.apache.maven.surefire.junit.JUnit3Provider.invoke(JUnit3Provider.java:109)
	at org.apache.maven.surefire.booter.ForkedBooter.invokeProviderInSameClassLoader(ForkedBooter.java:290)
	at org.apache.maven.surefire.booter.ForkedBooter.runSuitesInProcess(ForkedBooter.java:242)
	at org.apache.maven.surefire.booter.ForkedBooter.main(ForkedBooter.java:121)


FAILED:  org.apache.maven.shared.runtime.DefaultMavenRuntimeTest.testGetSortedProjectsWithMediatedDependency

Error Message:
Error building test project expected:<0> but was:<1>

Stack Trace:
junit.framework.AssertionFailedError: Error building test project expected:<0> but was:<1>
	at junit.framework.Assert.fail(Assert.java:47)
	at junit.framework.Assert.failNotEquals(Assert.java:282)
	at junit.framework.Assert.assertEquals(Assert.java:64)
	at junit.framework.Assert.assertEquals(Assert.java:201)
	at org.apache.maven.shared.runtime.DefaultMavenRuntimeTest.packageProject(DefaultMavenRuntimeTest.java:682)
	at org.apache.maven.shared.runtime.DefaultMavenRuntimeTest.setUp(DefaultMavenRuntimeTest.java:74)
	at junit.framework.TestCase.runBare(TestCase.java:125)
	at junit.framework.TestResult$1.protect(TestResult.java:106)
	at junit.framework.TestResult.runProtected(TestResult.java:124)
	at junit.framework.TestResult.run(TestResult.java:109)
	at junit.framework.TestCase.run(TestCase.java:118)
	at junit.framework.TestSuite.runTest(TestSuite.java:208)
	at junit.framework.TestSuite.run(TestSuite.java:203)
	at sun.reflect.NativeMethodAccessorImpl.invoke0(Native Method)
	at sun.reflect.NativeMethodAccessorImpl.invoke(NativeMethodAccessorImpl.java:57)
	at sun.reflect.DelegatingMethodAccessorImpl.invoke(DelegatingMethodAccessorImpl.java:43)
	at java.lang.reflect.Method.invoke(Method.java:606)
	at org.apache.maven.surefire.junit.JUnitTestSet.execute(JUnitTestSet.java:99)
	at org.apache.maven.surefire.junit.JUnit3Provider.executeTestSet(JUnit3Provider.java:136)
	at org.apache.maven.surefire.junit.JUnit3Provider.invoke(JUnit3Provider.java:109)
	at org.apache.maven.surefire.booter.ForkedBooter.invokeProviderInSameClassLoader(ForkedBooter.java:290)
	at org.apache.maven.surefire.booter.ForkedBooter.runSuitesInProcess(ForkedBooter.java:242)
	at org.apache.maven.surefire.booter.ForkedBooter.main(ForkedBooter.java:121)


FAILED:  org.apache.maven.shared.runtime.DefaultMavenRuntimeTest.testGetSortedProjectsWithMultipleVersions

Error Message:
Error building test project expected:<0> but was:<1>

Stack Trace:
junit.framework.AssertionFailedError: Error building test project expected:<0> but was:<1>
	at junit.framework.Assert.fail(Assert.java:47)
	at junit.framework.Assert.failNotEquals(Assert.java:282)
	at junit.framework.Assert.assertEquals(Assert.java:64)
	at junit.framework.Assert.assertEquals(Assert.java:201)
	at org.apache.maven.shared.runtime.DefaultMavenRuntimeTest.packageProject(DefaultMavenRuntimeTest.java:682)
	at org.apache.maven.shared.runtime.DefaultMavenRuntimeTest.setUp(DefaultMavenRuntimeTest.java:74)
	at junit.framework.TestCase.runBare(TestCase.java:125)
	at junit.framework.TestResult$1.protect(TestResult.java:106)
	at junit.framework.TestResult.runProtected(TestResult.java:124)
	at junit.framework.TestResult.run(TestResult.java:109)
	at junit.framework.TestCase.run(TestCase.java:118)
	at junit.framework.TestSuite.runTest(TestSuite.java:208)
	at junit.framework.TestSuite.run(TestSuite.java:203)
	at sun.reflect.NativeMethodAccessorImpl.invoke0(Native Method)
	at sun.reflect.NativeMethodAccessorImpl.invoke(NativeMethodAccessorImpl.java:57)
	at sun.reflect.DelegatingMethodAccessorImpl.invoke(DelegatingMethodAccessorImpl.java:43)
	at java.lang.reflect.Method.invoke(Method.java:606)
	at org.apache.maven.surefire.junit.JUnitTestSet.execute(JUnitTestSet.java:99)
	at org.apache.maven.surefire.junit.JUnit3Provider.executeTestSet(JUnit3Provider.java:136)
	at org.apache.maven.surefire.junit.JUnit3Provider.invoke(JUnit3Provider.java:109)
	at org.apache.maven.surefire.booter.ForkedBooter.invokeProviderInSameClassLoader(ForkedBooter.java:290)
	at org.apache.maven.surefire.booter.ForkedBooter.runSuitesInProcess(ForkedBooter.java:242)
	at org.apache.maven.surefire.booter.ForkedBooter.main(ForkedBooter.java:121)


FAILED:  org.apache.maven.shared.runtime.DefaultMavenRuntimeTest.testGetSortedProjectsWithMultipleVersionsReversed

Error Message:
Error building test project expected:<0> but was:<1>

Stack Trace:
junit.framework.AssertionFailedError: Error building test project expected:<0> but was:<1>
	at junit.framework.Assert.fail(Assert.java:47)
	at junit.framework.Assert.failNotEquals(Assert.java:282)
	at junit.framework.Assert.assertEquals(Assert.java:64)
	at junit.framework.Assert.assertEquals(Assert.java:201)
	at org.apache.maven.shared.runtime.DefaultMavenRuntimeTest.packageProject(DefaultMavenRuntimeTest.java:682)
	at org.apache.maven.shared.runtime.DefaultMavenRuntimeTest.setUp(DefaultMavenRuntimeTest.java:74)
	at junit.framework.TestCase.runBare(TestCase.java:125)
	at junit.framework.TestResult$1.protect(TestResult.java:106)
	at junit.framework.TestResult.runProtected(TestResult.java:124)
	at junit.framework.TestResult.run(TestResult.java:109)
	at junit.framework.TestCase.run(TestCase.java:118)
	at junit.framework.TestSuite.runTest(TestSuite.java:208)
	at junit.framework.TestSuite.run(TestSuite.java:203)
	at sun.reflect.NativeMethodAccessorImpl.invoke0(Native Method)
	at sun.reflect.NativeMethodAccessorImpl.invoke(NativeMethodAccessorImpl.java:57)
	at sun.reflect.DelegatingMethodAccessorImpl.invoke(DelegatingMethodAccessorImpl.java:43)
	at java.lang.reflect.Method.invoke(Method.java:606)
	at org.apache.maven.surefire.junit.JUnitTestSet.execute(JUnitTestSet.java:99)
	at org.apache.maven.surefire.junit.JUnit3Provider.executeTestSet(JUnit3Provider.java:136)
	at org.apache.maven.surefire.junit.JUnit3Provider.invoke(JUnit3Provider.java:109)
	at org.apache.maven.surefire.booter.ForkedBooter.invokeProviderInSameClassLoader(ForkedBooter.java:290)
	at org.apache.maven.surefire.booter.ForkedBooter.runSuitesInProcess(ForkedBooter.java:242)
	at org.apache.maven.surefire.booter.ForkedBooter.main(ForkedBooter.java:121)


FAILED:  org.apache.maven.shared.runtime.DefaultMavenRuntimeTest.testGetSortedProjectsWithParentDelegation

Error Message:
Error building test project expected:<0> but was:<1>

Stack Trace:
junit.framework.AssertionFailedError: Error building test project expected:<0> but was:<1>
	at junit.framework.Assert.fail(Assert.java:47)
	at junit.framework.Assert.failNotEquals(Assert.java:282)
	at junit.framework.Assert.assertEquals(Assert.java:64)
	at junit.framework.Assert.assertEquals(Assert.java:201)
	at org.apache.maven.shared.runtime.DefaultMavenRuntimeTest.packageProject(DefaultMavenRuntimeTest.java:682)
	at org.apache.maven.shared.runtime.DefaultMavenRuntimeTest.setUp(DefaultMavenRuntimeTest.java:74)
	at junit.framework.TestCase.runBare(TestCase.java:125)
	at junit.framework.TestResult$1.protect(TestResult.java:106)
	at junit.framework.TestResult.runProtected(TestResult.java:124)
	at junit.framework.TestResult.run(TestResult.java:109)
	at junit.framework.TestCase.run(TestCase.java:118)
	at junit.framework.TestSuite.runTest(TestSuite.java:208)
	at junit.framework.TestSuite.run(TestSuite.java:203)
	at sun.reflect.NativeMethodAccessorImpl.invoke0(Native Method)
	at sun.reflect.NativeMethodAccessorImpl.invoke(NativeMethodAccessorImpl.java:57)
	at sun.reflect.DelegatingMethodAccessorImpl.invoke(DelegatingMethodAccessorImpl.java:43)
	at java.lang.reflect.Method.invoke(Method.java:606)
	at org.apache.maven.surefire.junit.JUnitTestSet.execute(JUnitTestSet.java:99)
	at org.apache.maven.surefire.junit.JUnit3Provider.executeTestSet(JUnit3Provider.java:136)
	at org.apache.maven.surefire.junit.JUnit3Provider.invoke(JUnit3Provider.java:109)
	at org.apache.maven.surefire.booter.ForkedBooter.invokeProviderInSameClassLoader(ForkedBooter.java:290)
	at org.apache.maven.surefire.booter.ForkedBooter.runSuitesInProcess(ForkedBooter.java:242)
	at org.apache.maven.surefire.booter.ForkedBooter.main(ForkedBooter.java:121)


FAILED:  org.apache.maven.shared.runtime.DefaultMavenRuntimeTest.testGetSortedProjectsWithChildDelegation

Error Message:
Error building test project expected:<0> but was:<1>

Stack Trace:
junit.framework.AssertionFailedError: Error building test project expected:<0> but was:<1>
	at junit.framework.Assert.fail(Assert.java:47)
	at junit.framework.Assert.failNotEquals(Assert.java:282)
	at junit.framework.Assert.assertEquals(Assert.java:64)
	at junit.framework.Assert.assertEquals(Assert.java:201)
	at org.apache.maven.shared.runtime.DefaultMavenRuntimeTest.packageProject(DefaultMavenRuntimeTest.java:682)
	at org.apache.maven.shared.runtime.DefaultMavenRuntimeTest.setUp(DefaultMavenRuntimeTest.java:74)
	at junit.framework.TestCase.runBare(TestCase.java:125)
	at junit.framework.TestResult$1.protect(TestResult.java:106)
	at junit.framework.TestResult.runProtected(TestResult.java:124)
	at junit.framework.TestResult.run(TestResult.java:109)
	at junit.framework.TestCase.run(TestCase.java:118)
	at junit.framework.TestSuite.runTest(TestSuite.java:208)
	at junit.framework.TestSuite.run(TestSuite.java:203)
	at sun.reflect.NativeMethodAccessorImpl.invoke0(Native Method)
	at sun.reflect.NativeMethodAccessorImpl.invoke(NativeMethodAccessorImpl.java:57)
	at sun.reflect.DelegatingMethodAccessorImpl.invoke(DelegatingMethodAccessorImpl.java:43)
	at java.lang.reflect.Method.invoke(Method.java:606)
	at org.apache.maven.surefire.junit.JUnitTestSet.execute(JUnitTestSet.java:99)
	at org.apache.maven.surefire.junit.JUnit3Provider.executeTestSet(JUnit3Provider.java:136)
	at org.apache.maven.surefire.junit.JUnit3Provider.invoke(JUnit3Provider.java:109)
	at org.apache.maven.surefire.booter.ForkedBooter.invokeProviderInSameClassLoader(ForkedBooter.java:290)
	at org.apache.maven.surefire.booter.ForkedBooter.runSuitesInProcess(ForkedBooter.java:242)
	at org.apache.maven.surefire.booter.ForkedBooter.main(ForkedBooter.java:121)


FAILED:  org.apache.maven.shared.runtime.DefaultMavenRuntimeTest.testGetProjectsPropertiesWithChildDelegation

Error Message:
Error building test project expected:<0> but was:<1>

Stack Trace:
junit.framework.AssertionFailedError: Error building test project expected:<0> but was:<1>
	at junit.framework.Assert.fail(Assert.java:47)
	at junit.framework.Assert.failNotEquals(Assert.java:282)
	at junit.framework.Assert.assertEquals(Assert.java:64)
	at junit.framework.Assert.assertEquals(Assert.java:201)
	at org.apache.maven.shared.runtime.DefaultMavenRuntimeTest.packageProject(DefaultMavenRuntimeTest.java:682)
	at org.apache.maven.shared.runtime.DefaultMavenRuntimeTest.setUp(DefaultMavenRuntimeTest.java:74)
	at junit.framework.TestCase.runBare(TestCase.java:125)
	at junit.framework.TestResult$1.protect(TestResult.java:106)
	at junit.framework.TestResult.runProtected(TestResult.java:124)
	at junit.framework.TestResult.run(TestResult.java:109)
	at junit.framework.TestCase.run(TestCase.java:118)
	at junit.framework.TestSuite.runTest(TestSuite.java:208)
	at junit.framework.TestSuite.run(TestSuite.java:203)
	at sun.reflect.NativeMethodAccessorImpl.invoke0(Native Method)
	at sun.reflect.NativeMethodAccessorImpl.invoke(NativeMethodAccessorImpl.java:57)
	at sun.reflect.DelegatingMethodAccessorImpl.invoke(DelegatingMethodAccessorImpl.java:43)
	at java.lang.reflect.Method.invoke(Method.java:606)
	at org.apache.maven.surefire.junit.JUnitTestSet.execute(JUnitTestSet.java:99)
	at org.apache.maven.surefire.junit.JUnit3Provider.executeTestSet(JUnit3Provider.java:136)
	at org.apache.maven.surefire.junit.JUnit3Provider.invoke(JUnit3Provider.java:109)
	at org.apache.maven.surefire.booter.ForkedBooter.invokeProviderInSameClassLoader(ForkedBooter.java:290)
	at org.apache.maven.surefire.booter.ForkedBooter.runSuitesInProcess(ForkedBooter.java:242)
	at org.apache.maven.surefire.booter.ForkedBooter.main(ForkedBooter.java:121)


FAILED:  org.apache.maven.shared.runtime.DefaultMavenRuntimeTest.testGetSortedProjectsWithMultipleVersionsReversed

Error Message:
Error building test project expected:<0> but was:<1>

Stack Trace:
junit.framework.AssertionFailedError: Error building test project expected:<0> but was:<1>
	at junit.framework.Assert.fail(Assert.java:47)
	at junit.framework.Assert.failNotEquals(Assert.java:282)
	at junit.framework.Assert.assertEquals(Assert.java:64)
	at junit.framework.Assert.assertEquals(Assert.java:201)
	at org.apache.maven.shared.runtime.DefaultMavenRuntimeTest.packageProject(DefaultMavenRuntimeTest.java:682)
	at org.apache.maven.shared.runtime.DefaultMavenRuntimeTest.setUp(DefaultMavenRuntimeTest.java:74)
	at junit.framework.TestCase.runBare(TestCase.java:125)
	at junit.framework.TestResult$1.protect(TestResult.java:106)
	at junit.framework.TestResult.runProtected(TestResult.java:124)
	at junit.framework.TestResult.run(TestResult.java:109)
	at junit.framework.TestCase.run(TestCase.java:118)
	at junit.framework.TestSuite.runTest(TestSuite.java:208)
	at junit.framework.TestSuite.run(TestSuite.java:203)
	at sun.reflect.NativeMethodAccessorImpl.invoke0(Native Method)
	at sun.reflect.NativeMethodAccessorImpl.invoke(NativeMethodAccessorImpl.java:57)
	at sun.reflect.DelegatingMethodAccessorImpl.invoke(DelegatingMethodAccessorImpl.java:43)
	at java.lang.reflect.Method.invoke(Method.java:606)
	at org.apache.maven.surefire.junit.JUnitTestSet.execute(JUnitTestSet.java:99)
	at org.apache.maven.surefire.junit.JUnit3Provider.executeTestSet(JUnit3Provider.java:136)
	at org.apache.maven.surefire.junit.JUnit3Provider.invoke(JUnit3Provider.java:109)
	at org.apache.maven.surefire.booter.ForkedBooter.invokeProviderInSameClassLoader(ForkedBooter.java:290)
	at org.apache.maven.surefire.booter.ForkedBooter.runSuitesInProcess(ForkedBooter.java:242)
	at org.apache.maven.surefire.booter.ForkedBooter.main(ForkedBooter.java:121)


FAILED:  org.apache.maven.shared.runtime.DefaultMavenRuntimeTest.testGetProjectPropertiesWithDefaultPackageClass

Error Message:
Error building test project expected:<0> but was:<1>

Stack Trace:
junit.framework.AssertionFailedError: Error building test project expected:<0> but was:<1>
	at junit.framework.Assert.fail(Assert.java:47)
	at junit.framework.Assert.failNotEquals(Assert.java:282)
	at junit.framework.Assert.assertEquals(Assert.java:64)
	at junit.framework.Assert.assertEquals(Assert.java:201)
	at org.apache.maven.shared.runtime.DefaultMavenRuntimeTest.packageProject(DefaultMavenRuntimeTest.java:682)
	at org.apache.maven.shared.runtime.DefaultMavenRuntimeTest.setUp(DefaultMavenRuntimeTest.java:74)
	at junit.framework.TestCase.runBare(TestCase.java:125)
	at junit.framework.TestResult$1.protect(TestResult.java:106)
	at junit.framework.TestResult.runProtected(TestResult.java:124)
	at junit.framework.TestResult.run(TestResult.java:109)
	at junit.framework.TestCase.run(TestCase.java:118)
	at junit.framework.TestSuite.runTest(TestSuite.java:208)
	at junit.framework.TestSuite.run(TestSuite.java:203)
	at sun.reflect.NativeMethodAccessorImpl.invoke0(Native Method)
	at sun.reflect.NativeMethodAccessorImpl.invoke(NativeMethodAccessorImpl.java:57)
	at sun.reflect.DelegatingMethodAccessorImpl.invoke(DelegatingMethodAccessorImpl.java:43)
	at java.lang.reflect.Method.invoke(Method.java:606)
	at org.apache.maven.surefire.junit.JUnitTestSet.execute(JUnitTestSet.java:99)
	at org.apache.maven.surefire.junit.JUnit3Provider.executeTestSet(JUnit3Provider.java:136)
	at org.apache.maven.surefire.junit.JUnit3Provider.invoke(JUnit3Provider.java:109)
	at org.apache.maven.surefire.booter.ForkedBooter.invokeProviderInSameClassLoader(ForkedBooter.java:290)
	at org.apache.maven.surefire.booter.ForkedBooter.runSuitesInProcess(ForkedBooter.java:242)
	at org.apache.maven.surefire.booter.ForkedBooter.main(ForkedBooter.java:121)


FAILED:  org.apache.maven.shared.runtime.DefaultMavenRuntimeTest.testGetProjectPropertiesWithMultipleVersionsReversed

Error Message:
Error building test project expected:<0> but was:<1>

Stack Trace:
junit.framework.AssertionFailedError: Error building test project expected:<0> but was:<1>
	at junit.framework.Assert.fail(Assert.java:47)
	at junit.framework.Assert.failNotEquals(Assert.java:282)
	at junit.framework.Assert.assertEquals(Assert.java:64)
	at junit.framework.Assert.assertEquals(Assert.java:201)
	at org.apache.maven.shared.runtime.DefaultMavenRuntimeTest.packageProject(DefaultMavenRuntimeTest.java:682)
	at org.apache.maven.shared.runtime.DefaultMavenRuntimeTest.setUp(DefaultMavenRuntimeTest.java:74)
	at junit.framework.TestCase.runBare(TestCase.java:125)
	at junit.framework.TestResult$1.protect(TestResult.java:106)
	at junit.framework.TestResult.runProtected(TestResult.java:124)
	at junit.framework.TestResult.run(TestResult.java:109)
	at junit.framework.TestCase.run(TestCase.java:118)
	at junit.framework.TestSuite.runTest(TestSuite.java:208)
	at junit.framework.TestSuite.run(TestSuite.java:203)
	at sun.reflect.NativeMethodAccessorImpl.invoke0(Native Method)
	at sun.reflect.NativeMethodAccessorImpl.invoke(NativeMethodAccessorImpl.java:57)
	at sun.reflect.DelegatingMethodAccessorImpl.invoke(DelegatingMethodAccessorImpl.java:43)
	at java.lang.reflect.Method.invoke(Method.java:606)
	at org.apache.maven.surefire.junit.JUnitTestSet.execute(JUnitTestSet.java:99)
	at org.apache.maven.surefire.junit.JUnit3Provider.executeTestSet(JUnit3Provider.java:136)
	at org.apache.maven.surefire.junit.JUnit3Provider.invoke(JUnit3Provider.java:109)
	at org.apache.maven.surefire.booter.ForkedBooter.invokeProviderInSameClassLoader(ForkedBooter.java:290)
	at org.apache.maven.surefire.booter.ForkedBooter.runSuitesInProcess(ForkedBooter.java:242)
	at org.apache.maven.surefire.booter.ForkedBooter.main(ForkedBooter.java:121)


FAILED:  org.apache.maven.shared.runtime.DefaultMavenRuntimeTest.testGetProjectsPropertiesWithMultipleVersionsReversed

Error Message:
Error building test project expected:<0> but was:<1>

Stack Trace:
junit.framework.AssertionFailedError: Error building test project expected:<0> but was:<1>
	at junit.framework.Assert.fail(Assert.java:47)
	at junit.framework.Assert.failNotEquals(Assert.java:282)
	at junit.framework.Assert.assertEquals(Assert.java:64)
	at junit.framework.Assert.assertEquals(Assert.java:201)
	at org.apache.maven.shared.runtime.DefaultMavenRuntimeTest.packageProject(DefaultMavenRuntimeTest.java:682)
	at org.apache.maven.shared.runtime.DefaultMavenRuntimeTest.setUp(DefaultMavenRuntimeTest.java:74)
	at junit.framework.TestCase.runBare(TestCase.java:125)
	at junit.framework.TestResult$1.protect(TestResult.java:106)
	at junit.framework.TestResult.runProtected(TestResult.java:124)
	at junit.framework.TestResult.run(TestResult.java:109)
	at junit.framework.TestCase.run(TestCase.java:118)
	at junit.framework.TestSuite.runTest(TestSuite.java:208)
	at junit.framework.TestSuite.run(TestSuite.java:203)
	at sun.reflect.NativeMethodAccessorImpl.invoke0(Native Method)
	at sun.reflect.NativeMethodAccessorImpl.invoke(NativeMethodAccessorImpl.java:57)
	at sun.reflect.DelegatingMethodAccessorImpl.invoke(DelegatingMethodAccessorImpl.java:43)
	at java.lang.reflect.Method.invoke(Method.java:606)
	at org.apache.maven.surefire.junit.JUnitTestSet.execute(JUnitTestSet.java:99)
	at org.apache.maven.surefire.junit.JUnit3Provider.executeTestSet(JUnit3Provider.java:136)
	at org.apache.maven.surefire.junit.JUnit3Provider.invoke(JUnit3Provider.java:109)
	at org.apache.maven.surefire.booter.ForkedBooter.invokeProviderInSameClassLoader(ForkedBooter.java:290)
	at org.apache.maven.surefire.booter.ForkedBooter.runSuitesInProcess(ForkedBooter.java:242)
	at org.apache.maven.surefire.booter.ForkedBooter.main(ForkedBooter.java:121)


FAILED:  org.apache.maven.shared.runtime.DefaultMavenRuntimeTest.testGetProjectPropertiesWithJarEntryUrl

Error Message:
Error building test project expected:<0> but was:<1>

Stack Trace:
junit.framework.AssertionFailedError: Error building test project expected:<0> but was:<1>
	at junit.framework.Assert.fail(Assert.java:47)
	at junit.framework.Assert.failNotEquals(Assert.java:282)
	at junit.framework.Assert.assertEquals(Assert.java:64)
	at junit.framework.Assert.assertEquals(Assert.java:201)
	at org.apache.maven.shared.runtime.DefaultMavenRuntimeTest.packageProject(DefaultMavenRuntimeTest.java:682)
	at org.apache.maven.shared.runtime.DefaultMavenRuntimeTest.setUp(DefaultMavenRuntimeTest.java:74)
	at junit.framework.TestCase.runBare(TestCase.java:125)
	at junit.framework.TestResult$1.protect(TestResult.java:106)
	at junit.framework.TestResult.runProtected(TestResult.java:124)
	at junit.framework.TestResult.run(TestResult.java:109)
	at junit.framework.TestCase.run(TestCase.java:118)
	at junit.framework.TestSuite.runTest(TestSuite.java:208)
	at junit.framework.TestSuite.run(TestSuite.java:203)
	at sun.reflect.NativeMethodAccessorImpl.invoke0(Native Method)
	at sun.reflect.NativeMethodAccessorImpl.invoke(NativeMethodAccessorImpl.java:57)
	at sun.reflect.DelegatingMethodAccessorImpl.invoke(DelegatingMethodAccessorImpl.java:43)
	at java.lang.reflect.Method.invoke(Method.java:606)
	at org.apache.maven.surefire.junit.JUnitTestSet.execute(JUnitTestSet.java:99)
	at org.apache.maven.surefire.junit.JUnit3Provider.executeTestSet(JUnit3Provider.java:136)
	at org.apache.maven.surefire.junit.JUnit3Provider.invoke(JUnit3Provider.java:109)
	at org.apache.maven.surefire.booter.ForkedBooter.invokeProviderInSameClassLoader(ForkedBooter.java:290)
	at org.apache.maven.surefire.booter.ForkedBooter.runSuitesInProcess(ForkedBooter.java:242)
	at org.apache.maven.surefire.booter.ForkedBooter.main(ForkedBooter.java:121)


FAILED:  org.apache.maven.shared.runtime.DefaultMavenRuntimeTest.testGetProjectPropertiesWithChildDelegation

Error Message:
Error building test project expected:<0> but was:<1>

Stack Trace:
junit.framework.AssertionFailedError: Error building test project expected:<0> but was:<1>
	at junit.framework.Assert.fail(Assert.java:47)
	at junit.framework.Assert.failNotEquals(Assert.java:282)
	at junit.framework.Assert.assertEquals(Assert.java:64)
	at junit.framework.Assert.assertEquals(Assert.java:201)
	at org.apache.maven.shared.runtime.DefaultMavenRuntimeTest.packageProject(DefaultMavenRuntimeTest.java:682)
	at org.apache.maven.shared.runtime.DefaultMavenRuntimeTest.setUp(DefaultMavenRuntimeTest.java:74)
	at junit.framework.TestCase.runBare(TestCase.java:125)
	at junit.framework.TestResult$1.protect(TestResult.java:106)
	at junit.framework.TestResult.runProtected(TestResult.java:124)
	at junit.framework.TestResult.run(TestResult.java:109)
	at junit.framework.TestCase.run(TestCase.java:118)
	at junit.framework.TestSuite.runTest(TestSuite.java:208)
	at junit.framework.TestSuite.run(TestSuite.java:203)
	at sun.reflect.NativeMethodAccessorImpl.invoke0(Native Method)
	at sun.reflect.NativeMethodAccessorImpl.invoke(NativeMethodAccessorImpl.java:57)
	at sun.reflect.DelegatingMethodAccessorImpl.invoke(DelegatingMethodAccessorImpl.java:43)
	at java.lang.reflect.Method.invoke(Method.java:606)
	at org.apache.maven.surefire.junit.JUnitTestSet.execute(JUnitTestSet.java:99)
	at org.apache.maven.surefire.junit.JUnit3Provider.executeTestSet(JUnit3Provider.java:136)
	at org.apache.maven.surefire.junit.JUnit3Provider.invoke(JUnit3Provider.java:109)
	at org.apache.maven.surefire.booter.ForkedBooter.invokeProviderInSameClassLoader(ForkedBooter.java:290)
	at org.apache.maven.surefire.booter.ForkedBooter.runSuitesInProcess(ForkedBooter.java:242)
	at org.apache.maven.surefire.booter.ForkedBooter.main(ForkedBooter.java:121)


FAILED:  org.apache.maven.shared.runtime.DefaultMavenRuntimeTest.testGetProjectPropertiesWithJarUrl

Error Message:
Error building test project expected:<0> but was:<1>

Stack Trace:
junit.framework.AssertionFailedError: Error building test project expected:<0> but was:<1>
	at junit.framework.Assert.fail(Assert.java:47)
	at junit.framework.Assert.failNotEquals(Assert.java:282)
	at junit.framework.Assert.assertEquals(Assert.java:64)
	at junit.framework.Assert.assertEquals(Assert.java:201)
	at org.apache.maven.shared.runtime.DefaultMavenRuntimeTest.packageProject(DefaultMavenRuntimeTest.java:682)
	at org.apache.maven.shared.runtime.DefaultMavenRuntimeTest.setUp(DefaultMavenRuntimeTest.java:74)
	at junit.framework.TestCase.runBare(TestCase.java:125)
	at junit.framework.TestResult$1.protect(TestResult.java:106)
	at junit.framework.TestResult.runProtected(TestResult.java:124)
	at junit.framework.TestResult.run(TestResult.java:109)
	at junit.framework.TestCase.run(TestCase.java:118)
	at junit.framework.TestSuite.runTest(TestSuite.java:208)
	at junit.framework.TestSuite.run(TestSuite.java:203)
	at sun.reflect.NativeMethodAccessorImpl.invoke0(Native Method)
	at sun.reflect.NativeMethodAccessorImpl.invoke(NativeMethodAccessorImpl.java:57)
	at sun.reflect.DelegatingMethodAccessorImpl.invoke(DelegatingMethodAccessorImpl.java:43)
	at java.lang.reflect.Method.invoke(Method.java:606)
	at org.apache.maven.surefire.junit.JUnitTestSet.execute(JUnitTestSet.java:99)
	at org.apache.maven.surefire.junit.JUnit3Provider.executeTestSet(JUnit3Provider.java:136)
	at org.apache.maven.surefire.junit.JUnit3Provider.invoke(JUnit3Provider.java:109)
	at org.apache.maven.surefire.booter.ForkedBooter.invokeProviderInSameClassLoader(ForkedBooter.java:290)
	at org.apache.maven.surefire.booter.ForkedBooter.runSuitesInProcess(ForkedBooter.java:242)
	at org.apache.maven.surefire.booter.ForkedBooter.main(ForkedBooter.java:121)


FAILED:  org.apache.maven.shared.runtime.DefaultMavenRuntimeTest.testGetProjectPropertiesWithPackagedClass

Error Message:
Error building test project expected:<0> but was:<1>

Stack Trace:
junit.framework.AssertionFailedError: Error building test project expected:<0> but was:<1>
	at junit.framework.Assert.fail(Assert.java:47)
	at junit.framework.Assert.failNotEquals(Assert.java:282)
	at junit.framework.Assert.assertEquals(Assert.java:64)
	at junit.framework.Assert.assertEquals(Assert.java:201)
	at org.apache.maven.shared.runtime.DefaultMavenRuntimeTest.packageProject(DefaultMavenRuntimeTest.java:682)
	at org.apache.maven.shared.runtime.DefaultMavenRuntimeTest.setUp(DefaultMavenRuntimeTest.java:74)
	at junit.framework.TestCase.runBare(TestCase.java:125)
	at junit.framework.TestResult$1.protect(TestResult.java:106)
	at junit.framework.TestResult.runProtected(TestResult.java:124)
	at junit.framework.TestResult.run(TestResult.java:109)
	at junit.framework.TestCase.run(TestCase.java:118)
	at junit.framework.TestSuite.runTest(TestSuite.java:208)
	at junit.framework.TestSuite.run(TestSuite.java:203)
	at sun.reflect.NativeMethodAccessorImpl.invoke0(Native Method)
	at sun.reflect.NativeMethodAccessorImpl.invoke(NativeMethodAccessorImpl.java:57)
	at sun.reflect.DelegatingMethodAccessorImpl.invoke(DelegatingMethodAccessorImpl.java:43)
	at java.lang.reflect.Method.invoke(Method.java:606)
	at org.apache.maven.surefire.junit.JUnitTestSet.execute(JUnitTestSet.java:99)
	at org.apache.maven.surefire.junit.JUnit3Provider.executeTestSet(JUnit3Provider.java:136)
	at org.apache.maven.surefire.junit.JUnit3Provider.invoke(JUnit3Provider.java:109)
	at org.apache.maven.surefire.booter.ForkedBooter.invokeProviderInSameClassLoader(ForkedBooter.java:290)
	at org.apache.maven.surefire.booter.ForkedBooter.runSuitesInProcess(ForkedBooter.java:242)
	at org.apache.maven.surefire.booter.ForkedBooter.main(ForkedBooter.java:121)


FAILED:  org.apache.maven.shared.runtime.DefaultMavenRuntimeTest.testGetProjectsPropertiesWithSingleJar

Error Message:
Error building test project expected:<0> but was:<1>

Stack Trace:
junit.framework.AssertionFailedError: Error building test project expected:<0> but was:<1>
	at junit.framework.Assert.fail(Assert.java:47)
	at junit.framework.Assert.failNotEquals(Assert.java:282)
	at junit.framework.Assert.assertEquals(Assert.java:64)
	at junit.framework.Assert.assertEquals(Assert.java:201)
	at org.apache.maven.shared.runtime.DefaultMavenRuntimeTest.packageProject(DefaultMavenRuntimeTest.java:682)
	at org.apache.maven.shared.runtime.DefaultMavenRuntimeTest.setUp(DefaultMavenRuntimeTest.java:74)
	at junit.framework.TestCase.runBare(TestCase.java:125)
	at junit.framework.TestResult$1.protect(TestResult.java:106)
	at junit.framework.TestResult.runProtected(TestResult.java:124)
	at junit.framework.TestResult.run(TestResult.java:109)
	at junit.framework.TestCase.run(TestCase.java:118)
	at junit.framework.TestSuite.runTest(TestSuite.java:208)
	at junit.framework.TestSuite.run(TestSuite.java:203)
	at sun.reflect.NativeMethodAccessorImpl.invoke0(Native Method)
	at sun.reflect.NativeMethodAccessorImpl.invoke(NativeMethodAccessorImpl.java:57)
	at sun.reflect.DelegatingMethodAccessorImpl.invoke(DelegatingMethodAccessorImpl.java:43)
	at java.lang.reflect.Method.invoke(Method.java:606)
	at org.apache.maven.surefire.junit.JUnitTestSet.execute(JUnitTestSet.java:99)
	at org.apache.maven.surefire.junit.JUnit3Provider.executeTestSet(JUnit3Provider.java:136)
	at org.apache.maven.surefire.junit.JUnit3Provider.invoke(JUnit3Provider.java:109)
	at org.apache.maven.surefire.booter.ForkedBooter.invokeProviderInSameClassLoader(ForkedBooter.java:290)
	at org.apache.maven.surefire.booter.ForkedBooter.runSuitesInProcess(ForkedBooter.java:242)
	at org.apache.maven.surefire.booter.ForkedBooter.main(ForkedBooter.java:121)


FAILED:  org.apache.maven.shared.runtime.DefaultMavenRuntimeTest.testGetProjectsPropertiesWithMultipleVersions

Error Message:
Error building test project expected:<0> but was:<1>

Stack Trace:
junit.framework.AssertionFailedError: Error building test project expected:<0> but was:<1>
	at junit.framework.Assert.fail(Assert.java:47)
	at junit.framework.Assert.failNotEquals(Assert.java:282)
	at junit.framework.Assert.assertEquals(Assert.java:64)
	at junit.framework.Assert.assertEquals(Assert.java:201)
	at org.apache.maven.shared.runtime.DefaultMavenRuntimeTest.packageProject(DefaultMavenRuntimeTest.java:682)
	at org.apache.maven.shared.runtime.DefaultMavenRuntimeTest.setUp(DefaultMavenRuntimeTest.java:74)
	at junit.framework.TestCase.runBare(TestCase.java:125)
	at junit.framework.TestResult$1.protect(TestResult.java:106)
	at junit.framework.TestResult.runProtected(TestResult.java:124)
	at junit.framework.TestResult.run(TestResult.java:109)
	at junit.framework.TestCase.run(TestCase.java:118)
	at junit.framework.TestSuite.runTest(TestSuite.java:208)
	at junit.framework.TestSuite.run(TestSuite.java:203)
	at sun.reflect.NativeMethodAccessorImpl.invoke0(Native Method)
	at sun.reflect.NativeMethodAccessorImpl.invoke(NativeMethodAccessorImpl.java:57)
	at sun.reflect.DelegatingMethodAccessorImpl.invoke(DelegatingMethodAccessorImpl.java:43)
	at java.lang.reflect.Method.invoke(Method.java:606)
	at org.apache.maven.surefire.junit.JUnitTestSet.execute(JUnitTestSet.java:99)
	at org.apache.maven.surefire.junit.JUnit3Provider.executeTestSet(JUnit3Provider.java:136)
	at org.apache.maven.surefire.junit.JUnit3Provider.invoke(JUnit3Provider.java:109)
	at org.apache.maven.surefire.booter.ForkedBooter.invokeProviderInSameClassLoader(ForkedBooter.java:290)
	at org.apache.maven.surefire.booter.ForkedBooter.runSuitesInProcess(ForkedBooter.java:242)
	at org.apache.maven.surefire.booter.ForkedBooter.main(ForkedBooter.java:121)


FAILED:  org.apache.maven.shared.runtime.DefaultMavenRuntimeTest.testGetProjectsPropertiesWithParentDelegation

Error Message:
Error building test project expected:<0> but was:<1>

Stack Trace:
junit.framework.AssertionFailedError: Error building test project expected:<0> but was:<1>
	at junit.framework.Assert.fail(Assert.java:47)
	at junit.framework.Assert.failNotEquals(Assert.java:282)
	at junit.framework.Assert.assertEquals(Assert.java:64)
	at junit.framework.Assert.assertEquals(Assert.java:201)
	at org.apache.maven.shared.runtime.DefaultMavenRuntimeTest.packageProject(DefaultMavenRuntimeTest.java:682)
	at org.apache.maven.shared.runtime.DefaultMavenRuntimeTest.setUp(DefaultMavenRuntimeTest.java:74)
	at junit.framework.TestCase.runBare(TestCase.java:125)
	at junit.framework.TestResult$1.protect(TestResult.java:106)
	at junit.framework.TestResult.runProtected(TestResult.java:124)
	at junit.framework.TestResult.run(TestResult.java:109)
	at junit.framework.TestCase.run(TestCase.java:118)
	at junit.framework.TestSuite.runTest(TestSuite.java:208)
	at junit.framework.TestSuite.run(TestSuite.java:203)
	at sun.reflect.NativeMethodAccessorImpl.invoke0(Native Method)
	at sun.reflect.NativeMethodAccessorImpl.invoke(NativeMethodAccessorImpl.java:57)
	at sun.reflect.DelegatingMethodAccessorImpl.invoke(DelegatingMethodAccessorImpl.java:43)
	at java.lang.reflect.Method.invoke(Method.java:606)
	at org.apache.maven.surefire.junit.JUnitTestSet.execute(JUnitTestSet.java:99)
	at org.apache.maven.surefire.junit.JUnit3Provider.executeTestSet(JUnit3Provider.java:136)
	at org.apache.maven.surefire.junit.JUnit3Provider.invoke(JUnit3Provider.java:109)
	at org.apache.maven.surefire.booter.ForkedBooter.invokeProviderInSameClassLoader(ForkedBooter.java:290)
	at org.apache.maven.surefire.booter.ForkedBooter.runSuitesInProcess(ForkedBooter.java:242)
	at org.apache.maven.surefire.booter.ForkedBooter.main(ForkedBooter.java:121)


FAILED:  org.apache.maven.shared.runtime.DefaultMavenRuntimeTest.testGetProjectPropertiesWithSubPackagedClass

Error Message:
Error building test project expected:<0> but was:<1>

Stack Trace:
junit.framework.AssertionFailedError: Error building test project expected:<0> but was:<1>
	at junit.framework.Assert.fail(Assert.java:47)
	at junit.framework.Assert.failNotEquals(Assert.java:282)
	at junit.framework.Assert.assertEquals(Assert.java:64)
	at junit.framework.Assert.assertEquals(Assert.java:201)
	at org.apache.maven.shared.runtime.DefaultMavenRuntimeTest.packageProject(DefaultMavenRuntimeTest.java:682)
	at org.apache.maven.shared.runtime.DefaultMavenRuntimeTest.setUp(DefaultMavenRuntimeTest.java:74)
	at junit.framework.TestCase.runBare(TestCase.java:125)
	at junit.framework.TestResult$1.protect(TestResult.java:106)
	at junit.framework.TestResult.runProtected(TestResult.java:124)
	at junit.framework.TestResult.run(TestResult.java:109)
	at junit.framework.TestCase.run(TestCase.java:118)
	at junit.framework.TestSuite.runTest(TestSuite.java:208)
	at junit.framework.TestSuite.run(TestSuite.java:203)
	at sun.reflect.NativeMethodAccessorImpl.invoke0(Native Method)
	at sun.reflect.NativeMethodAccessorImpl.invoke(NativeMethodAccessorImpl.java:57)
	at sun.reflect.DelegatingMethodAccessorImpl.invoke(DelegatingMethodAccessorImpl.java:43)
	at java.lang.reflect.Method.invoke(Method.java:606)
	at org.apache.maven.surefire.junit.JUnitTestSet.execute(JUnitTestSet.java:99)
	at org.apache.maven.surefire.junit.JUnit3Provider.executeTestSet(JUnit3Provider.java:136)
	at org.apache.maven.surefire.junit.JUnit3Provider.invoke(JUnit3Provider.java:109)
	at org.apache.maven.surefire.booter.ForkedBooter.invokeProviderInSameClassLoader(ForkedBooter.java:290)
	at org.apache.maven.surefire.booter.ForkedBooter.runSuitesInProcess(ForkedBooter.java:242)
	at org.apache.maven.surefire.booter.ForkedBooter.main(ForkedBooter.java:121)


FAILED:  org.apache.maven.shared.runtime.DefaultMavenRuntimeTest.testGetProjectPropertiesWithParentDelegation

Error Message:
Error building test project expected:<0> but was:<1>

Stack Trace:
junit.framework.AssertionFailedError: Error building test project expected:<0> but was:<1>
	at junit.framework.Assert.fail(Assert.java:47)
	at junit.framework.Assert.failNotEquals(Assert.java:282)
	at junit.framework.Assert.assertEquals(Assert.java:64)
	at junit.framework.Assert.assertEquals(Assert.java:201)
	at org.apache.maven.shared.runtime.DefaultMavenRuntimeTest.packageProject(DefaultMavenRuntimeTest.java:682)
	at org.apache.maven.shared.runtime.DefaultMavenRuntimeTest.setUp(DefaultMavenRuntimeTest.java:74)
	at junit.framework.TestCase.runBare(TestCase.java:125)
	at junit.framework.TestResult$1.protect(TestResult.java:106)
	at junit.framework.TestResult.runProtected(TestResult.java:124)
	at junit.framework.TestResult.run(TestResult.java:109)
	at junit.framework.TestCase.run(TestCase.java:118)
	at junit.framework.TestSuite.runTest(TestSuite.java:208)
	at junit.framework.TestSuite.run(TestSuite.java:203)
	at sun.reflect.NativeMethodAccessorImpl.invoke0(Native Method)
	at sun.reflect.NativeMethodAccessorImpl.invoke(NativeMethodAccessorImpl.java:57)
	at sun.reflect.DelegatingMethodAccessorImpl.invoke(DelegatingMethodAccessorImpl.java:43)
	at java.lang.reflect.Method.invoke(Method.java:606)
	at org.apache.maven.surefire.junit.JUnitTestSet.execute(JUnitTestSet.java:99)
	at org.apache.maven.surefire.junit.JUnit3Provider.executeTestSet(JUnit3Provider.java:136)
	at org.apache.maven.surefire.junit.JUnit3Provider.invoke(JUnit3Provider.java:109)
	at org.apache.maven.surefire.booter.ForkedBooter.invokeProviderInSameClassLoader(ForkedBooter.java:290)
	at org.apache.maven.surefire.booter.ForkedBooter.runSuitesInProcess(ForkedBooter.java:242)
	at org.apache.maven.surefire.booter.ForkedBooter.main(ForkedBooter.java:121)


FAILED:  org.apache.maven.shared.runtime.DefaultMavenRuntimeTest.testGetProjectPropertiesWithFileUrl

Error Message:
Error building test project expected:<0> but was:<1>

Stack Trace:
junit.framework.AssertionFailedError: Error building test project expected:<0> but was:<1>
	at junit.framework.Assert.fail(Assert.java:47)
	at junit.framework.Assert.failNotEquals(Assert.java:282)
	at junit.framework.Assert.assertEquals(Assert.java:64)
	at junit.framework.Assert.assertEquals(Assert.java:201)
	at org.apache.maven.shared.runtime.DefaultMavenRuntimeTest.packageProject(DefaultMavenRuntimeTest.java:682)
	at org.apache.maven.shared.runtime.DefaultMavenRuntimeTest.setUp(DefaultMavenRuntimeTest.java:74)
	at junit.framework.TestCase.runBare(TestCase.java:125)
	at junit.framework.TestResult$1.protect(TestResult.java:106)
	at junit.framework.TestResult.runProtected(TestResult.java:124)
	at junit.framework.TestResult.run(TestResult.java:109)
	at junit.framework.TestCase.run(TestCase.java:118)
	at junit.framework.TestSuite.runTest(TestSuite.java:208)
	at junit.framework.TestSuite.run(TestSuite.java:203)
	at sun.reflect.NativeMethodAccessorImpl.invoke0(Native Method)
	at sun.reflect.NativeMethodAccessorImpl.invoke(NativeMethodAccessorImpl.java:57)
	at sun.reflect.DelegatingMethodAccessorImpl.invoke(DelegatingMethodAccessorImpl.java:43)
	at java.lang.reflect.Method.invoke(Method.java:606)
	at org.apache.maven.surefire.junit.JUnitTestSet.execute(JUnitTestSet.java:99)
	at org.apache.maven.surefire.junit.JUnit3Provider.executeTestSet(JUnit3Provider.java:136)
	at org.apache.maven.surefire.junit.JUnit3Provider.invoke(JUnit3Provider.java:109)
	at org.apache.maven.surefire.booter.ForkedBooter.invokeProviderInSameClassLoader(ForkedBooter.java:290)
	at org.apache.maven.surefire.booter.ForkedBooter.runSuitesInProcess(ForkedBooter.java:242)
	at org.apache.maven.surefire.booter.ForkedBooter.main(ForkedBooter.java:121)


FAILED:  org.apache.maven.shared.runtime.DefaultMavenRuntimeTest.testGetProjectsPropertiesWithMultipleJars

Error Message:
Error building test project expected:<0> but was:<1>

Stack Trace:
junit.framework.AssertionFailedError: Error building test project expected:<0> but was:<1>
	at junit.framework.Assert.fail(Assert.java:47)
	at junit.framework.Assert.failNotEquals(Assert.java:282)
	at junit.framework.Assert.assertEquals(Assert.java:64)
	at junit.framework.Assert.assertEquals(Assert.java:201)
	at org.apache.maven.shared.runtime.DefaultMavenRuntimeTest.packageProject(DefaultMavenRuntimeTest.java:682)
	at org.apache.maven.shared.runtime.DefaultMavenRuntimeTest.setUp(DefaultMavenRuntimeTest.java:74)
	at junit.framework.TestCase.runBare(TestCase.java:125)
	at junit.framework.TestResult$1.protect(TestResult.java:106)
	at junit.framework.TestResult.runProtected(TestResult.java:124)
	at junit.framework.TestResult.run(TestResult.java:109)
	at junit.framework.TestCase.run(TestCase.java:118)
	at junit.framework.TestSuite.runTest(TestSuite.java:208)
	at junit.framework.TestSuite.run(TestSuite.java:203)
	at sun.reflect.NativeMethodAccessorImpl.invoke0(Native Method)
	at sun.reflect.NativeMethodAccessorImpl.invoke(NativeMethodAccessorImpl.java:57)
	at sun.reflect.DelegatingMethodAccessorImpl.invoke(DelegatingMethodAccessorImpl.java:43)
	at java.lang.reflect.Method.invoke(Method.java:606)
	at org.apache.maven.surefire.junit.JUnitTestSet.execute(JUnitTestSet.java:99)
	at org.apache.maven.surefire.junit.JUnit3Provider.executeTestSet(JUnit3Provider.java:136)
	at org.apache.maven.surefire.junit.JUnit3Provider.invoke(JUnit3Provider.java:109)
	at org.apache.maven.surefire.booter.ForkedBooter.invokeProviderInSameClassLoader(ForkedBooter.java:290)
	at org.apache.maven.surefire.booter.ForkedBooter.runSuitesInProcess(ForkedBooter.java:242)
	at org.apache.maven.surefire.booter.ForkedBooter.main(ForkedBooter.java:121)


FAILED:  org.apache.maven.shared.runtime.DefaultMavenRuntimeTest.testGetProjectPropertiesWithMultipleVersions

Error Message:
Error building test project expected:<0> but was:<1>

Stack Trace:
junit.framework.AssertionFailedError: Error building test project expected:<0> but was:<1>
	at junit.framework.Assert.fail(Assert.java:47)
	at junit.framework.Assert.failNotEquals(Assert.java:282)
	at junit.framework.Assert.assertEquals(Assert.java:64)
	at junit.framework.Assert.assertEquals(Assert.java:201)
	at org.apache.maven.shared.runtime.DefaultMavenRuntimeTest.packageProject(DefaultMavenRuntimeTest.java:682)
	at org.apache.maven.shared.runtime.DefaultMavenRuntimeTest.setUp(DefaultMavenRuntimeTest.java:74)
	at junit.framework.TestCase.runBare(TestCase.java:125)
	at junit.framework.TestResult$1.protect(TestResult.java:106)
	at junit.framework.TestResult.runProtected(TestResult.java:124)
	at junit.framework.TestResult.run(TestResult.java:109)
	at junit.framework.TestCase.run(TestCase.java:118)
	at junit.framework.TestSuite.runTest(TestSuite.java:208)
	at junit.framework.TestSuite.run(TestSuite.java:203)
	at sun.reflect.NativeMethodAccessorImpl.invoke0(Native Method)
	at sun.reflect.NativeMethodAccessorImpl.invoke(NativeMethodAccessorImpl.java:57)
	at sun.reflect.DelegatingMethodAccessorImpl.invoke(DelegatingMethodAccessorImpl.java:43)
	at java.lang.reflect.Method.invoke(Method.java:606)
	at org.apache.maven.surefire.junit.JUnitTestSet.execute(JUnitTestSet.java:99)
	at org.apache.maven.surefire.junit.JUnit3Provider.executeTestSet(JUnit3Provider.java:136)
	at org.apache.maven.surefire.junit.JUnit3Provider.invoke(JUnit3Provider.java:109)
	at org.apache.maven.surefire.booter.ForkedBooter.invokeProviderInSameClassLoader(ForkedBooter.java:290)
	at org.apache.maven.surefire.booter.ForkedBooter.runSuitesInProcess(ForkedBooter.java:242)
	at org.apache.maven.surefire.booter.ForkedBooter.main(ForkedBooter.java:121)


FAILED:  org.apache.maven.shared.runtime.DefaultMavenRuntimeTest.testGetProjectWithJarUrl

Error Message:
Error building test project expected:<0> but was:<1>

Stack Trace:
junit.framework.AssertionFailedError: Error building test project expected:<0> but was:<1>
	at junit.framework.Assert.fail(Assert.java:47)
	at junit.framework.Assert.failNotEquals(Assert.java:282)
	at junit.framework.Assert.assertEquals(Assert.java:64)
	at junit.framework.Assert.assertEquals(Assert.java:201)
	at org.apache.maven.shared.runtime.DefaultMavenRuntimeTest.packageProject(DefaultMavenRuntimeTest.java:682)
	at org.apache.maven.shared.runtime.DefaultMavenRuntimeTest.setUp(DefaultMavenRuntimeTest.java:74)
	at junit.framework.TestCase.runBare(TestCase.java:125)
	at junit.framework.TestResult$1.protect(TestResult.java:106)
	at junit.framework.TestResult.runProtected(TestResult.java:124)
	at junit.framework.TestResult.run(TestResult.java:109)
	at junit.framework.TestCase.run(TestCase.java:118)
	at junit.framework.TestSuite.runTest(TestSuite.java:208)
	at junit.framework.TestSuite.run(TestSuite.java:203)
	at sun.reflect.NativeMethodAccessorImpl.invoke0(Native Method)
	at sun.reflect.NativeMethodAccessorImpl.invoke(NativeMethodAccessorImpl.java:57)
	at sun.reflect.DelegatingMethodAccessorImpl.invoke(DelegatingMethodAccessorImpl.java:43)
	at java.lang.reflect.Method.invoke(Method.java:606)
	at org.apache.maven.surefire.junit.JUnitTestSet.execute(JUnitTestSet.java:99)
	at org.apache.maven.surefire.junit.JUnit3Provider.executeTestSet(JUnit3Provider.java:136)
	at org.apache.maven.surefire.junit.JUnit3Provider.invoke(JUnit3Provider.java:109)
	at org.apache.maven.surefire.booter.ForkedBooter.invokeProviderInSameClassLoader(ForkedBooter.java:290)
	at org.apache.maven.surefire.booter.ForkedBooter.runSuitesInProcess(ForkedBooter.java:242)
	at org.apache.maven.surefire.booter.ForkedBooter.main(ForkedBooter.java:121)


FAILED:  org.apache.maven.shared.runtime.DefaultMavenRuntimeTest.testGetProjectWithJarEntryUrl

Error Message:
Error building test project expected:<0> but was:<1>

Stack Trace:
junit.framework.AssertionFailedError: Error building test project expected:<0> but was:<1>
	at junit.framework.Assert.fail(Assert.java:47)
	at junit.framework.Assert.failNotEquals(Assert.java:282)
	at junit.framework.Assert.assertEquals(Assert.java:64)
	at junit.framework.Assert.assertEquals(Assert.java:201)
	at org.apache.maven.shared.runtime.DefaultMavenRuntimeTest.packageProject(DefaultMavenRuntimeTest.java:682)
	at org.apache.maven.shared.runtime.DefaultMavenRuntimeTest.setUp(DefaultMavenRuntimeTest.java:74)
	at junit.framework.TestCase.runBare(TestCase.java:125)
	at junit.framework.TestResult$1.protect(TestResult.java:106)
	at junit.framework.TestResult.runProtected(TestResult.java:124)
	at junit.framework.TestResult.run(TestResult.java:109)
	at junit.framework.TestCase.run(TestCase.java:118)
	at junit.framework.TestSuite.runTest(TestSuite.java:208)
	at junit.framework.TestSuite.run(TestSuite.java:203)
	at sun.reflect.NativeMethodAccessorImpl.invoke0(Native Method)
	at sun.reflect.NativeMethodAccessorImpl.invoke(NativeMethodAccessorImpl.java:57)
	at sun.reflect.DelegatingMethodAccessorImpl.invoke(DelegatingMethodAccessorImpl.java:43)
	at java.lang.reflect.Method.invoke(Method.java:606)
	at org.apache.maven.surefire.junit.JUnitTestSet.execute(JUnitTestSet.java:99)
	at org.apache.maven.surefire.junit.JUnit3Provider.executeTestSet(JUnit3Provider.java:136)
	at org.apache.maven.surefire.junit.JUnit3Provider.invoke(JUnit3Provider.java:109)
	at org.apache.maven.surefire.booter.ForkedBooter.invokeProviderInSameClassLoader(ForkedBooter.java:290)
	at org.apache.maven.surefire.booter.ForkedBooter.runSuitesInProcess(ForkedBooter.java:242)
	at org.apache.maven.surefire.booter.ForkedBooter.main(ForkedBooter.java:121)


FAILED:  org.apache.maven.shared.runtime.DefaultMavenRuntimeTest.testGetProjectsWithSingleJar

Error Message:
Error building test project expected:<0> but was:<1>

Stack Trace:
junit.framework.AssertionFailedError: Error building test project expected:<0> but was:<1>
	at junit.framework.Assert.fail(Assert.java:47)
	at junit.framework.Assert.failNotEquals(Assert.java:282)
	at junit.framework.Assert.assertEquals(Assert.java:64)
	at junit.framework.Assert.assertEquals(Assert.java:201)
	at org.apache.maven.shared.runtime.DefaultMavenRuntimeTest.packageProject(DefaultMavenRuntimeTest.java:682)
	at org.apache.maven.shared.runtime.DefaultMavenRuntimeTest.setUp(DefaultMavenRuntimeTest.java:74)
	at junit.framework.TestCase.runBare(TestCase.java:125)
	at junit.framework.TestResult$1.protect(TestResult.java:106)
	at junit.framework.TestResult.runProtected(TestResult.java:124)
	at junit.framework.TestResult.run(TestResult.java:109)
	at junit.framework.TestCase.run(TestCase.java:118)
	at junit.framework.TestSuite.runTest(TestSuite.java:208)
	at junit.framework.TestSuite.run(TestSuite.java:203)
	at sun.reflect.NativeMethodAccessorImpl.invoke0(Native Method)
	at sun.reflect.NativeMethodAccessorImpl.invoke(NativeMethodAccessorImpl.java:57)
	at sun.reflect.DelegatingMethodAccessorImpl.invoke(DelegatingMethodAccessorImpl.java:43)
	at java.lang.reflect.Method.invoke(Method.java:606)
	at org.apache.maven.surefire.junit.JUnitTestSet.execute(JUnitTestSet.java:99)
	at org.apache.maven.surefire.junit.JUnit3Provider.executeTestSet(JUnit3Provider.java:136)
	at org.apache.maven.surefire.junit.JUnit3Provider.invoke(JUnit3Provider.java:109)
	at org.apache.maven.surefire.booter.ForkedBooter.invokeProviderInSameClassLoader(ForkedBooter.java:290)
	at org.apache.maven.surefire.booter.ForkedBooter.runSuitesInProcess(ForkedBooter.java:242)
	at org.apache.maven.surefire.booter.ForkedBooter.main(ForkedBooter.java:121)


FAILED:  org.apache.maven.shared.runtime.DefaultMavenRuntimeTest.testGetProjectWithFileUrl

Error Message:
Error building test project expected:<0> but was:<1>

Stack Trace:
junit.framework.AssertionFailedError: Error building test project expected:<0> but was:<1>
	at junit.framework.Assert.fail(Assert.java:47)
	at junit.framework.Assert.failNotEquals(Assert.java:282)
	at junit.framework.Assert.assertEquals(Assert.java:64)
	at junit.framework.Assert.assertEquals(Assert.java:201)
	at org.apache.maven.shared.runtime.DefaultMavenRuntimeTest.packageProject(DefaultMavenRuntimeTest.java:682)
	at org.apache.maven.shared.runtime.DefaultMavenRuntimeTest.setUp(DefaultMavenRuntimeTest.java:74)
	at junit.framework.TestCase.runBare(TestCase.java:125)
	at junit.framework.TestResult$1.protect(TestResult.java:106)
	at junit.framework.TestResult.runProtected(TestResult.java:124)
	at junit.framework.TestResult.run(TestResult.java:109)
	at junit.framework.TestCase.run(TestCase.java:118)
	at junit.framework.TestSuite.runTest(TestSuite.java:208)
	at junit.framework.TestSuite.run(TestSuite.java:203)
	at sun.reflect.NativeMethodAccessorImpl.invoke0(Native Method)
	at sun.reflect.NativeMethodAccessorImpl.invoke(NativeMethodAccessorImpl.java:57)
	at sun.reflect.DelegatingMethodAccessorImpl.invoke(DelegatingMethodAccessorImpl.java:43)
	at java.lang.reflect.Method.invoke(Method.java:606)
	at org.apache.maven.surefire.junit.JUnitTestSet.execute(JUnitTestSet.java:99)
	at org.apache.maven.surefire.junit.JUnit3Provider.executeTestSet(JUnit3Provider.java:136)
	at org.apache.maven.surefire.junit.JUnit3Provider.invoke(JUnit3Provider.java:109)
	at org.apache.maven.surefire.booter.ForkedBooter.invokeProviderInSameClassLoader(ForkedBooter.java:290)
	at org.apache.maven.surefire.booter.ForkedBooter.runSuitesInProcess(ForkedBooter.java:242)
	at org.apache.maven.surefire.booter.ForkedBooter.main(ForkedBooter.java:121)


FAILED:  org.apache.maven.shared.runtime.DefaultMavenRuntimeTest.testGetProjectsWithParentDelegation

Error Message:
Error building test project expected:<0> but was:<1>

Stack Trace:
junit.framework.AssertionFailedError: Error building test project expected:<0> but was:<1>
	at junit.framework.Assert.fail(Assert.java:47)
	at junit.framework.Assert.failNotEquals(Assert.java:282)
	at junit.framework.Assert.assertEquals(Assert.java:64)
	at junit.framework.Assert.assertEquals(Assert.java:201)
	at org.apache.maven.shared.runtime.DefaultMavenRuntimeTest.packageProject(DefaultMavenRuntimeTest.java:682)
	at org.apache.maven.shared.runtime.DefaultMavenRuntimeTest.setUp(DefaultMavenRuntimeTest.java:74)
	at junit.framework.TestCase.runBare(TestCase.java:125)
	at junit.framework.TestResult$1.protect(TestResult.java:106)
	at junit.framework.TestResult.runProtected(TestResult.java:124)
	at junit.framework.TestResult.run(TestResult.java:109)
	at junit.framework.TestCase.run(TestCase.java:118)
	at junit.framework.TestSuite.runTest(TestSuite.java:208)
	at junit.framework.TestSuite.run(TestSuite.java:203)
	at sun.reflect.NativeMethodAccessorImpl.invoke0(Native Method)
	at sun.reflect.NativeMethodAccessorImpl.invoke(NativeMethodAccessorImpl.java:57)
	at sun.reflect.DelegatingMethodAccessorImpl.invoke(DelegatingMethodAccessorImpl.java:43)
	at java.lang.reflect.Method.invoke(Method.java:606)
	at org.apache.maven.surefire.junit.JUnitTestSet.execute(JUnitTestSet.java:99)
	at org.apache.maven.surefire.junit.JUnit3Provider.executeTestSet(JUnit3Provider.java:136)
	at org.apache.maven.surefire.junit.JUnit3Provider.invoke(JUnit3Provider.java:109)
	at org.apache.maven.surefire.booter.ForkedBooter.invokeProviderInSameClassLoader(ForkedBooter.java:290)
	at org.apache.maven.surefire.booter.ForkedBooter.runSuitesInProcess(ForkedBooter.java:242)
	at org.apache.maven.surefire.booter.ForkedBooter.main(ForkedBooter.java:121)


FAILED:  org.apache.maven.shared.runtime.DefaultMavenRuntimeTest.testGetProjectWithSubPackagedClass

Error Message:
Error building test project expected:<0> but was:<1>

Stack Trace:
junit.framework.AssertionFailedError: Error building test project expected:<0> but was:<1>
	at junit.framework.Assert.fail(Assert.java:47)
	at junit.framework.Assert.failNotEquals(Assert.java:282)
	at junit.framework.Assert.assertEquals(Assert.java:64)
	at junit.framework.Assert.assertEquals(Assert.java:201)
	at org.apache.maven.shared.runtime.DefaultMavenRuntimeTest.packageProject(DefaultMavenRuntimeTest.java:682)
	at org.apache.maven.shared.runtime.DefaultMavenRuntimeTest.setUp(DefaultMavenRuntimeTest.java:74)
	at junit.framework.TestCase.runBare(TestCase.java:125)
	at junit.framework.TestResult$1.protect(TestResult.java:106)
	at junit.framework.TestResult.runProtected(TestResult.java:124)
	at junit.framework.TestResult.run(TestResult.java:109)
	at junit.framework.TestCase.run(TestCase.java:118)
	at junit.framework.TestSuite.runTest(TestSuite.java:208)
	at junit.framework.TestSuite.run(TestSuite.java:203)
	at sun.reflect.NativeMethodAccessorImpl.invoke0(Native Method)
	at sun.reflect.NativeMethodAccessorImpl.invoke(NativeMethodAccessorImpl.java:57)
	at sun.reflect.DelegatingMethodAccessorImpl.invoke(DelegatingMethodAccessorImpl.java:43)
	at java.lang.reflect.Method.invoke(Method.java:606)
	at org.apache.maven.surefire.junit.JUnitTestSet.execute(JUnitTestSet.java:99)
	at org.apache.maven.surefire.junit.JUnit3Provider.executeTestSet(JUnit3Provider.java:136)
	at org.apache.maven.surefire.junit.JUnit3Provider.invoke(JUnit3Provider.java:109)
	at org.apache.maven.surefire.booter.ForkedBooter.invokeProviderInSameClassLoader(ForkedBooter.java:290)
	at org.apache.maven.surefire.booter.ForkedBooter.runSuitesInProcess(ForkedBooter.java:242)
	at org.apache.maven.surefire.booter.ForkedBooter.main(ForkedBooter.java:121)


FAILED:  org.apache.maven.shared.runtime.DefaultMavenRuntimeTest.testGetProjectsWithMultipleVersionsReversed

Error Message:
Error building test project expected:<0> but was:<1>

Stack Trace:
junit.framework.AssertionFailedError: Error building test project expected:<0> but was:<1>
	at junit.framework.Assert.fail(Assert.java:47)
	at junit.framework.Assert.failNotEquals(Assert.java:282)
	at junit.framework.Assert.assertEquals(Assert.java:64)
	at junit.framework.Assert.assertEquals(Assert.java:201)
	at org.apache.maven.shared.runtime.DefaultMavenRuntimeTest.packageProject(DefaultMavenRuntimeTest.java:682)
	at org.apache.maven.shared.runtime.DefaultMavenRuntimeTest.setUp(DefaultMavenRuntimeTest.java:74)
	at junit.framework.TestCase.runBare(TestCase.java:125)
	at junit.framework.TestResult$1.protect(TestResult.java:106)
	at junit.framework.TestResult.runProtected(TestResult.java:124)
	at junit.framework.TestResult.run(TestResult.java:109)
	at junit.framework.TestCase.run(TestCase.java:118)
	at junit.framework.TestSuite.runTest(TestSuite.java:208)
	at junit.framework.TestSuite.run(TestSuite.java:203)
	at sun.reflect.NativeMethodAccessorImpl.invoke0(Native Method)
	at sun.reflect.NativeMethodAccessorImpl.invoke(NativeMethodAccessorImpl.java:57)
	at sun.reflect.DelegatingMethodAccessorImpl.invoke(DelegatingMethodAccessorImpl.java:43)
	at java.lang.reflect.Method.invoke(Method.java:606)
	at org.apache.maven.surefire.junit.JUnitTestSet.execute(JUnitTestSet.java:99)
	at org.apache.maven.surefire.junit.JUnit3Provider.executeTestSet(JUnit3Provider.java:136)
	at org.apache.maven.surefire.junit.JUnit3Provider.invoke(JUnit3Provider.java:109)
	at org.apache.maven.surefire.booter.ForkedBooter.invokeProviderInSameClassLoader(ForkedBooter.java:290)
	at org.apache.maven.surefire.booter.ForkedBooter.runSuitesInProcess(ForkedBooter.java:242)
	at org.apache.maven.surefire.booter.ForkedBooter.main(ForkedBooter.java:121)


FAILED:  org.apache.maven.shared.runtime.DefaultMavenRuntimeTest.testGetProjectWithMultipleVersions

Error Message:
Error building test project expected:<0> but was:<1>

Stack Trace:
junit.framework.AssertionFailedError: Error building test project expected:<0> but was:<1>
	at junit.framework.Assert.fail(Assert.java:47)
	at junit.framework.Assert.failNotEquals(Assert.java:282)
	at junit.framework.Assert.assertEquals(Assert.java:64)
	at junit.framework.Assert.assertEquals(Assert.java:201)
	at org.apache.maven.shared.runtime.DefaultMavenRuntimeTest.packageProject(DefaultMavenRuntimeTest.java:682)
	at org.apache.maven.shared.runtime.DefaultMavenRuntimeTest.setUp(DefaultMavenRuntimeTest.java:74)
	at junit.framework.TestCase.runBare(TestCase.java:125)
	at junit.framework.TestResult$1.protect(TestResult.java:106)
	at junit.framework.TestResult.runProtected(TestResult.java:124)
	at junit.framework.TestResult.run(TestResult.java:109)
	at junit.framework.TestCase.run(TestCase.java:118)
	at junit.framework.TestSuite.runTest(TestSuite.java:208)
	at junit.framework.TestSuite.run(TestSuite.java:203)
	at sun.reflect.NativeMethodAccessorImpl.invoke0(Native Method)
	at sun.reflect.NativeMethodAccessorImpl.invoke(NativeMethodAccessorImpl.java:57)
	at sun.reflect.DelegatingMethodAccessorImpl.invoke(DelegatingMethodAccessorImpl.java:43)
	at java.lang.reflect.Method.invoke(Method.java:606)
	at org.apache.maven.surefire.junit.JUnitTestSet.execute(JUnitTestSet.java:99)
	at org.apache.maven.surefire.junit.JUnit3Provider.executeTestSet(JUnit3Provider.java:136)
	at org.apache.maven.surefire.junit.JUnit3Provider.invoke(JUnit3Provider.java:109)
	at org.apache.maven.surefire.booter.ForkedBooter.invokeProviderInSameClassLoader(ForkedBooter.java:290)
	at org.apache.maven.surefire.booter.ForkedBooter.runSuitesInProcess(ForkedBooter.java:242)
	at org.apache.maven.surefire.booter.ForkedBooter.main(ForkedBooter.java:121)


FAILED:  org.apache.maven.shared.runtime.DefaultMavenRuntimeTest.testGetSortedProjectsWithDependentJars

Error Message:
Error building test project expected:<0> but was:<1>

Stack Trace:
junit.framework.AssertionFailedError: Error building test project expected:<0> but was:<1>
	at junit.framework.Assert.fail(Assert.java:47)
	at junit.framework.Assert.failNotEquals(Assert.java:282)
	at junit.framework.Assert.assertEquals(Assert.java:64)
	at junit.framework.Assert.assertEquals(Assert.java:201)
	at org.apache.maven.shared.runtime.DefaultMavenRuntimeTest.packageProject(DefaultMavenRuntimeTest.java:682)
	at org.apache.maven.shared.runtime.DefaultMavenRuntimeTest.setUp(DefaultMavenRuntimeTest.java:74)
	at junit.framework.TestCase.runBare(TestCase.java:125)
	at junit.framework.TestResult$1.protect(TestResult.java:106)
	at junit.framework.TestResult.runProtected(TestResult.java:124)
	at junit.framework.TestResult.run(TestResult.java:109)
	at junit.framework.TestCase.run(TestCase.java:118)
	at junit.framework.TestSuite.runTest(TestSuite.java:208)
	at junit.framework.TestSuite.run(TestSuite.java:203)
	at sun.reflect.NativeMethodAccessorImpl.invoke0(Native Method)
	at sun.reflect.NativeMethodAccessorImpl.invoke(NativeMethodAccessorImpl.java:57)
	at sun.reflect.DelegatingMethodAccessorImpl.invoke(DelegatingMethodAccessorImpl.java:43)
	at java.lang.reflect.Method.invoke(Method.java:606)
	at org.apache.maven.surefire.junit.JUnitTestSet.execute(JUnitTestSet.java:99)
	at org.apache.maven.surefire.junit.JUnit3Provider.executeTestSet(JUnit3Provider.java:136)
	at org.apache.maven.surefire.junit.JUnit3Provider.invoke(JUnit3Provider.java:109)
	at org.apache.maven.surefire.booter.ForkedBooter.invokeProviderInSameClassLoader(ForkedBooter.java:290)
	at org.apache.maven.surefire.booter.ForkedBooter.runSuitesInProcess(ForkedBooter.java:242)
	at org.apache.maven.surefire.booter.ForkedBooter.main(ForkedBooter.java:121)


FAILED:  org.apache.maven.shared.runtime.DefaultMavenRuntimeTest.testGetSortedProjectsWithChildDelegation

Error Message:
Error building test project expected:<0> but was:<1>

Stack Trace:
junit.framework.AssertionFailedError: Error building test project expected:<0> but was:<1>
	at junit.framework.Assert.fail(Assert.java:47)
	at junit.framework.Assert.failNotEquals(Assert.java:282)
	at junit.framework.Assert.assertEquals(Assert.java:64)
	at junit.framework.Assert.assertEquals(Assert.java:201)
	at org.apache.maven.shared.runtime.DefaultMavenRuntimeTest.packageProject(DefaultMavenRuntimeTest.java:682)
	at org.apache.maven.shared.runtime.DefaultMavenRuntimeTest.setUp(DefaultMavenRuntimeTest.java:74)
	at junit.framework.TestCase.runBare(TestCase.java:125)
	at junit.framework.TestResult$1.protect(TestResult.java:106)
	at junit.framework.TestResult.runProtected(TestResult.java:124)
	at junit.framework.TestResult.run(TestResult.java:109)
	at junit.framework.TestCase.run(TestCase.java:118)
	at junit.framework.TestSuite.runTest(TestSuite.java:208)
	at junit.framework.TestSuite.run(TestSuite.java:203)
	at sun.reflect.NativeMethodAccessorImpl.invoke0(Native Method)
	at sun.reflect.NativeMethodAccessorImpl.invoke(NativeMethodAccessorImpl.java:57)
	at sun.reflect.DelegatingMethodAccessorImpl.invoke(DelegatingMethodAccessorImpl.java:43)
	at java.lang.reflect.Method.invoke(Method.java:606)
	at org.apache.maven.surefire.junit.JUnitTestSet.execute(JUnitTestSet.java:99)
	at org.apache.maven.surefire.junit.JUnit3Provider.executeTestSet(JUnit3Provider.java:136)
	at org.apache.maven.surefire.junit.JUnit3Provider.invoke(JUnit3Provider.java:109)
	at org.apache.maven.surefire.booter.ForkedBooter.invokeProviderInSameClassLoader(ForkedBooter.java:290)
	at org.apache.maven.surefire.booter.ForkedBooter.runSuitesInProcess(ForkedBooter.java:242)
	at org.apache.maven.surefire.booter.ForkedBooter.main(ForkedBooter.java:121)


FAILED:  org.apache.maven.shared.runtime.DefaultMavenRuntimeTest.testGetSortedProjectsWithMediatedDependency

Error Message:
Error building test project expected:<0> but was:<1>

Stack Trace:
junit.framework.AssertionFailedError: Error building test project expected:<0> but was:<1>
	at junit.framework.Assert.fail(Assert.java:47)
	at junit.framework.Assert.failNotEquals(Assert.java:282)
	at junit.framework.Assert.assertEquals(Assert.java:64)
	at junit.framework.Assert.assertEquals(Assert.java:201)
	at org.apache.maven.shared.runtime.DefaultMavenRuntimeTest.packageProject(DefaultMavenRuntimeTest.java:682)
	at org.apache.maven.shared.runtime.DefaultMavenRuntimeTest.setUp(DefaultMavenRuntimeTest.java:74)
	at junit.framework.TestCase.runBare(TestCase.java:125)
	at junit.framework.TestResult$1.protect(TestResult.java:106)
	at junit.framework.TestResult.runProtected(TestResult.java:124)
	at junit.framework.TestResult.run(TestResult.java:109)
	at junit.framework.TestCase.run(TestCase.java:118)
	at junit.framework.TestSuite.runTest(TestSuite.java:208)
	at junit.framework.TestSuite.run(TestSuite.java:203)
	at sun.reflect.NativeMethodAccessorImpl.invoke0(Native Method)
	at sun.reflect.NativeMethodAccessorImpl.invoke(NativeMethodAccessorImpl.java:57)
	at sun.reflect.DelegatingMethodAccessorImpl.invoke(DelegatingMethodAccessorImpl.java:43)
	at java.lang.reflect.Method.invoke(Method.java:606)
	at org.apache.maven.surefire.junit.JUnitTestSet.execute(JUnitTestSet.java:99)
	at org.apache.maven.surefire.junit.JUnit3Provider.executeTestSet(JUnit3Provider.java:136)
	at org.apache.maven.surefire.junit.JUnit3Provider.invoke(JUnit3Provider.java:109)
	at org.apache.maven.surefire.booter.ForkedBooter.invokeProviderInSameClassLoader(ForkedBooter.java:290)
	at org.apache.maven.surefire.booter.ForkedBooter.runSuitesInProcess(ForkedBooter.java:242)
	at org.apache.maven.surefire.booter.ForkedBooter.main(ForkedBooter.java:121)


FAILED:  org.apache.maven.shared.runtime.DefaultMavenRuntimeTest.testGetSortedProjectsWithMultipleJars

Error Message:
Error building test project expected:<0> but was:<1>

Stack Trace:
junit.framework.AssertionFailedError: Error building test project expected:<0> but was:<1>
	at junit.framework.Assert.fail(Assert.java:47)
	at junit.framework.Assert.failNotEquals(Assert.java:282)
	at junit.framework.Assert.assertEquals(Assert.java:64)
	at junit.framework.Assert.assertEquals(Assert.java:201)
	at org.apache.maven.shared.runtime.DefaultMavenRuntimeTest.packageProject(DefaultMavenRuntimeTest.java:682)
	at org.apache.maven.shared.runtime.DefaultMavenRuntimeTest.setUp(DefaultMavenRuntimeTest.java:74)
	at junit.framework.TestCase.runBare(TestCase.java:125)
	at junit.framework.TestResult$1.protect(TestResult.java:106)
	at junit.framework.TestResult.runProtected(TestResult.java:124)
	at junit.framework.TestResult.run(TestResult.java:109)
	at junit.framework.TestCase.run(TestCase.java:118)
	at junit.framework.TestSuite.runTest(TestSuite.java:208)
	at junit.framework.TestSuite.run(TestSuite.java:203)
	at sun.reflect.NativeMethodAccessorImpl.invoke0(Native Method)
	at sun.reflect.NativeMethodAccessorImpl.invoke(NativeMethodAccessorImpl.java:57)
	at sun.reflect.DelegatingMethodAccessorImpl.invoke(DelegatingMethodAccessorImpl.java:43)
	at java.lang.reflect.Method.invoke(Method.java:606)
	at org.apache.maven.surefire.junit.JUnitTestSet.execute(JUnitTestSet.java:99)
	at org.apache.maven.surefire.junit.JUnit3Provider.executeTestSet(JUnit3Provider.java:136)
	at org.apache.maven.surefire.junit.JUnit3Provider.invoke(JUnit3Provider.java:109)
	at org.apache.maven.surefire.booter.ForkedBooter.invokeProviderInSameClassLoader(ForkedBooter.java:290)
	at org.apache.maven.surefire.booter.ForkedBooter.runSuitesInProcess(ForkedBooter.java:242)
	at org.apache.maven.surefire.booter.ForkedBooter.main(ForkedBooter.java:121)


FAILED:  org.apache.maven.shared.runtime.DefaultMavenRuntimeTest.testGetSortedProjectsWithSingleJar

Error Message:
Error building test project expected:<0> but was:<1>

Stack Trace:
junit.framework.AssertionFailedError: Error building test project expected:<0> but was:<1>
	at junit.framework.Assert.fail(Assert.java:47)
	at junit.framework.Assert.failNotEquals(Assert.java:282)
	at junit.framework.Assert.assertEquals(Assert.java:64)
	at junit.framework.Assert.assertEquals(Assert.java:201)
	at org.apache.maven.shared.runtime.DefaultMavenRuntimeTest.packageProject(DefaultMavenRuntimeTest.java:682)
	at org.apache.maven.shared.runtime.DefaultMavenRuntimeTest.setUp(DefaultMavenRuntimeTest.java:74)
	at junit.framework.TestCase.runBare(TestCase.java:125)
	at junit.framework.TestResult$1.protect(TestResult.java:106)
	at junit.framework.TestResult.runProtected(TestResult.java:124)
	at junit.framework.TestResult.run(TestResult.java:109)
	at junit.framework.TestCase.run(TestCase.java:118)
	at junit.framework.TestSuite.runTest(TestSuite.java:208)
	at junit.framework.TestSuite.run(TestSuite.java:203)
	at sun.reflect.NativeMethodAccessorImpl.invoke0(Native Method)
	at sun.reflect.NativeMethodAccessorImpl.invoke(NativeMethodAccessorImpl.java:57)
	at sun.reflect.DelegatingMethodAccessorImpl.invoke(DelegatingMethodAccessorImpl.java:43)
	at java.lang.reflect.Method.invoke(Method.java:606)
	at org.apache.maven.surefire.junit.JUnitTestSet.execute(JUnitTestSet.java:99)
	at org.apache.maven.surefire.junit.JUnit3Provider.executeTestSet(JUnit3Provider.java:136)
	at org.apache.maven.surefire.junit.JUnit3Provider.invoke(JUnit3Provider.java:109)
	at org.apache.maven.surefire.booter.ForkedBooter.invokeProviderInSameClassLoader(ForkedBooter.java:290)
	at org.apache.maven.surefire.booter.ForkedBooter.runSuitesInProcess(ForkedBooter.java:242)
	at org.apache.maven.surefire.booter.ForkedBooter.main(ForkedBooter.java:121)


FAILED:  org.apache.maven.shared.runtime.DefaultMavenRuntimeTest.testGetSortedProjectsWithMultipleVersions

Error Message:
Error building test project expected:<0> but was:<1>

Stack Trace:
junit.framework.AssertionFailedError: Error building test project expected:<0> but was:<1>
	at junit.framework.Assert.fail(Assert.java:47)
	at junit.framework.Assert.failNotEquals(Assert.java:282)
	at junit.framework.Assert.assertEquals(Assert.java:64)
	at junit.framework.Assert.assertEquals(Assert.java:201)
	at org.apache.maven.shared.runtime.DefaultMavenRuntimeTest.packageProject(DefaultMavenRuntimeTest.java:682)
	at org.apache.maven.shared.runtime.DefaultMavenRuntimeTest.setUp(DefaultMavenRuntimeTest.java:74)
	at junit.framework.TestCase.runBare(TestCase.java:125)
	at junit.framework.TestResult$1.protect(TestResult.java:106)
	at junit.framework.TestResult.runProtected(TestResult.java:124)
	at junit.framework.TestResult.run(TestResult.java:109)
	at junit.framework.TestCase.run(TestCase.java:118)
	at junit.framework.TestSuite.runTest(TestSuite.java:208)
	at junit.framework.TestSuite.run(TestSuite.java:203)
	at sun.reflect.NativeMethodAccessorImpl.invoke0(Native Method)
	at sun.reflect.NativeMethodAccessorImpl.invoke(NativeMethodAccessorImpl.java:57)
	at sun.reflect.DelegatingMethodAccessorImpl.invoke(DelegatingMethodAccessorImpl.java:43)
	at java.lang.reflect.Method.invoke(Method.java:606)
	at org.apache.maven.surefire.junit.JUnitTestSet.execute(JUnitTestSet.java:99)
	at org.apache.maven.surefire.junit.JUnit3Provider.executeTestSet(JUnit3Provider.java:136)
	at org.apache.maven.surefire.junit.JUnit3Provider.invoke(JUnit3Provider.java:109)
	at org.apache.maven.surefire.booter.ForkedBooter.invokeProviderInSameClassLoader(ForkedBooter.java:290)
	at org.apache.maven.surefire.booter.ForkedBooter.runSuitesInProcess(ForkedBooter.java:242)
	at org.apache.maven.surefire.booter.ForkedBooter.main(ForkedBooter.java:121)


FAILED:  org.apache.maven.shared.runtime.DefaultMavenRuntimeTest.testGetProjectWithDefaultPackageClass

Error Message:
Error building test project expected:<0> but was:<1>

Stack Trace:
junit.framework.AssertionFailedError: Error building test project expected:<0> but was:<1>
	at junit.framework.Assert.fail(Assert.java:47)
	at junit.framework.Assert.failNotEquals(Assert.java:282)
	at junit.framework.Assert.assertEquals(Assert.java:64)
	at junit.framework.Assert.assertEquals(Assert.java:201)
	at org.apache.maven.shared.runtime.DefaultMavenRuntimeTest.packageProject(DefaultMavenRuntimeTest.java:682)
	at org.apache.maven.shared.runtime.DefaultMavenRuntimeTest.setUp(DefaultMavenRuntimeTest.java:74)
	at junit.framework.TestCase.runBare(TestCase.java:125)
	at junit.framework.TestResult$1.protect(TestResult.java:106)
	at junit.framework.TestResult.runProtected(TestResult.java:124)
	at junit.framework.TestResult.run(TestResult.java:109)
	at junit.framework.TestCase.run(TestCase.java:118)
	at junit.framework.TestSuite.runTest(TestSuite.java:208)
	at junit.framework.TestSuite.run(TestSuite.java:203)
	at sun.reflect.NativeMethodAccessorImpl.invoke0(Native Method)
	at sun.reflect.NativeMethodAccessorImpl.invoke(NativeMethodAccessorImpl.java:57)
	at sun.reflect.DelegatingMethodAccessorImpl.invoke(DelegatingMethodAccessorImpl.java:43)
	at java.lang.reflect.Method.invoke(Method.java:606)
	at org.apache.maven.surefire.junit.JUnitTestSet.execute(JUnitTestSet.java:99)
	at org.apache.maven.surefire.junit.JUnit3Provider.executeTestSet(JUnit3Provider.java:136)
	at org.apache.maven.surefire.junit.JUnit3Provider.invoke(JUnit3Provider.java:109)
	at org.apache.maven.surefire.booter.ForkedBooter.invokeProviderInSameClassLoader(ForkedBooter.java:290)
	at org.apache.maven.surefire.booter.ForkedBooter.runSuitesInProcess(ForkedBooter.java:242)
	at org.apache.maven.surefire.booter.ForkedBooter.main(ForkedBooter.java:121)


FAILED:  org.apache.maven.shared.runtime.DefaultMavenRuntimeTest.testGetProjectsWithMultipleJars

Error Message:
Error building test project expected:<0> but was:<1>

Stack Trace:
junit.framework.AssertionFailedError: Error building test project expected:<0> but was:<1>
	at junit.framework.Assert.fail(Assert.java:47)
	at junit.framework.Assert.failNotEquals(Assert.java:282)
	at junit.framework.Assert.assertEquals(Assert.java:64)
	at junit.framework.Assert.assertEquals(Assert.java:201)
	at org.apache.maven.shared.runtime.DefaultMavenRuntimeTest.packageProject(DefaultMavenRuntimeTest.java:682)
	at org.apache.maven.shared.runtime.DefaultMavenRuntimeTest.setUp(DefaultMavenRuntimeTest.java:74)
	at junit.framework.TestCase.runBare(TestCase.java:125)
	at junit.framework.TestResult$1.protect(TestResult.java:106)
	at junit.framework.TestResult.runProtected(TestResult.java:124)
	at junit.framework.TestResult.run(TestResult.java:109)
	at junit.framework.TestCase.run(TestCase.java:118)
	at junit.framework.TestSuite.runTest(TestSuite.java:208)
	at junit.framework.TestSuite.run(TestSuite.java:203)
	at sun.reflect.NativeMethodAccessorImpl.invoke0(Native Method)
	at sun.reflect.NativeMethodAccessorImpl.invoke(NativeMethodAccessorImpl.java:57)
	at sun.reflect.DelegatingMethodAccessorImpl.invoke(DelegatingMethodAccessorImpl.java:43)
	at java.lang.reflect.Method.invoke(Method.java:606)
	at org.apache.maven.surefire.junit.JUnitTestSet.execute(JUnitTestSet.java:99)
	at org.apache.maven.surefire.junit.JUnit3Provider.executeTestSet(JUnit3Provider.java:136)
	at org.apache.maven.surefire.junit.JUnit3Provider.invoke(JUnit3Provider.java:109)
	at org.apache.maven.surefire.booter.ForkedBooter.invokeProviderInSameClassLoader(ForkedBooter.java:290)
	at org.apache.maven.surefire.booter.ForkedBooter.runSuitesInProcess(ForkedBooter.java:242)
	at org.apache.maven.surefire.booter.ForkedBooter.main(ForkedBooter.java:121)


FAILED:  org.apache.maven.shared.runtime.DefaultMavenRuntimeTest.testGetProjectsWithChildDelegation

Error Message:
Error building test project expected:<0> but was:<1>

Stack Trace:
junit.framework.AssertionFailedError: Error building test project expected:<0> but was:<1>
	at junit.framework.Assert.fail(Assert.java:47)
	at junit.framework.Assert.failNotEquals(Assert.java:282)
	at junit.framework.Assert.assertEquals(Assert.java:64)
	at junit.framework.Assert.assertEquals(Assert.java:201)
	at org.apache.maven.shared.runtime.DefaultMavenRuntimeTest.packageProject(DefaultMavenRuntimeTest.java:682)
	at org.apache.maven.shared.runtime.DefaultMavenRuntimeTest.setUp(DefaultMavenRuntimeTest.java:74)
	at junit.framework.TestCase.runBare(TestCase.java:125)
	at junit.framework.TestResult$1.protect(TestResult.java:106)
	at junit.framework.TestResult.runProtected(TestResult.java:124)
	at junit.framework.TestResult.run(TestResult.java:109)
	at junit.framework.TestCase.run(TestCase.java:118)
	at junit.framework.TestSuite.runTest(TestSuite.java:208)
	at junit.framework.TestSuite.run(TestSuite.java:203)
	at sun.reflect.NativeMethodAccessorImpl.invoke0(Native Method)
	at sun.reflect.NativeMethodAccessorImpl.invoke(NativeMethodAccessorImpl.java:57)
	at sun.reflect.DelegatingMethodAccessorImpl.invoke(DelegatingMethodAccessorImpl.java:43)
	at java.lang.reflect.Method.invoke(Method.java:606)
	at org.apache.maven.surefire.junit.JUnitTestSet.execute(JUnitTestSet.java:99)
	at org.apache.maven.surefire.junit.JUnit3Provider.executeTestSet(JUnit3Provider.java:136)
	at org.apache.maven.surefire.junit.JUnit3Provider.invoke(JUnit3Provider.java:109)
	at org.apache.maven.surefire.booter.ForkedBooter.invokeProviderInSameClassLoader(ForkedBooter.java:290)
	at org.apache.maven.surefire.booter.ForkedBooter.runSuitesInProcess(ForkedBooter.java:242)
	at org.apache.maven.surefire.booter.ForkedBooter.main(ForkedBooter.java:121)


FAILED:  org.apache.maven.shared.runtime.DefaultMavenRuntimeTest.testGetSortedProjectsWithParentDelegation

Error Message:
Error building test project expected:<0> but was:<1>

Stack Trace:
junit.framework.AssertionFailedError: Error building test project expected:<0> but was:<1>
	at junit.framework.Assert.fail(Assert.java:47)
	at junit.framework.Assert.failNotEquals(Assert.java:282)
	at junit.framework.Assert.assertEquals(Assert.java:64)
	at junit.framework.Assert.assertEquals(Assert.java:201)
	at org.apache.maven.shared.runtime.DefaultMavenRuntimeTest.packageProject(DefaultMavenRuntimeTest.java:682)
	at org.apache.maven.shared.runtime.DefaultMavenRuntimeTest.setUp(DefaultMavenRuntimeTest.java:74)
	at junit.framework.TestCase.runBare(TestCase.java:125)
	at junit.framework.TestResult$1.protect(TestResult.java:106)
	at junit.framework.TestResult.runProtected(TestResult.java:124)
	at junit.framework.TestResult.run(TestResult.java:109)
	at junit.framework.TestCase.run(TestCase.java:118)
	at junit.framework.TestSuite.runTest(TestSuite.java:208)
	at junit.framework.TestSuite.run(TestSuite.java:203)
	at sun.reflect.NativeMethodAccessorImpl.invoke0(Native Method)
	at sun.reflect.NativeMethodAccessorImpl.invoke(NativeMethodAccessorImpl.java:57)
	at sun.reflect.DelegatingMethodAccessorImpl.invoke(DelegatingMethodAccessorImpl.java:43)
	at java.lang.reflect.Method.invoke(Method.java:606)
	at org.apache.maven.surefire.junit.JUnitTestSet.execute(JUnitTestSet.java:99)
	at org.apache.maven.surefire.junit.JUnit3Provider.executeTestSet(JUnit3Provider.java:136)
	at org.apache.maven.surefire.junit.JUnit3Provider.invoke(JUnit3Provider.java:109)
	at org.apache.maven.surefire.booter.ForkedBooter.invokeProviderInSameClassLoader(ForkedBooter.java:290)
	at org.apache.maven.surefire.booter.ForkedBooter.runSuitesInProcess(ForkedBooter.java:242)
	at org.apache.maven.surefire.booter.ForkedBooter.main(ForkedBooter.java:121)


FAILED:  org.apache.maven.shared.runtime.DefaultMavenRuntimeTest.testGetProjectWithParentDelegation

Error Message:
Error building test project expected:<0> but was:<1>

Stack Trace:
junit.framework.AssertionFailedError: Error building test project expected:<0> but was:<1>
	at junit.framework.Assert.fail(Assert.java:47)
	at junit.framework.Assert.failNotEquals(Assert.java:282)
	at junit.framework.Assert.assertEquals(Assert.java:64)
	at junit.framework.Assert.assertEquals(Assert.java:201)
	at org.apache.maven.shared.runtime.DefaultMavenRuntimeTest.packageProject(DefaultMavenRuntimeTest.java:682)
	at org.apache.maven.shared.runtime.DefaultMavenRuntimeTest.setUp(DefaultMavenRuntimeTest.java:74)
	at junit.framework.TestCase.runBare(TestCase.java:125)
	at junit.framework.TestResult$1.protect(TestResult.java:106)
	at junit.framework.TestResult.runProtected(TestResult.java:124)
	at junit.framework.TestResult.run(TestResult.java:109)
	at junit.framework.TestCase.run(TestCase.java:118)
	at junit.framework.TestSuite.runTest(TestSuite.java:208)
	at junit.framework.TestSuite.run(TestSuite.java:203)
	at sun.reflect.NativeMethodAccessorImpl.invoke0(Native Method)
	at sun.reflect.NativeMethodAccessorImpl.invoke(NativeMethodAccessorImpl.java:57)
	at sun.reflect.DelegatingMethodAccessorImpl.invoke(DelegatingMethodAccessorImpl.java:43)
	at java.lang.reflect.Method.invoke(Method.java:606)
	at org.apache.maven.surefire.junit.JUnitTestSet.execute(JUnitTestSet.java:99)
	at org.apache.maven.surefire.junit.JUnit3Provider.executeTestSet(JUnit3Provider.java:136)
	at org.apache.maven.surefire.junit.JUnit3Provider.invoke(JUnit3Provider.java:109)
	at org.apache.maven.surefire.booter.ForkedBooter.invokeProviderInSameClassLoader(ForkedBooter.java:290)
	at org.apache.maven.surefire.booter.ForkedBooter.runSuitesInProcess(ForkedBooter.java:242)
	at org.apache.maven.surefire.booter.ForkedBooter.main(ForkedBooter.java:121)


FAILED:  org.apache.maven.shared.runtime.DefaultMavenRuntimeTest.testGetProjectsWithMultipleVersions

Error Message:
Error building test project expected:<0> but was:<1>

Stack Trace:
junit.framework.AssertionFailedError: Error building test project expected:<0> but was:<1>
	at junit.framework.Assert.fail(Assert.java:47)
	at junit.framework.Assert.failNotEquals(Assert.java:282)
	at junit.framework.Assert.assertEquals(Assert.java:64)
	at junit.framework.Assert.assertEquals(Assert.java:201)
	at org.apache.maven.shared.runtime.DefaultMavenRuntimeTest.packageProject(DefaultMavenRuntimeTest.java:682)
	at org.apache.maven.shared.runtime.DefaultMavenRuntimeTest.setUp(DefaultMavenRuntimeTest.java:74)
	at junit.framework.TestCase.runBare(TestCase.java:125)
	at junit.framework.TestResult$1.protect(TestResult.java:106)
	at junit.framework.TestResult.runProtected(TestResult.java:124)
	at junit.framework.TestResult.run(TestResult.java:109)
	at junit.framework.TestCase.run(TestCase.java:118)
	at junit.framework.TestSuite.runTest(TestSuite.java:208)
	at junit.framework.TestSuite.run(TestSuite.java:203)
	at sun.reflect.NativeMethodAccessorImpl.invoke0(Native Method)
	at sun.reflect.NativeMethodAccessorImpl.invoke(NativeMethodAccessorImpl.java:57)
	at sun.reflect.DelegatingMethodAccessorImpl.invoke(DelegatingMethodAccessorImpl.java:43)
	at java.lang.reflect.Method.invoke(Method.java:606)
	at org.apache.maven.surefire.junit.JUnitTestSet.execute(JUnitTestSet.java:99)
	at org.apache.maven.surefire.junit.JUnit3Provider.executeTestSet(JUnit3Provider.java:136)
	at org.apache.maven.surefire.junit.JUnit3Provider.invoke(JUnit3Provider.java:109)
	at org.apache.maven.surefire.booter.ForkedBooter.invokeProviderInSameClassLoader(ForkedBooter.java:290)
	at org.apache.maven.surefire.booter.ForkedBooter.runSuitesInProcess(ForkedBooter.java:242)
	at org.apache.maven.surefire.booter.ForkedBooter.main(ForkedBooter.java:121)


FAILED:  org.apache.maven.shared.runtime.DefaultMavenRuntimeTest.testGetProjectWithPackagedClass

Error Message:
Error building test project expected:<0> but was:<1>

Stack Trace:
junit.framework.AssertionFailedError: Error building test project expected:<0> but was:<1>
	at junit.framework.Assert.fail(Assert.java:47)
	at junit.framework.Assert.failNotEquals(Assert.java:282)
	at junit.framework.Assert.assertEquals(Assert.java:64)
	at junit.framework.Assert.assertEquals(Assert.java:201)
	at org.apache.maven.shared.runtime.DefaultMavenRuntimeTest.packageProject(DefaultMavenRuntimeTest.java:682)
	at org.apache.maven.shared.runtime.DefaultMavenRuntimeTest.setUp(DefaultMavenRuntimeTest.java:74)
	at junit.framework.TestCase.runBare(TestCase.java:125)
	at junit.framework.TestResult$1.protect(TestResult.java:106)
	at junit.framework.TestResult.runProtected(TestResult.java:124)
	at junit.framework.TestResult.run(TestResult.java:109)
	at junit.framework.TestCase.run(TestCase.java:118)
	at junit.framework.TestSuite.runTest(TestSuite.java:208)
	at junit.framework.TestSuite.run(TestSuite.java:203)
	at sun.reflect.NativeMethodAccessorImpl.invoke0(Native Method)
	at sun.reflect.NativeMethodAccessorImpl.invoke(NativeMethodAccessorImpl.java:57)
	at sun.reflect.DelegatingMethodAccessorImpl.invoke(DelegatingMethodAccessorImpl.java:43)
	at java.lang.reflect.Method.invoke(Method.java:606)
	at org.apache.maven.surefire.junit.JUnitTestSet.execute(JUnitTestSet.java:99)
	at org.apache.maven.surefire.junit.JUnit3Provider.executeTestSet(JUnit3Provider.java:136)
	at org.apache.maven.surefire.junit.JUnit3Provider.invoke(JUnit3Provider.java:109)
	at org.apache.maven.surefire.booter.ForkedBooter.invokeProviderInSameClassLoader(ForkedBooter.java:290)
	at org.apache.maven.surefire.booter.ForkedBooter.runSuitesInProcess(ForkedBooter.java:242)
	at org.apache.maven.surefire.booter.ForkedBooter.main(ForkedBooter.java:121)


FAILED:  org.apache.maven.shared.runtime.DefaultMavenRuntimeTest.testGetProjectWithMultipleVersionsReversed

Error Message:
Error building test project expected:<0> but was:<1>

Stack Trace:
junit.framework.AssertionFailedError: Error building test project expected:<0> but was:<1>
	at junit.framework.Assert.fail(Assert.java:47)
	at junit.framework.Assert.failNotEquals(Assert.java:282)
	at junit.framework.Assert.assertEquals(Assert.java:64)
	at junit.framework.Assert.assertEquals(Assert.java:201)
	at org.apache.maven.shared.runtime.DefaultMavenRuntimeTest.packageProject(DefaultMavenRuntimeTest.java:682)
	at org.apache.maven.shared.runtime.DefaultMavenRuntimeTest.setUp(DefaultMavenRuntimeTest.java:74)
	at junit.framework.TestCase.runBare(TestCase.java:125)
	at junit.framework.TestResult$1.protect(TestResult.java:106)
	at junit.framework.TestResult.runProtected(TestResult.java:124)
	at junit.framework.TestResult.run(TestResult.java:109)
	at junit.framework.TestCase.run(TestCase.java:118)
	at junit.framework.TestSuite.runTest(TestSuite.java:208)
	at junit.framework.TestSuite.run(TestSuite.java:203)
	at sun.reflect.NativeMethodAccessorImpl.invoke0(Native Method)
	at sun.reflect.NativeMethodAccessorImpl.invoke(NativeMethodAccessorImpl.java:57)
	at sun.reflect.DelegatingMethodAccessorImpl.invoke(DelegatingMethodAccessorImpl.java:43)
	at java.lang.reflect.Method.invoke(Method.java:606)
	at org.apache.maven.surefire.junit.JUnitTestSet.execute(JUnitTestSet.java:99)
	at org.apache.maven.surefire.junit.JUnit3Provider.executeTestSet(JUnit3Provider.java:136)
	at org.apache.maven.surefire.junit.JUnit3Provider.invoke(JUnit3Provider.java:109)
	at org.apache.maven.surefire.booter.ForkedBooter.invokeProviderInSameClassLoader(ForkedBooter.java:290)
	at org.apache.maven.surefire.booter.ForkedBooter.runSuitesInProcess(ForkedBooter.java:242)
	at org.apache.maven.surefire.booter.ForkedBooter.main(ForkedBooter.java:121)


FAILED:  org.apache.maven.shared.runtime.DefaultMavenRuntimeTest.testGetProjectWithChildDelegation

Error Message:
Error building test project expected:<0> but was:<1>

Stack Trace:
junit.framework.AssertionFailedError: Error building test project expected:<0> but was:<1>
	at junit.framework.Assert.fail(Assert.java:47)
	at junit.framework.Assert.failNotEquals(Assert.java:282)
	at junit.framework.Assert.assertEquals(Assert.java:64)
	at junit.framework.Assert.assertEquals(Assert.java:201)
	at org.apache.maven.shared.runtime.DefaultMavenRuntimeTest.packageProject(DefaultMavenRuntimeTest.java:682)
	at org.apache.maven.shared.runtime.DefaultMavenRuntimeTest.setUp(DefaultMavenRuntimeTest.java:74)
	at junit.framework.TestCase.runBare(TestCase.java:125)
	at junit.framework.TestResult$1.protect(TestResult.java:106)
	at junit.framework.TestResult.runProtected(TestResult.java:124)
	at junit.framework.TestResult.run(TestResult.java:109)
	at junit.framework.TestCase.run(TestCase.java:118)
	at junit.framework.TestSuite.runTest(TestSuite.java:208)
	at junit.framework.TestSuite.run(TestSuite.java:203)
	at sun.reflect.NativeMethodAccessorImpl.invoke0(Native Method)
	at sun.reflect.NativeMethodAccessorImpl.invoke(NativeMethodAccessorImpl.java:57)
	at sun.reflect.DelegatingMethodAccessorImpl.invoke(DelegatingMethodAccessorImpl.java:43)
	at java.lang.reflect.Method.invoke(Method.java:606)
	at org.apache.maven.surefire.junit.JUnitTestSet.execute(JUnitTestSet.java:99)
	at org.apache.maven.surefire.junit.JUnit3Provider.executeTestSet(JUnit3Provider.java:136)
	at org.apache.maven.surefire.junit.JUnit3Provider.invoke(JUnit3Provider.java:109)
	at org.apache.maven.surefire.booter.ForkedBooter.invokeProviderInSameClassLoader(ForkedBooter.java:290)
	at org.apache.maven.surefire.booter.ForkedBooter.runSuitesInProcess(ForkedBooter.java:242)
	at org.apache.maven.surefire.booter.ForkedBooter.main(ForkedBooter.java:121)




Build log:
[...truncated 2.16 MB...]
[linux-jdk7] [TASKS] Found 0 open tasks.
[linux-jdk7] Skipping warnings blame since pipelines do not have an SCM link.%n
[linux-jdk7] [TASKS] Computing warning deltas based on reference build #5
[linux-jdk7] [withMaven] openTasksPublisher - Scan Tasks for Maven artifact org.apache.maven.shared.runtime.tests:testSingleJar:1.0 in source directory m/target/test-classes/testSingleJar/src/main/java
[linux-jdk7] [TASKS] Scanning folder '/home/jenkins/jenkins-slave/workspace/en-box_maven-runtime_master-4NSHJQWSAMHKWA6PQXBTNF33HPV3LZXJ3AS6BEEALUIQWCQDQ4PQ' for files matching the pattern 'm/target/test-classes/testSingleJar/src/main/java/**/*' - excludes: null
[linux-jdk7] [TASKS] Found 3 files to scan for tasks
[linux-jdk7] [TASKS] Found 0 open tasks.
[linux-jdk7] Skipping warnings blame since pipelines do not have an SCM link.%n
[linux-jdk7] [TASKS] Computing warning deltas based on reference build #5
[linux-jdk7] [withMaven] openTasksPublisher - Scan Tasks for Maven artifact org.apache.maven.shared.runtime.tests:testSingleJar:1.0 in source directory m/target/test-classes/testSingleJar/src/main/java
[linux-jdk7] [TASKS] Scanning folder '/home/jenkins/jenkins-slave/workspace/en-box_maven-runtime_master-4NSHJQWSAMHKWA6PQXBTNF33HPV3LZXJ3AS6BEEALUIQWCQDQ4PQ' for files matching the pattern 'm/target/test-classes/testSingleJar/src/main/java/**/*' - excludes: null
[linux-jdk7] [TASKS] Found 3 files to scan for tasks
[linux-jdk7] [TASKS] Found 0 open tasks.
[linux-jdk7] Skipping warnings blame since pipelines do not have an SCM link.%n
[linux-jdk7] [TASKS] Computing warning deltas based on reference build #5
[linux-jdk7] [withMaven] openTasksPublisher - Scan Tasks for Maven artifact org.apache.maven.shared.runtime.tests:testSingleJar:1.0 in source directory m/target/test-classes/testSingleJar/src/main/java
[linux-jdk7] [TASKS] Scanning folder '/home/jenkins/jenkins-slave/workspace/en-box_maven-runtime_master-4NSHJQWSAMHKWA6PQXBTNF33HPV3LZXJ3AS6BEEALUIQWCQDQ4PQ' for files matching the pattern 'm/target/test-classes/testSingleJar/src/main/java/**/*' - excludes: null
[linux-jdk7] [TASKS] Found 3 files to scan for tasks
[linux-jdk7] [TASKS] Found 0 open tasks.
[linux-jdk7] Skipping warnings blame since pipelines do not have an SCM link.%n
[linux-jdk7] [TASKS] Computing warning deltas based on reference build #5
[linux-jdk7] [withMaven] openTasksPublisher - Scan Tasks for Maven artifact org.apache.maven.shared.runtime.tests:testSingleJar:1.0 in source directory m/target/test-classes/testSingleJar/src/main/java
[linux-jdk7] [TASKS] Scanning folder '/home/jenkins/jenkins-slave/workspace/en-box_maven-runtime_master-4NSHJQWSAMHKWA6PQXBTNF33HPV3LZXJ3AS6BEEALUIQWCQDQ4PQ' for files matching the pattern 'm/target/test-classes/testSingleJar/src/main/java/**/*' - excludes: null
[linux-jdk7] [TASKS] Found 3 files to scan for tasks
[linux-jdk7] [TASKS] Found 0 open tasks.
[linux-jdk7] Skipping warnings blame since pipelines do not have an SCM link.%n
[linux-jdk7] [TASKS] Computing warning deltas based on reference build #5
[linux-jdk7] [withMaven] openTasksPublisher - Scan Tasks for Maven artifact org.apache.maven.shared.runtime.tests:testSingleJar:1.0 in source directory m/target/test-classes/testSingleJar/src/main/java
[linux-jdk7] [TASKS] Scanning folder '/home/jenkins/jenkins-slave/workspace/en-box_maven-runtime_master-4NSHJQWSAMHKWA6PQXBTNF33HPV3LZXJ3AS6BEEALUIQWCQDQ4PQ' for files matching the pattern 'm/target/test-classes/testSingleJar/src/main/java/**/*' - excludes: null
[linux-jdk7] [TASKS] Found 3 files to scan for tasks
[linux-jdk7] [TASKS] Found 0 open tasks.
[linux-jdk7] Skipping warnings blame since pipelines do not have an SCM link.%n
[linux-jdk7] [TASKS] Computing warning deltas based on reference build #5
[linux-jdk7] [withMaven] openTasksPublisher - Scan Tasks for Maven artifact org.apache.maven.shared.runtime.tests:testSingleJar:1.0 in source directory m/target/test-classes/testSingleJar/src/main/java
[linux-jdk7] [TASKS] Scanning folder '/home/jenkins/jenkins-slave/workspace/en-box_maven-runtime_master-4NSHJQWSAMHKWA6PQXBTNF33HPV3LZXJ3AS6BEEALUIQWCQDQ4PQ' for files matching the pattern 'm/target/test-classes/testSingleJar/src/main/java/**/*' - excludes: null
[linux-jdk7] [TASKS] Found 3 files to scan for tasks
[linux-jdk7] [TASKS] Found 0 open tasks.
[linux-jdk7] Skipping warnings blame since pipelines do not have an SCM link.%n
[linux-jdk7] [TASKS] Computing warning deltas based on reference build #5
[linux-jdk7] [withMaven] openTasksPublisher - Scan Tasks for Maven artifact org.apache.maven.shared.runtime.tests:testSingleJar:1.0 in source directory m/target/test-classes/testSingleJar/src/main/java
[linux-jdk7] [TASKS] Scanning folder '/home/jenkins/jenkins-slave/workspace/en-box_maven-runtime_master-4NSHJQWSAMHKWA6PQXBTNF33HPV3LZXJ3AS6BEEALUIQWCQDQ4PQ' for files matching the pattern 'm/target/test-classes/testSingleJar/src/main/java/**/*' - excludes: null
[linux-jdk7] [TASKS] Found 3 files to scan for tasks
[linux-jdk7] [TASKS] Found 0 open tasks.
[linux-jdk7] Skipping warnings blame since pipelines do not have an SCM link.%n
[linux-jdk7] [TASKS] Computing warning deltas based on reference build #5
[linux-jdk7] [withMaven] openTasksPublisher - Scan Tasks for Maven artifact org.apache.maven.shared.runtime.tests:testSingleJar:1.0 in source directory m/target/test-classes/testSingleJar/src/main/java
[linux-jdk7] [TASKS] Scanning folder '/home/jenkins/jenkins-slave/workspace/en-box_maven-runtime_master-4NSHJQWSAMHKWA6PQXBTNF33HPV3LZXJ3AS6BEEALUIQWCQDQ4PQ' for files matching the pattern 'm/target/test-classes/testSingleJar/src/main/java/**/*' - excludes: null
[linux-jdk7] [TASKS] Found 3 files to scan for tasks
[linux-jdk7] [TASKS] Found 0 open tasks.
[linux-jdk7] Skipping warnings blame since pipelines do not have an SCM link.%n
[linux-jdk7] [TASKS] Computing warning deltas based on reference build #5
[linux-jdk7] [withMaven] openTasksPublisher - Scan Tasks for Maven artifact org.apache.maven.shared.runtime.tests:testSingleJar:1.0 in source directory m/target/test-classes/testSingleJar/src/main/java
[linux-jdk7] [TASKS] Scanning folder '/home/jenkins/jenkins-slave/workspace/en-box_maven-runtime_master-4NSHJQWSAMHKWA6PQXBTNF33HPV3LZXJ3AS6BEEALUIQWCQDQ4PQ' for files matching the pattern 'm/target/test-classes/testSingleJar/src/main/java/**/*' - excludes: null
[linux-jdk7] [TASKS] Found 3 files to scan for tasks
[linux-jdk7] [TASKS] Found 0 open tasks.
[linux-jdk7] Skipping warnings blame since pipelines do not have an SCM link.%n
[linux-jdk7] [TASKS] Computing warning deltas based on reference build #5
[linux-jdk7] [withMaven] openTasksPublisher - Scan Tasks for Maven artifact org.apache.maven.shared.runtime.tests:testSingleJar:1.0 in source directory m/target/test-classes/testSingleJar/src/main/java
[linux-jdk7] [TASKS] Scanning folder '/home/jenkins/jenkins-slave/workspace/en-box_maven-runtime_master-4NSHJQWSAMHKWA6PQXBTNF33HPV3LZXJ3AS6BEEALUIQWCQDQ4PQ' for files matching the pattern 'm/target/test-classes/testSingleJar/src/main/java/**/*' - excludes: null
[linux-jdk7] [TASKS] Found 3 files to scan for tasks
[linux-jdk7] [TASKS] Found 0 open tasks.
[linux-jdk7] Skipping warnings blame since pipelines do not have an SCM link.%n
[linux-jdk7] [TASKS] Computing warning deltas based on reference build #5
[linux-jdk7] [withMaven] openTasksPublisher - Scan Tasks for Maven artifact org.apache.maven.shared.runtime.tests:testSingleJar:1.0 in source directory m/target/test-classes/testSingleJar/src/main/java
[linux-jdk7] [TASKS] Scanning folder '/home/jenkins/jenkins-slave/workspace/en-box_maven-runtime_master-4NSHJQWSAMHKWA6PQXBTNF33HPV3LZXJ3AS6BEEALUIQWCQDQ4PQ' for files matching the pattern 'm/target/test-classes/testSingleJar/src/main/java/**/*' - excludes: null
[linux-jdk7] [TASKS] Found 3 files to scan for tasks
[linux-jdk7] [TASKS] Found 0 open tasks.
[linux-jdk7] Skipping warnings blame since pipelines do not have an SCM link.%n
[linux-jdk7] [TASKS] Computing warning deltas based on reference build #5
[linux-jdk7] [withMaven] openTasksPublisher - Scan Tasks for Maven artifact org.apache.maven.shared.runtime.tests:testSingleJar:1.0 in source directory m/target/test-classes/testSingleJar/src/main/java
[linux-jdk7] [TASKS] Scanning folder '/home/jenkins/jenkins-slave/workspace/en-box_maven-runtime_master-4NSHJQWSAMHKWA6PQXBTNF33HPV3LZXJ3AS6BEEALUIQWCQDQ4PQ' for files matching the pattern 'm/target/test-classes/testSingleJar/src/main/java/**/*' - excludes: null
[linux-jdk7] [TASKS] Found 3 files to scan for tasks
[linux-jdk7] [TASKS] Found 0 open tasks.
[linux-jdk7] Skipping warnings blame since pipelines do not have an SCM link.%n
[linux-jdk7] [TASKS] Computing warning deltas based on reference build #5
[linux-jdk7] [withMaven] openTasksPublisher - Scan Tasks for Maven artifact org.apache.maven.shared.runtime.tests:testSingleJar:1.0 in source directory m/target/test-classes/testSingleJar/src/main/java
[linux-jdk7] [TASKS] Scanning folder '/home/jenkins/jenkins-slave/workspace/en-box_maven-runtime_master-4NSHJQWSAMHKWA6PQXBTNF33HPV3LZXJ3AS6BEEALUIQWCQDQ4PQ' for files matching the pattern 'm/target/test-classes/testSingleJar/src/main/java/**/*' - excludes: null
[linux-jdk7] [TASKS] Found 3 files to scan for tasks
[linux-jdk7] [TASKS] Found 0 open tasks.
[linux-jdk7] Skipping warnings blame since pipelines do not have an SCM link.%n
[linux-jdk7] [TASKS] Computing warning deltas based on reference build #5
[linux-jdk7] [withMaven] openTasksPublisher - Scan Tasks for Maven artifact org.apache.maven.shared.runtime.tests:testSingleJar:1.0 in source directory m/target/test-classes/testSingleJar/src/main/java
[linux-jdk7] [TASKS] Scanning folder '/home/jenkins/jenkins-slave/workspace/en-box_maven-runtime_master-4NSHJQWSAMHKWA6PQXBTNF33HPV3LZXJ3AS6BEEALUIQWCQDQ4PQ' for files matching the pattern 'm/target/test-classes/testSingleJar/src/main/java/**/*' - excludes: null
[linux-jdk7] [TASKS] Found 3 files to scan for tasks
[linux-jdk7] [TASKS] Found 0 open tasks.
[linux-jdk7] Skipping warnings blame since pipelines do not have an SCM link.%n
[linux-jdk7] [TASKS] Computing warning deltas based on reference build #5
[linux-jdk7] [withMaven] openTasksPublisher - Scan Tasks for Maven artifact org.apache.maven.shared.runtime.tests:testSingleJar:1.0 in source directory m/target/test-classes/testSingleJar/src/main/java
[linux-jdk7] [TASKS] Scanning folder '/home/jenkins/jenkins-slave/workspace/en-box_maven-runtime_master-4NSHJQWSAMHKWA6PQXBTNF33HPV3LZXJ3AS6BEEALUIQWCQDQ4PQ' for files matching the pattern 'm/target/test-classes/testSingleJar/src/main/java/**/*' - excludes: null
[linux-jdk7] [TASKS] Found 3 files to scan for tasks
[linux-jdk7] [TASKS] Found 0 open tasks.
[linux-jdk7] Skipping warnings blame since pipelines do not have an SCM link.%n
[linux-jdk7] [TASKS] Computing warning deltas based on reference build #5
[linux-jdk7] [withMaven] openTasksPublisher - Scan Tasks for Maven artifact org.apache.maven.shared.runtime.tests:testSingleJar:1.0 in source directory m/target/test-classes/testSingleJar/src/main/java
[linux-jdk7] [TASKS] Scanning folder '/home/jenkins/jenkins-slave/workspace/en-box_maven-runtime_master-4NSHJQWSAMHKWA6PQXBTNF33HPV3LZXJ3AS6BEEALUIQWCQDQ4PQ' for files matching the pattern 'm/target/test-classes/testSingleJar/src/main/java/**/*' - excludes: null
[linux-jdk7] [TASKS] Found 3 files to scan for tasks
[linux-jdk7] [TASKS] Found 0 open tasks.
[linux-jdk7] Skipping warnings blame since pipelines do not have an SCM link.%n
[linux-jdk7] [TASKS] Computing warning deltas based on reference build #5
[linux-jdk7] [withMaven] openTasksPublisher - Scan Tasks for Maven artifact org.apache.maven.shared.runtime.tests:testSingleJar:1.0 in source directory m/target/test-classes/testSingleJar/src/main/java
[linux-jdk7] [TASKS] Scanning folder '/home/jenkins/jenkins-slave/workspace/en-box_maven-runtime_master-4NSHJQWSAMHKWA6PQXBTNF33HPV3LZXJ3AS6BEEALUIQWCQDQ4PQ' for files matching the pattern 'm/target/test-classes/testSingleJar/src/main/java/**/*' - excludes: null
[linux-jdk7] [TASKS] Found 3 files to scan for tasks
[linux-jdk7] [TASKS] Found 0 open tasks.
[linux-jdk7] Skipping warnings blame since pipelines do not have an SCM link.%n
[linux-jdk7] [TASKS] Computing warning deltas based on reference build #5
[linux-jdk7] [withMaven] openTasksPublisher - Scan Tasks for Maven artifact org.apache.maven.shared.runtime.tests:testSingleJar:1.0 in source directory m/target/test-classes/testSingleJar/src/main/java
[linux-jdk7] [TASKS] Scanning folder '/home/jenkins/jenkins-slave/workspace/en-box_maven-runtime_master-4NSHJQWSAMHKWA6PQXBTNF33HPV3LZXJ3AS6BEEALUIQWCQDQ4PQ' for files matching the pattern 'm/target/test-classes/testSingleJar/src/main/java/**/*' - excludes: null
[linux-jdk7] [TASKS] Found 3 files to scan for tasks
[linux-jdk7] [TASKS] Found 0 open tasks.
[linux-jdk7] Skipping warnings blame since pipelines do not have an SCM link.%n
[linux-jdk7] [TASKS] Computing warning deltas based on reference build #5
[linux-jdk7] [withMaven] openTasksPublisher - Scan Tasks for Maven artifact org.apache.maven.shared.runtime.tests:testSingleJar:1.0 in source directory m/target/test-classes/testSingleJar/src/main/java
[linux-jdk7] [TASKS] Scanning folder '/home/jenkins/jenkins-slave/workspace/en-box_maven-runtime_master-4NSHJQWSAMHKWA6PQXBTNF33HPV3LZXJ3AS6BEEALUIQWCQDQ4PQ' for files matching the pattern 'm/target/test-classes/testSingleJar/src/main/java/**/*' - excludes: null
[linux-jdk7] [TASKS] Found 3 files to scan for tasks
[linux-jdk7] [TASKS] Found 0 open tasks.
[linux-jdk7] Skipping warnings blame since pipelines do not have an SCM link.%n
[linux-jdk7] [TASKS] Computing warning deltas based on reference build #5
[linux-jdk7] [withMaven] openTasksPublisher - Scan Tasks for Maven artifact org.apache.maven.shared.runtime.tests:testSingleJar:1.0 in source directory m/target/test-classes/testSingleJar/src/main/java
[linux-jdk7] [TASKS] Scanning folder '/home/jenkins/jenkins-slave/workspace/en-box_maven-runtime_master-4NSHJQWSAMHKWA6PQXBTNF33HPV3LZXJ3AS6BEEALUIQWCQDQ4PQ' for files matching the pattern 'm/target/test-classes/testSingleJar/src/main/java/**/*' - excludes: null
[linux-jdk7] [TASKS] Found 3 files to scan for tasks
[linux-jdk7] [TASKS] Found 0 open tasks.
[linux-jdk7] Skipping warnings blame since pipelines do not have an SCM link.%n
[linux-jdk7] [TASKS] Computing warning deltas based on reference build #5
[linux-jdk7] [withMaven] openTasksPublisher - Scan Tasks for Maven artifact org.apache.maven.shared.runtime.tests:testSingleJar:1.0 in source directory m/target/test-classes/testSingleJar/src/main/java
[linux-jdk7] [TASKS] Scanning folder '/home/jenkins/jenkins-slave/workspace/en-box_maven-runtime_master-4NSHJQWSAMHKWA6PQXBTNF33HPV3LZXJ3AS6BEEALUIQWCQDQ4PQ' for files matching the pattern 'm/target/test-classes/testSingleJar/src/main/java/**/*' - excludes: null
[linux-jdk7] [TASKS] Found 3 files to scan for tasks
[linux-jdk7] [TASKS] Found 0 open tasks.
[linux-jdk7] Skipping warnings blame since pipelines do not have an SCM link.%n
[linux-jdk7] [TASKS] Computing warning deltas based on reference build #5
[linux-jdk7] [withMaven] openTasksPublisher - Scan Tasks for Maven artifact org.apache.maven.shared.runtime.tests:testSingleJar:1.0 in source directory m/target/test-classes/testSingleJar/src/main/java
[linux-jdk7] [TASKS] Scanning folder '/home/jenkins/jenkins-slave/workspace/en-box_maven-runtime_master-4NSHJQWSAMHKWA6PQXBTNF33HPV3LZXJ3AS6BEEALUIQWCQDQ4PQ' for files matching the pattern 'm/target/test-classes/testSingleJar/src/main/java/**/*' - excludes: null
[linux-jdk7] [TASKS] Found 3 files to scan for tasks
[linux-jdk7] [TASKS] Found 0 open tasks.
[linux-jdk7] Skipping warnings blame since pipelines do not have an SCM link.%n
[linux-jdk7] [TASKS] Computing warning deltas based on reference build #5
[linux-jdk7] [withMaven] openTasksPublisher - Scan Tasks for Maven artifact org.apache.maven.shared.runtime.tests:testSingleJar:1.0 in source directory m/target/test-classes/testSingleJar/src/main/java
[linux-jdk7] [TASKS] Scanning folder '/home/jenkins/jenkins-slave/workspace/en-box_maven-runtime_master-4NSHJQWSAMHKWA6PQXBTNF33HPV3LZXJ3AS6BEEALUIQWCQDQ4PQ' for files matching the pattern 'm/target/test-classes/testSingleJar/src/main/java/**/*' - excludes: null
[linux-jdk7] [TASKS] Found 3 files to scan for tasks
[linux-jdk7] [TASKS] Found 0 open tasks.
[linux-jdk7] Skipping warnings blame since pipelines do not have an SCM link.%n
[linux-jdk7] [TASKS] Computing warning deltas based on reference build #5
[linux-jdk7] [withMaven] openTasksPublisher - Scan Tasks for Maven artifact org.apache.maven.shared.runtime.tests:testSingleJar:1.0 in source directory m/target/test-classes/testSingleJar/src/main/java
[linux-jdk7] [TASKS] Scanning folder '/home/jenkins/jenkins-slave/workspace/en-box_maven-runtime_master-4NSHJQWSAMHKWA6PQXBTNF33HPV3LZXJ3AS6BEEALUIQWCQDQ4PQ' for files matching the pattern 'm/target/test-classes/testSingleJar/src/main/java/**/*' - excludes: null
[linux-jdk7] [TASKS] Found 3 files to scan for tasks
[linux-jdk7] [TASKS] Found 0 open tasks.
[linux-jdk7] Skipping warnings blame since pipelines do not have an SCM link.%n
[linux-jdk7] [TASKS] Computing warning deltas based on reference build #5
[linux-jdk7] [withMaven] openTasksPublisher - Scan Tasks for Maven artifact org.apache.maven.shared.runtime.tests:testSingleJar:1.0 in source directory m/target/test-classes/testSingleJar/src/main/java
[linux-jdk7] [TASKS] Scanning folder '/home/jenkins/jenkins-slave/workspace/en-box_maven-runtime_master-4NSHJQWSAMHKWA6PQXBTNF33HPV3LZXJ3AS6BEEALUIQWCQDQ4PQ' for files matching the pattern 'm/target/test-classes/testSingleJar/src/main/java/**/*' - excludes: null
[linux-jdk7] [TASKS] Found 3 files to scan for tasks
[linux-jdk7] [TASKS] Found 0 open tasks.
[linux-jdk7] Skipping warnings blame since pipelines do not have an SCM link.%n
[linux-jdk7] [TASKS] Computing warning deltas based on reference build #5
[linux-jdk7] [withMaven] openTasksPublisher - Scan Tasks for Maven artifact org.apache.maven.shared.runtime.tests:testSingleJar:1.0 in source directory m/target/test-classes/testSingleJar/src/main/java
[linux-jdk7] [TASKS] Scanning folder '/home/jenkins/jenkins-slave/workspace/en-box_maven-runtime_master-4NSHJQWSAMHKWA6PQXBTNF33HPV3LZXJ3AS6BEEALUIQWCQDQ4PQ' for files matching the pattern 'm/target/test-classes/testSingleJar/src/main/java/**/*' - excludes: null
[linux-jdk7] [TASKS] Found 3 files to scan for tasks
[linux-jdk7] [TASKS] Found 0 open tasks.
[linux-jdk7] Skipping warnings blame since pipelines do not have an SCM link.%n
[linux-jdk7] [TASKS] Computing warning deltas based on reference build #5
[linux-jdk7] [withMaven] openTasksPublisher - Scan Tasks for Maven artifact org.apache.maven.shared.runtime.tests:testSingleJar:1.0 in source directory m/target/test-classes/testSingleJar/src/main/java
[linux-jdk7] [TASKS] Scanning folder '/home/jenkins/jenkins-slave/workspace/en-box_maven-runtime_master-4NSHJQWSAMHKWA6PQXBTNF33HPV3LZXJ3AS6BEEALUIQWCQDQ4PQ' for files matching the pattern 'm/target/test-classes/testSingleJar/src/main/java/**/*' - excludes: null
[linux-jdk7] [TASKS] Found 3 files to scan for tasks
[linux-jdk7] [TASKS] Found 0 open tasks.
[linux-jdk7] Skipping warnings blame since pipelines do not have an SCM link.%n
[linux-jdk7] [TASKS] Computing warning deltas based on reference build #5
[linux-jdk7] [withMaven] openTasksPublisher - Scan Tasks for Maven artifact org.apache.maven.shared.runtime.tests:testSingleJar:1.0 in source directory m/target/test-classes/testSingleJar/src/main/java
[linux-jdk7] [TASKS] Scanning folder '/home/jenkins/jenkins-slave/workspace/en-box_maven-runtime_master-4NSHJQWSAMHKWA6PQXBTNF33HPV3LZXJ3AS6BEEALUIQWCQDQ4PQ' for files matching the pattern 'm/target/test-classes/testSingleJar/src/main/java/**/*' - excludes: null
[linux-jdk7] [TASKS] Found 3 files to scan for tasks
[linux-jdk7] [TASKS] Found 0 open tasks.
[linux-jdk7] Skipping warnings blame since pipelines do not have an SCM link.%n
[linux-jdk7] [TASKS] Computing warning deltas based on reference build #5
[linux-jdk7] [withMaven] openTasksPublisher - Scan Tasks for Maven artifact org.apache.maven.shared.runtime.tests:testSingleJar:1.0 in source directory m/target/test-classes/testSingleJar/src/main/java
[linux-jdk7] [TASKS] Scanning folder '/home/jenkins/jenkins-slave/workspace/en-box_maven-runtime_master-4NSHJQWSAMHKWA6PQXBTNF33HPV3LZXJ3AS6BEEALUIQWCQDQ4PQ' for files matching the pattern 'm/target/test-classes/testSingleJar/src/main/java/**/*' - excludes: null
[linux-jdk7] [TASKS] Found 3 files to scan for tasks
[linux-jdk7] [TASKS] Found 0 open tasks.
[linux-jdk7] Skipping warnings blame since pipelines do not have an SCM link.%n
[linux-jdk7] [TASKS] Computing warning deltas based on reference build #5
[linux-jdk7] [withMaven] openTasksPublisher - Scan Tasks for Maven artifact org.apache.maven.shared.runtime.tests:testSingleJar:1.0 in source directory m/target/test-classes/testSingleJar/src/main/java
[linux-jdk7] [TASKS] Scanning folder '/home/jenkins/jenkins-slave/workspace/en-box_maven-runtime_master-4NSHJQWSAMHKWA6PQXBTNF33HPV3LZXJ3AS6BEEALUIQWCQDQ4PQ' for files matching the pattern 'm/target/test-classes/testSingleJar/src/main/java/**/*' - excludes: null
[linux-jdk7] [TASKS] Found 3 files to scan for tasks
[linux-jdk7] [TASKS] Found 0 open tasks.
[linux-jdk7] Skipping warnings blame since pipelines do not have an SCM link.%n
[linux-jdk7] [TASKS] Computing warning deltas based on reference build #5
[linux-jdk7] [withMaven] openTasksPublisher - Scan Tasks for Maven artifact org.apache.maven.shared.runtime.tests:testSingleJar:1.0 in source directory m/target/test-classes/testSingleJar/src/main/java
[linux-jdk7] [TASKS] Scanning folder '/home/jenkins/jenkins-slave/workspace/en-box_maven-runtime_master-4NSHJQWSAMHKWA6PQXBTNF33HPV3LZXJ3AS6BEEALUIQWCQDQ4PQ' for files matching the pattern 'm/target/test-classes/testSingleJar/src/main/java/**/*' - excludes: null
[linux-jdk7] [TASKS] Found 3 files to scan for tasks
[linux-jdk7] [TASKS] Found 0 open tasks.
[linux-jdk7] Skipping warnings blame since pipelines do not have an SCM link.%n
[linux-jdk7] [TASKS] Computing warning deltas based on reference build #5
[linux-jdk7] [withMaven] openTasksPublisher - Scan Tasks for Maven artifact org.apache.maven.shared.runtime.tests:testSingleJar:1.0 in source directory m/target/test-classes/testSingleJar/src/main/java
[linux-jdk7] [TASKS] Scanning folder '/home/jenkins/jenkins-slave/workspace/en-box_maven-runtime_master-4NSHJQWSAMHKWA6PQXBTNF33HPV3LZXJ3AS6BEEALUIQWCQDQ4PQ' for files matching the pattern 'm/target/test-classes/testSingleJar/src/main/java/**/*' - excludes: null
[linux-jdk7] [TASKS] Found 3 files to scan for tasks
[linux-jdk7] [TASKS] Found 0 open tasks.
[linux-jdk7] Skipping warnings blame since pipelines do not have an SCM link.%n
[linux-jdk7] [TASKS] Computing warning deltas based on reference build #5
[linux-jdk7] [withMaven] openTasksPublisher - Scan Tasks for Maven artifact org.apache.maven.shared.runtime.tests:testSingleJar:1.0 in source directory m/target/test-classes/testSingleJar/src/main/java
[linux-jdk7] [TASKS] Scanning folder '/home/jenkins/jenkins-slave/workspace/en-box_maven-runtime_master-4NSHJQWSAMHKWA6PQXBTNF33HPV3LZXJ3AS6BEEALUIQWCQDQ4PQ' for files matching the pattern 'm/target/test-classes/testSingleJar/src/main/java/**/*' - excludes: null
[linux-jdk7] [TASKS] Found 3 files to scan for tasks
[linux-jdk7] [TASKS] Found 0 open tasks.
[linux-jdk7] Skipping warnings blame since pipelines do not have an SCM link.%n
[linux-jdk7] [TASKS] Computing warning deltas based on reference build #5
[linux-jdk7] [withMaven] openTasksPublisher - Scan Tasks for Maven artifact org.apache.maven.shared.runtime.tests:testSingleJar:1.0 in source directory m/target/test-classes/testSingleJar/src/main/java
[linux-jdk7] [TASKS] Scanning folder '/home/jenkins/jenkins-slave/workspace/en-box_maven-runtime_master-4NSHJQWSAMHKWA6PQXBTNF33HPV3LZXJ3AS6BEEALUIQWCQDQ4PQ' for files matching the pattern 'm/target/test-classes/testSingleJar/src/main/java/**/*' - excludes: null
[linux-jdk7] [TASKS] Found 3 files to scan for tasks
[linux-jdk7] [TASKS] Found 0 open tasks.
[linux-jdk7] Skipping warnings blame since pipelines do not have an SCM link.%n
[linux-jdk7] [TASKS] Computing warning deltas based on reference build #5
[linux-jdk7] [withMaven] openTasksPublisher - Scan Tasks for Maven artifact org.apache.maven.shared.runtime.tests:testSingleJar:1.0 in source directory m/target/test-classes/testSingleJar/src/main/java
[linux-jdk7] [TASKS] Scanning folder '/home/jenkins/jenkins-slave/workspace/en-box_maven-runtime_master-4NSHJQWSAMHKWA6PQXBTNF33HPV3LZXJ3AS6BEEALUIQWCQDQ4PQ' for files matching the pattern 'm/target/test-classes/testSingleJar/src/main/java/**/*' - excludes: null
[linux-jdk7] [TASKS] Found 3 files to scan for tasks
[linux-jdk7] [TASKS] Found 0 open tasks.
[linux-jdk7] Skipping warnings blame since pipelines do not have an SCM link.%n
[linux-jdk7] [TASKS] Computing warning deltas based on reference build #5
[linux-jdk7] [withMaven] openTasksPublisher - Scan Tasks for Maven artifact org.apache.maven.shared.runtime.tests:testSingleJar:1.0 in source directory m/target/test-classes/testSingleJar/src/main/java
[linux-jdk7] [TASKS] Scanning folder '/home/jenkins/jenkins-slave/workspace/en-box_maven-runtime_master-4NSHJQWSAMHKWA6PQXBTNF33HPV3LZXJ3AS6BEEALUIQWCQDQ4PQ' for files matching the pattern 'm/target/test-classes/testSingleJar/src/main/java/**/*' - excludes: null
[linux-jdk7] [TASKS] Found 3 files to scan for tasks
[linux-jdk7] [TASKS] Found 0 open tasks.
[linux-jdk7] Skipping warnings blame since pipelines do not have an SCM link.%n
[linux-jdk7] [TASKS] Computing warning deltas based on reference build #5
[linux-jdk7] [withMaven] openTasksPublisher - Scan Tasks for Maven artifact org.apache.maven.shared.runtime.tests:testSingleJar:1.0 in source directory m/target/test-classes/testSingleJar/src/main/java
[linux-jdk7] [TASKS] Scanning folder '/home/jenkins/jenkins-slave/workspace/en-box_maven-runtime_master-4NSHJQWSAMHKWA6PQXBTNF33HPV3LZXJ3AS6BEEALUIQWCQDQ4PQ' for files matching the pattern 'm/target/test-classes/testSingleJar/src/main/java/**/*' - excludes: null
[linux-jdk7] [TASKS] Found 3 files to scan for tasks
[linux-jdk7] [TASKS] Found 0 open tasks.
[linux-jdk7] Skipping warnings blame since pipelines do not have an SCM link.%n
[linux-jdk7] [TASKS] Computing warning deltas based on reference build #5
[Pipeline] [linux-jdk7] // withMaven
[Pipeline] [windows-jdk7] }
[Pipeline] [linux-jdk7] }
[Pipeline] [windows-jdk7] // dir
[Pipeline] [linux-jdk7] // stage
[Pipeline] [linux-jdk7] }
[Pipeline] [windows-jdk7] }
[windows-jdk7] [withMaven] junitPublisher - Archive test results for Maven artifact org.apache.maven.shared:maven-runtime:1.0-alpha-4-SNAPSHOT generated by maven-surefire-plugin:test (default-test): m\target\surefire-reports\*.xml
[windows-jdk7] Recording test results
[Pipeline] [linux-jdk7] // node
[Pipeline] [windows-jdk7] // withMaven
[Pipeline] [linux-jdk7] }
[Pipeline] [windows-jdk7] }
[Pipeline] [windows-jdk7] // stage
[Pipeline] [windows-jdk7] }
[Pipeline] [windows-jdk7] // node
[Pipeline] [windows-jdk7] }
[Pipeline] // parallel
[Pipeline] stage
[Pipeline] { (Notifications)
[Pipeline] echo
Build result: UNSTABLE
[Pipeline] jiraIssueSelector
[Pipeline] emailext
Mime
  • Unnamed multipart/mixed (inline, None, 0 bytes)
View raw message