maven-notifications mailing list archives

Site index · List index
Message view « Date » · « Thread »
Top « Date » · « Thread »
From Apache Jenkins Server <jenk...@builds.apache.org>
Subject Build failed in Jenkins: Maven TLP » maven-deploy-plugin » MDEPLOY-237 #1
Date Sun, 22 Jul 2018 09:04:46 GMT
See https://builds.apache.org/job/maven-box/job/maven-deploy-plugin/job/MDEPLOY-237/1/

No changes.

All tests passed

Build log:
[...truncated 4.44 MB...]
[windows-jdk10-m3.5.x_build] [INFO] Installing f:\jenkins\jenkins-slave\workspace\n-deploy-plugin_MDEPLOY-237-SOURSQ6VRH5KOX5OQUKI6NGLAQL4FD7KE3EHLHGNB4HCZIBHDGSQ\windows-jdk10-m3.5.x_build\pom.xml
to f:\jenkins\jenkins-slave\workspace\n-deploy-plugin_MDEPLOY-237-SOURSQ6VRH5KOX5OQUKI6NGLAQL4FD7KE3EHLHGNB4HCZIBHDGSQ\windows-jdk10-m3.5.x_build\target\local-repo\org\apache\maven\plugins\maven-deploy-plugin\3.0.0-SNAPSHOT\maven-deploy-plugin-3.0.0-SNAPSHOT.pom
[windows-jdk10-m3.5.x_build] [INFO] Installing f:\jenkins\jenkins-slave\workspace\n-deploy-plugin_MDEPLOY-237-SOURSQ6VRH5KOX5OQUKI6NGLAQL4FD7KE3EHLHGNB4HCZIBHDGSQ\windows-jdk10-m3.5.x_build\target\maven-deploy-plugin-3.0.0-SNAPSHOT.jar
to f:\jenkins\jenkins-slave\workspace\n-deploy-plugin_MDEPLOY-237-SOURSQ6VRH5KOX5OQUKI6NGLAQL4FD7KE3EHLHGNB4HCZIBHDGSQ\windows-jdk10-m3.5.x_build\target\local-repo\org\apache\maven\plugins\maven-deploy-plugin\3.0.0-SNAPSHOT\maven-deploy-plugin-3.0.0-SNAPSHOT.jar
[windows-jdk10-m3.5.x_build] [INFO] 
[windows-jdk10-m3.5.x_build] [INFO] --- maven-invoker-plugin:3.1.0:integration-test (integration-test)
@ maven-deploy-plugin ---
[windows-jdk10-m3.5.x_build] [INFO] Building: 3rd-party-jar-with-extras\pom.xml
[windows-jdk10-m3.5.x_build] [INFO] run pre-build script setup.bsh
[windows-jdk10-m3.5.x_build] [INFO] run post-build script verify.bsh
[windows-jdk10-m3.5.x_build] [INFO]           3rd-party-jar-with-extras\pom.xml ................
SUCCESS (3.6 s)
[windows-jdk10-m3.5.x_build] [INFO] Building: 3rd-party-jar-without-pom\pom.xml
[windows-jdk10-m3.5.x_build] [INFO] run pre-build script setup.bsh
[windows-jdk10-m3.5.x_build] [INFO] run post-build script verify.bsh
[windows-jdk10-m3.5.x_build] [INFO]           3rd-party-jar-without-pom\pom.xml ................
SUCCESS (3.3 s)
[windows-jdk10-m3.5.x_build] [INFO] Building: 3rd-party-pom-with-extras\pom.xml
[windows-jdk10-m3.5.x_build] [INFO] run post-build script verify.bsh
[windows-jdk10-m3.5.x_build] [INFO]           3rd-party-pom-with-extras\pom.xml ................
SUCCESS (3.4 s)
[windows-jdk10-m3.5.x_build] [INFO] Building: alt-deploy-repo-with-dist-mgmt\pom.xml
[windows-jdk10-m3.5.x_build] [INFO] run pre-build script setup.bsh
[windows-jdk10-m3.5.x_build] [INFO] run post-build script verify.bsh
[windows-jdk10-m3.5.x_build] [INFO]           alt-deploy-repo-with-dist-mgmt\pom.xml ...........
SUCCESS (5.6 s)
[windows-jdk10-m3.5.x_build] [INFO] Building: alt-deploy-repo-with-dist-mgmt-snapshot\pom.xml
[windows-jdk10-m3.5.x_build] [INFO] run pre-build script setup.bsh
[windows-jdk10-m3.5.x_build] [INFO] run post-build script verify.bsh
[windows-jdk10-m3.5.x_build] [INFO]           alt-deploy-repo-with-dist-mgmt-snapshot\pom.xml
.. SUCCESS (3.7 s)
[windows-jdk10-m3.5.x_build] [INFO] Building: alt-deploy-repo-without-dist-mgmt\pom.xml
[windows-jdk10-m3.5.x_build] [INFO] run pre-build script setup.bsh
[windows-jdk10-m3.5.x_build] [INFO] run post-build script verify.bsh
[windows-jdk10-m3.5.x_build] [INFO]           alt-deploy-repo-without-dist-mgmt\pom.xml ........
SUCCESS (3.8 s)
[windows-jdk10-m3.5.x_build] [INFO] Building: attach-release-jar\pom.xml
[windows-jdk10-m3.5.x_build] [INFO] run pre-build script setup.bsh
[windows-jdk10-m3.5.x_build] [INFO] run post-build script verify.bsh
[windows-jdk10-m3.5.x_build] [INFO]           attach-release-jar\pom.xml .......................
SUCCESS (4.7 s)
[windows-jdk10-m3.5.x_build] [INFO] Building: deploy-at-end-fail\pom.xml
[windows-jdk10-m3.5.x_build] [INFO] run post-build script verify.groovy
[windows-jdk10-m3.5.x_build] WARNING: An illegal reflective access operation has occurred
[windows-jdk10-m3.5.x_build] WARNING: Illegal reflective access by org.codehaus.groovy.reflection.CachedClass
(file:/f:/jenkins/jenkins-slave/workspace/n-deploy-plugin_MDEPLOY-237-SOURSQ6VRH5KOX5OQUKI6NGLAQL4FD7KE3EHLHGNB4HCZIBHDGSQ/.repository/org/codehaus/groovy/groovy-all/2.4.8/groovy-all-2.4.8.jar)
to method java.lang.Object.finalize()
[windows-jdk10-m3.5.x_build] WARNING: Please consider reporting this to the maintainers of
org.codehaus.groovy.reflection.CachedClass
[windows-jdk10-m3.5.x_build] WARNING: Use --illegal-access=warn to enable warnings of further
illegal reflective access operations
[windows-jdk10-m3.5.x_build] WARNING: All illegal access operations will be denied in a future
release
[windows-jdk10-m3.5.x_build] [INFO]           deploy-at-end-fail\pom.xml .......................
SUCCESS (6.7 s)
[windows-jdk10-m3.5.x_build] [INFO] Building: deploy-at-end-pass\pom.xml
[windows-jdk10-m3.5.x_build] [INFO] run post-build script verify.groovy
[windows-jdk10-m3.5.x_build] [INFO]           deploy-at-end-pass\pom.xml .......................
SUCCESS (4.3 s)
[windows-jdk10-m3.5.x_build] [INFO] Building: deploy-attached-sources\pom.xml
[windows-jdk10-m3.5.x_build] [INFO] run pre-build script setup.bsh
[windows-jdk10-m3.5.x_build] [INFO] run post-build script verify.bsh
[windows-jdk10-m3.5.x_build] [INFO]           deploy-attached-sources\pom.xml ..................
FAILED (9.1 s)
[windows-jdk10-m3.5.x_build] [INFO]   The post-build script returned false.
[windows-jdk10-m3.5.x_build] [INFO] Building: deploy-default-packaging\pom.xml
[windows-jdk10-m3.5.x_build] [INFO] run pre-build script setup.bsh
[windows-jdk10-m3.5.x_build] [INFO] run post-build script verify.bsh
[windows-jdk10-m3.5.x_build] [INFO]           deploy-default-packaging\pom.xml .................
SUCCESS (3.2 s)
[windows-jdk10-m3.5.x_build] [INFO] Building: external-release-jar\pom.xml
[windows-jdk10-m3.5.x_build] [INFO] run pre-build script setup.bsh
[windows-jdk10-m3.5.x_build] [INFO] run post-build script verify.bsh
[windows-jdk10-m3.5.x_build] [INFO]           external-release-jar\pom.xml .....................
SUCCESS (3.2 s)
[windows-jdk10-m3.5.x_build] [INFO] Building: gav-validation\pom.xml
[windows-jdk10-m3.5.x_build] [INFO] run pre-build script setup.bsh
[windows-jdk10-m3.5.x_build] [INFO] run post-build script verify.groovy
[windows-jdk10-m3.5.x_build] [INFO]           gav-validation\pom.xml ...........................
SUCCESS (6.3 s)
[windows-jdk10-m3.5.x_build] [INFO] Building: MDEPLOY-169_deploy-at-end-multithread\pom.xml
[windows-jdk10-m3.5.x_build] [INFO] run post-build script verify.groovy
[windows-jdk10-m3.5.x_build] [INFO]           MDEPLOY-169_deploy-at-end-multithread\pom.xml
.... SUCCESS (4.2 s)
[windows-jdk10-m3.5.x_build] [INFO] Building: MDEPLOY-170_deploy-at-end-configperproject\pom.xml
[windows-jdk10-m3.5.x_build] [INFO] run post-build script verify.groovy
[windows-jdk10-m3.5.x_build] [INFO]           MDEPLOY-170_deploy-at-end-configperproject\pom.xml
SUCCESS (3.8 s)
[windows-jdk10-m3.5.x_build] [INFO] Building: MDEPLOY-178_deployfile-with-embedded-pom\pom.xml
[windows-jdk10-m3.5.x_build] [INFO] run post-build script verify.groovy
[windows-jdk10-m3.5.x_build] [INFO]           MDEPLOY-178_deployfile-with-embedded-pom\pom.xml
. SUCCESS (4.4 s)
[windows-jdk10-m3.5.x_build] [INFO] Building: MDEPLOY-202_deployfile-with-multiple-executions\pom.xml
[windows-jdk10-m3.5.x_build] [INFO] run post-build script verify.groovy
[windows-jdk10-m3.5.x_build] [INFO]           MDEPLOY-202_deployfile-with-multiple-executions\pom.xml
SUCCESS (4.3 s)
[windows-jdk10-m3.5.x_build] [INFO] Building: MDEPLOY-212\pom.xml
[windows-jdk10-m3.5.x_build] [INFO] run post-build script verify.bsh
[windows-jdk10-m3.5.x_build] [INFO]           MDEPLOY-212\pom.xml ..............................
FAILED (5.6 s)
[windows-jdk10-m3.5.x_build] [INFO]   The post-build script did not succeed. Missing: f:\jenkins\jenkins-slave\workspace\n-deploy-plugin_MDEPLOY-237-SOURSQ6VRH5KOX5OQUKI6NGLAQL4FD7KE3EHLHGNB4HCZIBHDGSQ\windows-jdk10-m3.5.x_build\target\it\MDEPLOY-212\target\repo\org\apache\maven\its\mdeploy-212\test\1.0\test-1.0.pom
[windows-jdk10-m3.5.x_build] [INFO] Building: MDEPLOY-213\pom.xml
[windows-jdk10-m3.5.x_build] [INFO] run post-build script verify.bsh
[windows-jdk10-m3.5.x_build] [INFO]           MDEPLOY-213\pom.xml ..............................
FAILED (5.5 s)
[windows-jdk10-m3.5.x_build] [INFO]   The post-build script did not succeed. Missing: f:\jenkins\jenkins-slave\workspace\n-deploy-plugin_MDEPLOY-237-SOURSQ6VRH5KOX5OQUKI6NGLAQL4FD7KE3EHLHGNB4HCZIBHDGSQ\windows-jdk10-m3.5.x_build\target\it\MDEPLOY-213\target\repo\org\apache\maven\its\mdeploy-213\test\1.0\test-1.0.pom
[windows-jdk10-m3.5.x_build] [INFO] Building: mdeploy-45-test\pom.xml
[windows-jdk10-m3.5.x_build] [INFO] run pre-build script setup.bsh
[windows-jdk10-m3.5.x_build] [INFO] run post-build script verify.bsh
[windows-jdk10-m3.5.x_build] [INFO]           mdeploy-45-test\pom.xml ..........................
SUCCESS (5.0 s)
[windows-jdk10-m3.5.x_build] [INFO] Building: no-main-artifact-1\pom.xml
[windows-jdk10-m3.5.x_build] [INFO] run pre-build script setup.bsh
[windows-jdk10-m3.5.x_build] [INFO] run post-build script verify.groovy
[windows-jdk10-m3.5.x_build] [INFO]           no-main-artifact-1\pom.xml .......................
SUCCESS (5.3 s)
[windows-jdk10-m3.5.x_build] [INFO] Building: no-main-artifact-2\pom.xml
[windows-jdk10-m3.5.x_build] [INFO] run pre-build script setup.bsh
[windows-jdk10-m3.5.x_build] [INFO] run post-build script verify.groovy
[windows-jdk10-m3.5.x_build] [INFO]           no-main-artifact-2\pom.xml .......................
SUCCESS (3.9 s)
[windows-jdk10-m3.5.x_build] [INFO] Building: no-main-artifact-snapshot\pom.xml
[windows-jdk10-m3.5.x_build] [INFO] run pre-build script setup.bsh
[windows-jdk10-m3.5.x_build] [INFO] run post-build script verify.bsh
[windows-jdk10-m3.5.x_build] [INFO]           no-main-artifact-snapshot\pom.xml ................
SUCCESS (3.6 s)
[windows-jdk10-m3.5.x_build] [INFO] Building: offline\pom.xml
[windows-jdk10-m3.5.x_build] [INFO] run pre-build script setup.bsh
[windows-jdk10-m3.5.x_build] [INFO]           offline\pom.xml ..................................
SUCCESS (7.6 s)
[windows-jdk10-m3.5.x_build] [INFO] Building: release-jar\pom.xml
[windows-jdk10-m3.5.x_build] [INFO] run pre-build script setup.bsh
[windows-jdk10-m3.5.x_build] [INFO] run post-build script verify.bsh
[windows-jdk10-m3.5.x_build] [INFO]           release-jar\pom.xml ..............................
SUCCESS (3.7 s)
[windows-jdk10-m3.5.x_build] [INFO] Building: release-pom\pom.xml
[windows-jdk10-m3.5.x_build] [INFO] run pre-build script setup.bsh
[windows-jdk10-m3.5.x_build] [INFO] run post-build script verify.bsh
[windows-jdk10-m3.5.x_build] [INFO]           release-pom\pom.xml ..............................
SUCCESS (3.4 s)
[windows-jdk10-m3.5.x_build] [INFO] Building: skip\pom.xml
[windows-jdk10-m3.5.x_build] [INFO] run pre-build script setup.bsh
[windows-jdk10-m3.5.x_build] [INFO]           skip\pom.xml .....................................
SUCCESS (3.2 s)
[windows-jdk10-m3.5.x_build] [INFO] Building: snapshot-jar\pom.xml
[windows-jdk10-m3.5.x_build] [INFO] run pre-build script setup.bsh
[windows-jdk10-m3.5.x_build] [INFO] run post-build script verify.bsh
[windows-jdk10-m3.5.x_build] [INFO]           snapshot-jar\pom.xml .............................
SUCCESS (3.8 s)
[windows-jdk10-m3.5.x_build] [INFO] Building: snapshot-pom\pom.xml
[windows-jdk10-m3.5.x_build] [INFO] run pre-build script setup.bsh
[windows-jdk10-m3.5.x_build] [INFO] run post-build script verify.bsh
[windows-jdk10-m3.5.x_build] [INFO]           snapshot-pom\pom.xml .............................
SUCCESS (3.4 s)
[windows-jdk10-m3.5.x_build] [INFO] 
[windows-jdk10-m3.5.x_build] [INFO] --- maven-checkstyle-plugin:3.0.0:check (checkstyle-check)
@ maven-deploy-plugin ---
[windows-jdk10-m3.5.x_build] [INFO] Downloading: https://repo.maven.apache.org/maven2/org/apache/maven/shared/maven-shared-resources/2/maven-shared-resources-2.pom
[windows-jdk10-m3.5.x_build] [INFO] Downloaded: https://repo.maven.apache.org/maven2/org/apache/maven/shared/maven-shared-resources/2/maven-shared-resources-2.pom
(3.0 kB at 370 kB/s)
[windows-jdk10-m3.5.x_build] [INFO] Downloading: https://repo.maven.apache.org/maven2/org/codehaus/plexus/plexus-utils/3.0.10/plexus-utils-3.0.10.pom
[windows-jdk10-m3.5.x_build] [INFO] Downloaded: https://repo.maven.apache.org/maven2/org/codehaus/plexus/plexus-utils/3.0.10/plexus-utils-3.0.10.pom
(3.1 kB at 524 kB/s)
[windows-jdk10-m3.5.x_build] [INFO] Downloading: https://repo.maven.apache.org/maven2/org/codehaus/plexus/plexus/3.3/plexus-3.3.pom
[windows-jdk10-m3.5.x_build] [INFO] Downloaded: https://repo.maven.apache.org/maven2/org/codehaus/plexus/plexus/3.3/plexus-3.3.pom
(20 kB at 3.3 MB/s)
[windows-jdk10-m3.5.x_build] [INFO] Downloading: https://repo.maven.apache.org/maven2/org/apache/maven/doxia/doxia-integration-tools/1.6/doxia-integration-tools-1.6.pom
[windows-jdk10-m3.5.x_build] [INFO] Downloaded: https://repo.maven.apache.org/maven2/org/apache/maven/doxia/doxia-integration-tools/1.6/doxia-integration-tools-1.6.pom
(7.0 kB at 870 kB/s)
[windows-jdk10-m3.5.x_build] [INFO] Downloading: https://repo.maven.apache.org/maven2/org/apache/maven/doxia/doxia-tools/3/doxia-tools-3.pom
[windows-jdk10-m3.5.x_build] [INFO] Downloaded: https://repo.maven.apache.org/maven2/org/apache/maven/doxia/doxia-tools/3/doxia-tools-3.pom
(9.9 kB at 1.4 MB/s)
[windows-jdk10-m3.5.x_build] [INFO] Downloading: https://repo.maven.apache.org/maven2/org/codehaus/plexus/plexus-resources/1.1.0/plexus-resources-1.1.0.pom
[windows-jdk10-m3.5.x_build] [INFO] Downloaded: https://repo.maven.apache.org/maven2/org/codehaus/plexus/plexus-resources/1.1.0/plexus-resources-1.1.0.pom
(3.2 kB at 397 kB/s)
[windows-jdk10-m3.5.x_build] [INFO] Downloading: https://repo.maven.apache.org/maven2/com/puppycrawl/tools/checkstyle/6.18/checkstyle-6.18.pom
[windows-jdk10-m3.5.x_build] [INFO] Downloaded: https://repo.maven.apache.org/maven2/com/puppycrawl/tools/checkstyle/6.18/checkstyle-6.18.pom
(71 kB at 6.5 MB/s)
[windows-jdk10-m3.5.x_build] [INFO] Downloading: https://repo.maven.apache.org/maven2/antlr/antlr/2.7.7/antlr-2.7.7.pom
[windows-jdk10-m3.5.x_build] [INFO] Downloaded: https://repo.maven.apache.org/maven2/antlr/antlr/2.7.7/antlr-2.7.7.pom
(632 B at 105 kB/s)
[windows-jdk10-m3.5.x_build] [INFO] Downloading: https://repo.maven.apache.org/maven2/org/antlr/antlr4-runtime/4.5.3/antlr4-runtime-4.5.3.pom
[windows-jdk10-m3.5.x_build] [INFO] Downloaded: https://repo.maven.apache.org/maven2/org/antlr/antlr4-runtime/4.5.3/antlr4-runtime-4.5.3.pom
(2.3 kB at 385 kB/s)
[windows-jdk10-m3.5.x_build] [INFO] Downloading: https://repo.maven.apache.org/maven2/org/antlr/antlr4-master/4.5.3/antlr4-master-4.5.3.pom
[windows-jdk10-m3.5.x_build] [INFO] Downloaded: https://repo.maven.apache.org/maven2/org/antlr/antlr4-master/4.5.3/antlr4-master-4.5.3.pom
(3.7 kB at 614 kB/s)
[windows-jdk10-m3.5.x_build] [INFO] Downloading: https://repo.maven.apache.org/maven2/commons-beanutils/commons-beanutils/1.9.2/commons-beanutils-1.9.2.pom
[windows-jdk10-m3.5.x_build] [INFO] Downloaded: https://repo.maven.apache.org/maven2/commons-beanutils/commons-beanutils/1.9.2/commons-beanutils-1.9.2.pom
(14 kB at 2.0 MB/s)
[windows-jdk10-m3.5.x_build] [INFO] Downloading: https://repo.maven.apache.org/maven2/org/apache/commons/commons-parent/33/commons-parent-33.pom
[windows-jdk10-m3.5.x_build] [INFO] Downloaded: https://repo.maven.apache.org/maven2/org/apache/commons/commons-parent/33/commons-parent-33.pom
(53 kB at 5.9 MB/s)
[windows-jdk10-m3.5.x_build] [INFO] Downloading: https://repo.maven.apache.org/maven2/commons-cli/commons-cli/1.3.1/commons-cli-1.3.1.pom
[windows-jdk10-m3.5.x_build] [INFO] Downloaded: https://repo.maven.apache.org/maven2/commons-cli/commons-cli/1.3.1/commons-cli-1.3.1.pom
(10 kB at 1.5 MB/s)
[windows-jdk10-m3.5.x_build] [INFO] Downloading: https://repo.maven.apache.org/maven2/com/google/guava/guava/19.0/guava-19.0.pom
[windows-jdk10-m3.5.x_build] [INFO] Downloaded: https://repo.maven.apache.org/maven2/com/google/guava/guava/19.0/guava-19.0.pom
(6.8 kB at 849 kB/s)
[windows-jdk10-m3.5.x_build] [INFO] Downloading: https://repo.maven.apache.org/maven2/com/google/guava/guava-parent/19.0/guava-parent-19.0.pom
[windows-jdk10-m3.5.x_build] [INFO] Downloaded: https://repo.maven.apache.org/maven2/com/google/guava/guava-parent/19.0/guava-parent-19.0.pom
(9.9 kB at 1.6 MB/s)
[windows-jdk10-m3.5.x_build] [INFO] Downloading: https://repo.maven.apache.org/maven2/org/sonatype/oss/oss-parent/7/oss-parent-7.pom
[windows-jdk10-m3.5.x_build] [INFO] Downloaded: https://repo.maven.apache.org/maven2/org/sonatype/oss/oss-parent/7/oss-parent-7.pom
(4.8 kB at 804 kB/s)
[windows-jdk10-m3.5.x_build] [INFO] Downloading: https://repo.maven.apache.org/maven2/javax/xml/bind/jaxb-api/2.3.0/jaxb-api-2.3.0.pom
[windows-jdk10-m3.5.x_build] [INFO] Downloaded: https://repo.maven.apache.org/maven2/javax/xml/bind/jaxb-api/2.3.0/jaxb-api-2.3.0.pom
(23 kB at 2.9 MB/s)
[windows-jdk10-m3.5.x_build] [INFO] Downloading: https://repo.maven.apache.org/maven2/javax/xml/bind/jaxb-api-parent/2.3.0/jaxb-api-parent-2.3.0.pom
[windows-jdk10-m3.5.x_build] [INFO] Downloaded: https://repo.maven.apache.org/maven2/javax/xml/bind/jaxb-api-parent/2.3.0/jaxb-api-parent-2.3.0.pom
(5.6 kB at 806 kB/s)
[windows-jdk10-m3.5.x_build] [INFO] Downloading: https://repo.maven.apache.org/maven2/net/java/jvnet-parent/5/jvnet-parent-5.pom
[windows-jdk10-m3.5.x_build] [INFO] Downloaded: https://repo.maven.apache.org/maven2/net/java/jvnet-parent/5/jvnet-parent-5.pom
(8.9 kB at 1.3 MB/s)
[windows-jdk10-m3.5.x_build] [INFO] Downloading: https://repo.maven.apache.org/maven2/org/apache/maven/shared/maven-shared-resources/2/maven-shared-resources-2.jar
[windows-jdk10-m3.5.x_build] [INFO] Downloading: https://repo.maven.apache.org/maven2/org/apache/maven/doxia/doxia-core/1.2/doxia-core-1.2.jar
[windows-jdk10-m3.5.x_build] [INFO] Downloading: https://repo.maven.apache.org/maven2/commons-logging/commons-logging/1.0.4/commons-logging-1.0.4.jar
[windows-jdk10-m3.5.x_build] [INFO] Downloading: https://repo.maven.apache.org/maven2/org/apache/maven/doxia/doxia-integration-tools/1.6/doxia-integration-tools-1.6.jar
[windows-jdk10-m3.5.x_build] [INFO] Downloading: https://repo.maven.apache.org/maven2/commons-digester/commons-digester/1.6/commons-digester-1.6.jar
[windows-jdk10-m3.5.x_build] [INFO] Downloaded: https://repo.maven.apache.org/maven2/org/apache/maven/shared/maven-shared-resources/2/maven-shared-resources-2.jar
(13 kB at 1.0 MB/s)
[windows-jdk10-m3.5.x_build] [INFO] Downloading: https://repo.maven.apache.org/maven2/commons-io/commons-io/1.4/commons-io-1.4.jar
[windows-jdk10-m3.5.x_build] [INFO] Downloaded: https://repo.maven.apache.org/maven2/org/apache/maven/doxia/doxia-core/1.2/doxia-core-1.2.jar
(154 kB at 10 MB/s)
[windows-jdk10-m3.5.x_build] [INFO] Downloading: https://repo.maven.apache.org/maven2/org/codehaus/plexus/plexus-resources/1.1.0/plexus-resources-1.1.0.jar
[windows-jdk10-m3.5.x_build] [INFO] Downloaded: https://repo.maven.apache.org/maven2/commons-logging/commons-logging/1.0.4/commons-logging-1.0.4.jar
(38 kB at 2.2 MB/s)
[windows-jdk10-m3.5.x_build] [INFO] Downloading: https://repo.maven.apache.org/maven2/com/puppycrawl/tools/checkstyle/6.18/checkstyle-6.18.jar
[windows-jdk10-m3.5.x_build] [INFO] Downloaded: https://repo.maven.apache.org/maven2/org/apache/maven/doxia/doxia-integration-tools/1.6/doxia-integration-tools-1.6.jar
(45 kB at 2.2 MB/s)
[windows-jdk10-m3.5.x_build] [INFO] Downloading: https://repo.maven.apache.org/maven2/antlr/antlr/2.7.7/antlr-2.7.7.jar
[windows-jdk10-m3.5.x_build] [INFO] Downloaded: https://repo.maven.apache.org/maven2/org/codehaus/plexus/plexus-resources/1.1.0/plexus-resources-1.1.0.jar
(23 kB at 893 kB/s)
[windows-jdk10-m3.5.x_build] [INFO] Downloading: https://repo.maven.apache.org/maven2/org/antlr/antlr4-runtime/4.5.3/antlr4-runtime-4.5.3.jar
[windows-jdk10-m3.5.x_build] [INFO] Downloaded: https://repo.maven.apache.org/maven2/commons-io/commons-io/1.4/commons-io-1.4.jar
(109 kB at 4.0 MB/s)
[windows-jdk10-m3.5.x_build] [INFO] Downloading: https://repo.maven.apache.org/maven2/commons-beanutils/commons-beanutils/1.9.2/commons-beanutils-1.9.2.jar
[windows-jdk10-m3.5.x_build] [INFO] Downloaded: https://repo.maven.apache.org/maven2/commons-digester/commons-digester/1.6/commons-digester-1.6.jar
(168 kB at 6.0 MB/s)
[windows-jdk10-m3.5.x_build] [INFO] Downloading: https://repo.maven.apache.org/maven2/commons-cli/commons-cli/1.3.1/commons-cli-1.3.1.jar
[windows-jdk10-m3.5.x_build] [INFO] Downloaded: https://repo.maven.apache.org/maven2/commons-cli/commons-cli/1.3.1/commons-cli-1.3.1.jar
(53 kB at 1.4 MB/s)
[windows-jdk10-m3.5.x_build] [INFO] Downloading: https://repo.maven.apache.org/maven2/com/google/guava/guava/19.0/guava-19.0.jar
[windows-jdk10-m3.5.x_build] [INFO] Downloaded: https://repo.maven.apache.org/maven2/commons-beanutils/commons-beanutils/1.9.2/commons-beanutils-1.9.2.jar
(234 kB at 5.8 MB/s)
[windows-jdk10-m3.5.x_build] [INFO] Downloading: https://repo.maven.apache.org/maven2/commons-lang/commons-lang/2.1/commons-lang-2.1.jar
[windows-jdk10-m3.5.x_build] [INFO] Downloaded: https://repo.maven.apache.org/maven2/antlr/antlr/2.7.7/antlr-2.7.7.jar
(445 kB at 10 MB/s)
[windows-jdk10-m3.5.x_build] [INFO] Downloading: https://repo.maven.apache.org/maven2/javax/xml/bind/jaxb-api/2.3.0/jaxb-api-2.3.0.jar
[windows-jdk10-m3.5.x_build] [INFO] Downloaded: https://repo.maven.apache.org/maven2/org/antlr/antlr4-runtime/4.5.3/antlr4-runtime-4.5.3.jar
(302 kB at 6.0 MB/s)
[windows-jdk10-m3.5.x_build] [INFO] Downloaded: https://repo.maven.apache.org/maven2/commons-lang/commons-lang/2.1/commons-lang-2.1.jar
(208 kB at 3.6 MB/s)
[windows-jdk10-m3.5.x_build] [INFO] Downloaded: https://repo.maven.apache.org/maven2/javax/xml/bind/jaxb-api/2.3.0/jaxb-api-2.3.0.jar
(126 kB at 2.0 MB/s)
[windows-jdk10-m3.5.x_build] [INFO] Downloaded: https://repo.maven.apache.org/maven2/com/puppycrawl/tools/checkstyle/6.18/checkstyle-6.18.jar
(1.2 MB at 13 MB/s)
[windows-jdk10-m3.5.x_build] [INFO] Downloaded: https://repo.maven.apache.org/maven2/com/google/guava/guava/19.0/guava-19.0.jar
(2.3 MB at 23 MB/s)
[windows-jdk10-m3.5.x_build] [INFO] There is 1 error reported by Checkstyle 6.18 with config/maven_checks.xml
ruleset.
[windows-jdk10-m3.5.x_build] [INFO] Ignored 1 error, 0 violation remaining.
[windows-jdk10-m3.5.x_build] [INFO] 
[windows-jdk10-m3.5.x_build] [INFO] --- maven-invoker-plugin:3.1.0:verify (integration-test)
@ maven-deploy-plugin ---
[windows-jdk10-m3.5.x_build] [INFO] -------------------------------------------------
[windows-jdk10-m3.5.x_build] [INFO] Build Summary:
[windows-jdk10-m3.5.x_build] [INFO]   Passed: 26, Failed: 3, Errors: 0, Skipped: 0
[windows-jdk10-m3.5.x_build] [INFO] -------------------------------------------------
[windows-jdk10-m3.5.x_build] [ERROR] The following builds failed:
[windows-jdk10-m3.5.x_build] [ERROR] *  deploy-attached-sources\pom.xml
[windows-jdk10-m3.5.x_build] [ERROR] *  MDEPLOY-212\pom.xml
[windows-jdk10-m3.5.x_build] [ERROR] *  MDEPLOY-213\pom.xml
[windows-jdk10-m3.5.x_build] [INFO] -------------------------------------------------
[windows-jdk10-m3.5.x_build] [INFO] ------------------------------------------------------------------------
[windows-jdk10-m3.5.x_build] [INFO] BUILD FAILURE
[windows-jdk10-m3.5.x_build] [INFO] ------------------------------------------------------------------------
[windows-jdk10-m3.5.x_build] [INFO] Total time: 02:38 min
[windows-jdk10-m3.5.x_build] [INFO] Finished at: 2018-07-22T09:04:43Z
[windows-jdk10-m3.5.x_build] [INFO] Final Memory: 46M/160M
[windows-jdk10-m3.5.x_build] [INFO] ------------------------------------------------------------------------
[windows-jdk10-m3.5.x_build] [INFO] [jenkins-event-spy] Generated F:\jenkins\jenkins-slave\workspace\n-deploy-plugin_MDEPLOY-237-SOURSQ6VRH5KOX5OQUKI6NGLAQL4FD7KE3EHLHGNB4HCZIBHDGSQ@tmp\withMaven154c1f73\maven-spy-20180722-090204-4137471062959701190386.log
[windows-jdk10-m3.5.x_build] [ERROR] Failed to execute goal org.apache.maven.plugins:maven-invoker-plugin:3.1.0:verify
(integration-test) on project maven-deploy-plugin: 3 builds failed. See console output above
for details. -> [Help 1]
[windows-jdk10-m3.5.x_build] [ERROR] 
[windows-jdk10-m3.5.x_build] [ERROR] To see the full stack trace of the errors, re-run Maven
with the -e switch.
[windows-jdk10-m3.5.x_build] [ERROR] Re-run Maven using the -X switch to enable full debug
logging.
[windows-jdk10-m3.5.x_build] [ERROR] 
[windows-jdk10-m3.5.x_build] [ERROR] For more information about the errors and possible solutions,
please read the following articles:
[windows-jdk10-m3.5.x_build] [ERROR] [Help 1] http://cwiki.apache.org/confluence/display/MAVEN/MojoFailureException
[Pipeline] [windows-jdk10-m3.5.x_build] }
[Pipeline] [windows-jdk10-m3.5.x_build] // dir
[Pipeline] [windows-jdk10-m3.5.x_build] }
[windows-jdk10-m3.5.x_build] [Fast Archiver] No prior successful build to compare, so performing
full copy of artifacts
[windows-jdk10-m3.5.x_build] [withMaven] invokerPublisher - Archive invoker results for Maven
artifact MavenArtifact{org.apache.maven.plugins:maven-deploy-plugin::3.0.0-SNAPSHOT(version:
3.0.0-SNAPSHOT, snapshot:false) } generated by PluginInvocation{org.apache.maven.plugins:maven-invoker-plugin:3.1.0@integration-test
 integration-test}: windows-jdk10-m3.5.x_build\target\invoker-reports\*.xml
[windows-jdk10-m3.5.x_build] performing MavenInvokerRecorder, reportsFilenamePattern:'**/windows-jdk10-m3.5.x_build\target\invoker-reports/BUILD*.xml',
invokerBuildDir:'**/windows-jdk10-m3.5.x_build\target\it'
[windows-jdk10-m3.5.x_build] Found reports:[f:\jenkins\jenkins-slave\workspace\n-deploy-plugin_MDEPLOY-237-SOURSQ6VRH5KOX5OQUKI6NGLAQL4FD7KE3EHLHGNB4HCZIBHDGSQ\windows-jdk10-m3.5.x_build\target\invoker-reports\BUILD-3rd-party-jar-with-extras.xml,
f:\jenkins\jenkins-slave\workspace\n-deploy-plugin_MDEPLOY-237-SOURSQ6VRH5KOX5OQUKI6NGLAQL4FD7KE3EHLHGNB4HCZIBHDGSQ\windows-jdk10-m3.5.x_build\target\invoker-reports\BUILD-3rd-party-jar-without-pom.xml,
f:\jenkins\jenkins-slave\workspace\n-deploy-plugin_MDEPLOY-237-SOURSQ6VRH5KOX5OQUKI6NGLAQL4FD7KE3EHLHGNB4HCZIBHDGSQ\windows-jdk10-m3.5.x_build\target\invoker-reports\BUILD-3rd-party-pom-with-extras.xml,
f:\jenkins\jenkins-slave\workspace\n-deploy-plugin_MDEPLOY-237-SOURSQ6VRH5KOX5OQUKI6NGLAQL4FD7KE3EHLHGNB4HCZIBHDGSQ\windows-jdk10-m3.5.x_build\target\invoker-reports\BUILD-MDEPLOY-169_deploy-at-end-multithread.xml,
f:\jenkins\jenkins-slave\workspace\n-deploy-plugin_MDEPLOY-237-SOURSQ6VRH5KOX5OQUKI6NGLAQL4FD7KE3EHLHGNB4HCZIBHDGSQ\windows-jdk10-m3.5.x_build\target\invoker-reports\BUILD-MDEPLOY-170_deploy-at-end-configperproject.xml,
f:\jenkins\jenkins-slave\workspace\n-deploy-plugin_MDEPLOY-237-SOURSQ6VRH5KOX5OQUKI6NGLAQL4FD7KE3EHLHGNB4HCZIBHDGSQ\windows-jdk10-m3.5.x_build\target\invoker-reports\BUILD-MDEPLOY-178_deployfile-with-embedded-pom.xml,
f:\jenkins\jenkins-slave\workspace\n-deploy-plugin_MDEPLOY-237-SOURSQ6VRH5KOX5OQUKI6NGLAQL4FD7KE3EHLHGNB4HCZIBHDGSQ\windows-jdk10-m3.5.x_build\target\invoker-reports\BUILD-MDEPLOY-202_deployfile-with-multiple-executions.xml,
f:\jenkins\jenkins-slave\workspace\n-deploy-plugin_MDEPLOY-237-SOURSQ6VRH5KOX5OQUKI6NGLAQL4FD7KE3EHLHGNB4HCZIBHDGSQ\windows-jdk10-m3.5.x_build\target\invoker-reports\BUILD-MDEPLOY-212.xml,
f:\jenkins\jenkins-slave\workspace\n-deploy-plugin_MDEPLOY-237-SOURSQ6VRH5KOX5OQUKI6NGLAQL4FD7KE3EHLHGNB4HCZIBHDGSQ\windows-jdk10-m3.5.x_build\target\invoker-reports\BUILD-MDEPLOY-213.xml,
f:\jenkins\jenkins-slave\workspace\n-deploy-plugin_MDEPLOY-237-SOURSQ6VRH5KOX5OQUKI6NGLAQL4FD7KE3EHLHGNB4HCZIBHDGSQ\windows-jdk10-m3.5.x_build\target\invoker-reports\BUILD-alt-deploy-repo-with-dist-mgmt-snapshot.xml,
f:\jenkins\jenkins-slave\workspace\n-deploy-plugin_MDEPLOY-237-SOURSQ6VRH5KOX5OQUKI6NGLAQL4FD7KE3EHLHGNB4HCZIBHDGSQ\windows-jdk10-m3.5.x_build\target\invoker-reports\BUILD-alt-deploy-repo-with-dist-mgmt.xml,
f:\jenkins\jenkins-slave\workspace\n-deploy-plugin_MDEPLOY-237-SOURSQ6VRH5KOX5OQUKI6NGLAQL4FD7KE3EHLHGNB4HCZIBHDGSQ\windows-jdk10-m3.5.x_build\target\invoker-reports\BUILD-alt-deploy-repo-without-dist-mgmt.xml,
f:\jenkins\jenkins-slave\workspace\n-deploy-plugin_MDEPLOY-237-SOURSQ6VRH5KOX5OQUKI6NGLAQL4FD7KE3EHLHGNB4HCZIBHDGSQ\windows-jdk10-m3.5.x_build\target\invoker-reports\BUILD-attach-release-jar.xml,
f:\jenkins\jenkins-slave\workspace\n-deploy-plugin_MDEPLOY-237-SOURSQ6VRH5KOX5OQUKI6NGLAQL4FD7KE3EHLHGNB4HCZIBHDGSQ\windows-jdk10-m3.5.x_build\target\invoker-reports\BUILD-deploy-at-end-fail.xml,
f:\jenkins\jenkins-slave\workspace\n-deploy-plugin_MDEPLOY-237-SOURSQ6VRH5KOX5OQUKI6NGLAQL4FD7KE3EHLHGNB4HCZIBHDGSQ\windows-jdk10-m3.5.x_build\target\invoker-reports\BUILD-deploy-at-end-pass.xml,
f:\jenkins\jenkins-slave\workspace\n-deploy-plugin_MDEPLOY-237-SOURSQ6VRH5KOX5OQUKI6NGLAQL4FD7KE3EHLHGNB4HCZIBHDGSQ\windows-jdk10-m3.5.x_build\target\invoker-reports\BUILD-deploy-attached-sources.xml,
f:\jenkins\jenkins-slave\workspace\n-deploy-plugin_MDEPLOY-237-SOURSQ6VRH5KOX5OQUKI6NGLAQL4FD7KE3EHLHGNB4HCZIBHDGSQ\windows-jdk10-m3.5.x_build\target\invoker-reports\BUILD-deploy-default-packaging.xml,
f:\jenkins\jenkins-slave\workspace\n-deploy-plugin_MDEPLOY-237-SOURSQ6VRH5KOX5OQUKI6NGLAQL4FD7KE3EHLHGNB4HCZIBHDGSQ\windows-jdk10-m3.5.x_build\target\invoker-reports\BUILD-external-release-jar.xml,
f:\jenkins\jenkins-slave\workspace\n-deploy-plugin_MDEPLOY-237-SOURSQ6VRH5KOX5OQUKI6NGLAQL4FD7KE3EHLHGNB4HCZIBHDGSQ\windows-jdk10-m3.5.x_build\target\invoker-reports\BUILD-gav-validation.xml,
f:\jenkins\jenkins-slave\workspace\n-deploy-plugin_MDEPLOY-237-SOURSQ6VRH5KOX5OQUKI6NGLAQL4FD7KE3EHLHGNB4HCZIBHDGSQ\windows-jdk10-m3.5.x_build\target\invoker-reports\BUILD-mdeploy-45-test.xml,
f:\jenkins\jenkins-slave\workspace\n-deploy-plugin_MDEPLOY-237-SOURSQ6VRH5KOX5OQUKI6NGLAQL4FD7KE3EHLHGNB4HCZIBHDGSQ\windows-jdk10-m3.5.x_build\target\invoker-reports\BUILD-no-main-artifact-1.xml,
f:\jenkins\jenkins-slave\workspace\n-deploy-plugin_MDEPLOY-237-SOURSQ6VRH5KOX5OQUKI6NGLAQL4FD7KE3EHLHGNB4HCZIBHDGSQ\windows-jdk10-m3.5.x_build\target\invoker-reports\BUILD-no-main-artifact-2.xml,
f:\jenkins\jenkins-slave\workspace\n-deploy-plugin_MDEPLOY-237-SOURSQ6VRH5KOX5OQUKI6NGLAQL4FD7KE3EHLHGNB4HCZIBHDGSQ\windows-jdk10-m3.5.x_build\target\invoker-reports\BUILD-no-main-artifact-snapshot.xml,
f:\jenkins\jenkins-slave\workspace\n-deploy-plugin_MDEPLOY-237-SOURSQ6VRH5KOX5OQUKI6NGLAQL4FD7KE3EHLHGNB4HCZIBHDGSQ\windows-jdk10-m3.5.x_build\target\invoker-reports\BUILD-offline.xml,
f:\jenkins\jenkins-slave\workspace\n-deploy-plugin_MDEPLOY-237-SOURSQ6VRH5KOX5OQUKI6NGLAQL4FD7KE3EHLHGNB4HCZIBHDGSQ\windows-jdk10-m3.5.x_build\target\invoker-reports\BUILD-release-jar.xml,
f:\jenkins\jenkins-slave\workspace\n-deploy-plugin_MDEPLOY-237-SOURSQ6VRH5KOX5OQUKI6NGLAQL4FD7KE3EHLHGNB4HCZIBHDGSQ\windows-jdk10-m3.5.x_build\target\invoker-reports\BUILD-release-pom.xml,
f:\jenkins\jenkins-slave\workspace\n-deploy-plugin_MDEPLOY-237-SOURSQ6VRH5KOX5OQUKI6NGLAQL4FD7KE3EHLHGNB4HCZIBHDGSQ\windows-jdk10-m3.5.x_build\target\invoker-reports\BUILD-skip.xml,
f:\jenkins\jenkins-slave\workspace\n-deploy-plugin_MDEPLOY-237-SOURSQ6VRH5KOX5OQUKI6NGLAQL4FD7KE3EHLHGNB4HCZIBHDGSQ\windows-jdk10-m3.5.x_build\target\invoker-reports\BUILD-snapshot-jar.xml,
f:\jenkins\jenkins-slave\workspace\n-deploy-plugin_MDEPLOY-237-SOURSQ6VRH5KOX5OQUKI6NGLAQL4FD7KE3EHLHGNB4HCZIBHDGSQ\windows-jdk10-m3.5.x_build\target\invoker-reports\BUILD-snapshot-pom.xml]
[windows-jdk10-m3.5.x_build] Found logs:[f:\jenkins\jenkins-slave\workspace\n-deploy-plugin_MDEPLOY-237-SOURSQ6VRH5KOX5OQUKI6NGLAQL4FD7KE3EHLHGNB4HCZIBHDGSQ\windows-jdk10-m3.5.x_build\target\it\3rd-party-jar-with-extras\build.log,
f:\jenkins\jenkins-slave\workspace\n-deploy-plugin_MDEPLOY-237-SOURSQ6VRH5KOX5OQUKI6NGLAQL4FD7KE3EHLHGNB4HCZIBHDGSQ\windows-jdk10-m3.5.x_build\target\it\3rd-party-jar-without-pom\build.log,
f:\jenkins\jenkins-slave\workspace\n-deploy-plugin_MDEPLOY-237-SOURSQ6VRH5KOX5OQUKI6NGLAQL4FD7KE3EHLHGNB4HCZIBHDGSQ\windows-jdk10-m3.5.x_build\target\it\3rd-party-pom-with-extras\build.log,
f:\jenkins\jenkins-slave\workspace\n-deploy-plugin_MDEPLOY-237-SOURSQ6VRH5KOX5OQUKI6NGLAQL4FD7KE3EHLHGNB4HCZIBHDGSQ\windows-jdk10-m3.5.x_build\target\it\MDEPLOY-169_deploy-at-end-multithread\build.log,
f:\jenkins\jenkins-slave\workspace\n-deploy-plugin_MDEPLOY-237-SOURSQ6VRH5KOX5OQUKI6NGLAQL4FD7KE3EHLHGNB4HCZIBHDGSQ\windows-jdk10-m3.5.x_build\target\it\MDEPLOY-170_deploy-at-end-configperproject\build.log,
f:\jenkins\jenkins-slave\workspace\n-deploy-plugin_MDEPLOY-237-SOURSQ6VRH5KOX5OQUKI6NGLAQL4FD7KE3EHLHGNB4HCZIBHDGSQ\windows-jdk10-m3.5.x_build\target\it\MDEPLOY-178_deployfile-with-embedded-pom\build.log,
f:\jenkins\jenkins-slave\workspace\n-deploy-plugin_MDEPLOY-237-SOURSQ6VRH5KOX5OQUKI6NGLAQL4FD7KE3EHLHGNB4HCZIBHDGSQ\windows-jdk10-m3.5.x_build\target\it\MDEPLOY-202_deployfile-with-multiple-executions\build.log,
f:\jenkins\jenkins-slave\workspace\n-deploy-plugin_MDEPLOY-237-SOURSQ6VRH5KOX5OQUKI6NGLAQL4FD7KE3EHLHGNB4HCZIBHDGSQ\windows-jdk10-m3.5.x_build\target\it\MDEPLOY-212\build.log,
f:\jenkins\jenkins-slave\workspace\n-deploy-plugin_MDEPLOY-237-SOURSQ6VRH5KOX5OQUKI6NGLAQL4FD7KE3EHLHGNB4HCZIBHDGSQ\windows-jdk10-m3.5.x_build\target\it\MDEPLOY-213\build.log,
f:\jenkins\jenkins-slave\workspace\n-deploy-plugin_MDEPLOY-237-SOURSQ6VRH5KOX5OQUKI6NGLAQL4FD7KE3EHLHGNB4HCZIBHDGSQ\windows-jdk10-m3.5.x_build\target\it\alt-deploy-repo-with-dist-mgmt-snapshot\build.log,
f:\jenkins\jenkins-slave\workspace\n-deploy-plugin_MDEPLOY-237-SOURSQ6VRH5KOX5OQUKI6NGLAQL4FD7KE3EHLHGNB4HCZIBHDGSQ\windows-jdk10-m3.5.x_build\target\it\alt-deploy-repo-with-dist-mgmt\build.log,
f:\jenkins\jenkins-slave\workspace\n-deploy-plugin_MDEPLOY-237-SOURSQ6VRH5KOX5OQUKI6NGLAQL4FD7KE3EHLHGNB4HCZIBHDGSQ\windows-jdk10-m3.5.x_build\target\it\alt-deploy-repo-without-dist-mgmt\build.log,
f:\jenkins\jenkins-slave\workspace\n-deploy-plugin_MDEPLOY-237-SOURSQ6VRH5KOX5OQUKI6NGLAQL4FD7KE3EHLHGNB4HCZIBHDGSQ\windows-jdk10-m3.5.x_build\target\it\attach-release-jar\build.log,
f:\jenkins\jenkins-slave\workspace\n-deploy-plugin_MDEPLOY-237-SOURSQ6VRH5KOX5OQUKI6NGLAQL4FD7KE3EHLHGNB4HCZIBHDGSQ\windows-jdk10-m3.5.x_build\target\it\deploy-at-end-fail\build.log,
f:\jenkins\jenkins-slave\workspace\n-deploy-plugin_MDEPLOY-237-SOURSQ6VRH5KOX5OQUKI6NGLAQL4FD7KE3EHLHGNB4HCZIBHDGSQ\windows-jdk10-m3.5.x_build\target\it\deploy-at-end-pass\build.log,
f:\jenkins\jenkins-slave\workspace\n-deploy-plugin_MDEPLOY-237-SOURSQ6VRH5KOX5OQUKI6NGLAQL4FD7KE3EHLHGNB4HCZIBHDGSQ\windows-jdk10-m3.5.x_build\target\it\deploy-attached-sources\build.log,
f:\jenkins\jenkins-slave\workspace\n-deploy-plugin_MDEPLOY-237-SOURSQ6VRH5KOX5OQUKI6NGLAQL4FD7KE3EHLHGNB4HCZIBHDGSQ\windows-jdk10-m3.5.x_build\target\it\deploy-default-packaging\build.log,
f:\jenkins\jenkins-slave\workspace\n-deploy-plugin_MDEPLOY-237-SOURSQ6VRH5KOX5OQUKI6NGLAQL4FD7KE3EHLHGNB4HCZIBHDGSQ\windows-jdk10-m3.5.x_build\target\it\external-release-jar\build.log,
f:\jenkins\jenkins-slave\workspace\n-deploy-plugin_MDEPLOY-237-SOURSQ6VRH5KOX5OQUKI6NGLAQL4FD7KE3EHLHGNB4HCZIBHDGSQ\windows-jdk10-m3.5.x_build\target\it\gav-validation\build.log,
f:\jenkins\jenkins-slave\workspace\n-deploy-plugin_MDEPLOY-237-SOURSQ6VRH5KOX5OQUKI6NGLAQL4FD7KE3EHLHGNB4HCZIBHDGSQ\windows-jdk10-m3.5.x_build\target\it\mdeploy-45-test\build.log,
f:\jenkins\jenkins-slave\workspace\n-deploy-plugin_MDEPLOY-237-SOURSQ6VRH5KOX5OQUKI6NGLAQL4FD7KE3EHLHGNB4HCZIBHDGSQ\windows-jdk10-m3.5.x_build\target\it\no-main-artifact-1\build.log,
f:\jenkins\jenkins-slave\workspace\n-deploy-plugin_MDEPLOY-237-SOURSQ6VRH5KOX5OQUKI6NGLAQL4FD7KE3EHLHGNB4HCZIBHDGSQ\windows-jdk10-m3.5.x_build\target\it\no-main-artifact-2\build.log,
f:\jenkins\jenkins-slave\workspace\n-deploy-plugin_MDEPLOY-237-SOURSQ6VRH5KOX5OQUKI6NGLAQL4FD7KE3EHLHGNB4HCZIBHDGSQ\windows-jdk10-m3.5.x_build\target\it\no-main-artifact-snapshot\build.log,
f:\jenkins\jenkins-slave\workspace\n-deploy-plugin_MDEPLOY-237-SOURSQ6VRH5KOX5OQUKI6NGLAQL4FD7KE3EHLHGNB4HCZIBHDGSQ\windows-jdk10-m3.5.x_build\target\it\offline\build.log,
f:\jenkins\jenkins-slave\workspace\n-deploy-plugin_MDEPLOY-237-SOURSQ6VRH5KOX5OQUKI6NGLAQL4FD7KE3EHLHGNB4HCZIBHDGSQ\windows-jdk10-m3.5.x_build\target\it\release-jar\build.log,
f:\jenkins\jenkins-slave\workspace\n-deploy-plugin_MDEPLOY-237-SOURSQ6VRH5KOX5OQUKI6NGLAQL4FD7KE3EHLHGNB4HCZIBHDGSQ\windows-jdk10-m3.5.x_build\target\it\release-pom\build.log,
f:\jenkins\jenkins-slave\workspace\n-deploy-plugin_MDEPLOY-237-SOURSQ6VRH5KOX5OQUKI6NGLAQL4FD7KE3EHLHGNB4HCZIBHDGSQ\windows-jdk10-m3.5.x_build\target\it\skip\build.log,
f:\jenkins\jenkins-slave\workspace\n-deploy-plugin_MDEPLOY-237-SOURSQ6VRH5KOX5OQUKI6NGLAQL4FD7KE3EHLHGNB4HCZIBHDGSQ\windows-jdk10-m3.5.x_build\target\it\snapshot-jar\build.log,
f:\jenkins\jenkins-slave\workspace\n-deploy-plugin_MDEPLOY-237-SOURSQ6VRH5KOX5OQUKI6NGLAQL4FD7KE3EHLHGNB4HCZIBHDGSQ\windows-jdk10-m3.5.x_build\target\it\snapshot-pom\build.log]
[windows-jdk10-m3.5.x_build] Finished parsing Maven Invoker results (found 29)
[windows-jdk10-m3.5.x_build] [withMaven] junitPublisher - Archive test results for Maven artifact
org.apache.maven.plugins:maven-deploy-plugin:3.0.0-SNAPSHOT generated by maven-surefire-plugin:test
(default-test): windows-jdk10-m3.5.x_build\target\surefire-reports\*.xml
[windows-jdk10-m3.5.x_build] Recording test results
[windows-jdk10-m3.5.x_build] [withMaven] openTasksPublisher - Scan Tasks for Maven artifact
org.apache.maven.plugins:maven-deploy-plugin:3.0.0-SNAPSHOT in source directory windows-jdk10-m3.5.x_build\src\main\java
[windows-jdk10-m3.5.x_build] [TASKS] Scanning folder 'f:\jenkins\jenkins-slave\workspace\n-deploy-plugin_MDEPLOY-237-SOURSQ6VRH5KOX5OQUKI6NGLAQL4FD7KE3EHLHGNB4HCZIBHDGSQ'
for files matching the pattern 'windows-jdk10-m3.5.x_build\src\main\java\**\*' - excludes:
null
[windows-jdk10-m3.5.x_build] [TASKS] Found 3 files to scan for tasks
[windows-jdk10-m3.5.x_build] [TASKS] Found 0 open tasks.
[windows-jdk10-m3.5.x_build] Skipping warnings blame since pipelines do not have an SCM link.%n
[Pipeline] [windows-jdk10-m3.5.x_build] // withMaven
[Pipeline] [windows-jdk10-m3.5.x_build] cleanWs
[windows-jdk10-m3.5.x_build] [WS-CLEANUP] Deleting project workspace...[WS-CLEANUP] done
[Pipeline] [windows-jdk10-m3.5.x_build] cleanWs
[windows-jdk10-m3.5.x_build] [WS-CLEANUP] Deleting project workspace...[WS-CLEANUP] done
[Pipeline] [windows-jdk10-m3.5.x_build] }
[Pipeline] [windows-jdk10-m3.5.x_build] // stage
[Pipeline] [windows-jdk10-m3.5.x_build] }
[Pipeline] [windows-jdk10-m3.5.x_build] // node
[Pipeline] [windows-jdk10-m3.5.x_build] }
[windows-jdk10-m3.5.x_build] Failed in branch windows-jdk10-m3.5.x_build
[Pipeline] // parallel
[Pipeline] stage
[Pipeline] { (Notifications)
[Pipeline] echo
Build result: FAILURE
[Pipeline] jiraIssueSelector
[Pipeline] emailext
Mime
  • Unnamed multipart/mixed (inline, None, 0 bytes)
View raw message