maven-notifications mailing list archives

Site index · List index
Message view « Date » · « Thread »
Top « Date » · « Thread »
From Apache Jenkins Server <jenk...@builds.apache.org>
Subject Build unstable in Jenkins: Maven TLP » maven-changes-plugin » MCHANGES-387 #5
Date Sun, 08 Jul 2018 20:10:51 GMT
See https://builds.apache.org/job/maven-box/job/maven-changes-plugin/job/MCHANGES-387/5/

No changes.

4 tests failed.
FAILED:  org.apache.maven.plugins.changes.ChangesCheckMojoTestCase.testIsValidateWithLocale

Error Message:
null

Stack Trace:
junit.framework.AssertionFailedError
	at junit.framework.Assert.fail(Assert.java:47)
	at junit.framework.Assert.assertTrue(Assert.java:20)
	at junit.framework.Assert.assertTrue(Assert.java:27)
	at org.apache.maven.plugins.changes.ChangesCheckMojoTestCase.testIsValidateWithLocale(ChangesCheckMojoTestCase.java:105)


FAILED:  org.apache.maven.plugins.changes.ChangesCheckMojoTestCase.testIsValidateWithLocale

Error Message:
null

Stack Trace:
junit.framework.AssertionFailedError
	at junit.framework.Assert.fail(Assert.java:47)
	at junit.framework.Assert.assertTrue(Assert.java:20)
	at junit.framework.Assert.assertTrue(Assert.java:27)
	at org.apache.maven.plugins.changes.ChangesCheckMojoTestCase.testIsValidateWithLocale(ChangesCheckMojoTestCase.java:105)


FAILED:  org.apache.maven.plugins.changes.ChangesCheckMojoTestCase.testIsValidateWithLocale

Error Message:
null

Stack Trace:
junit.framework.AssertionFailedError
	at junit.framework.Assert.fail(Assert.java:47)
	at junit.framework.Assert.assertTrue(Assert.java:20)
	at junit.framework.Assert.assertTrue(Assert.java:27)
	at org.apache.maven.plugins.changes.ChangesCheckMojoTestCase.testIsValidateWithLocale(ChangesCheckMojoTestCase.java:105)


FAILED:  org.apache.maven.plugins.changes.ChangesCheckMojoTestCase.testIsValidateWithLocale

Error Message:
null

Stack Trace:
junit.framework.AssertionFailedError
	at junit.framework.Assert.fail(Assert.java:47)
	at junit.framework.Assert.assertTrue(Assert.java:20)
	at junit.framework.Assert.assertTrue(Assert.java:27)
	at org.apache.maven.plugins.changes.ChangesCheckMojoTestCase.testIsValidateWithLocale(ChangesCheckMojoTestCase.java:105)




Build log:
[...truncated 447.45 KB...]
[windows-jdk8] Finished parsing Maven Invoker results (found 13)
[windows-jdk8] [withMaven] junitPublisher - Archive test results for Maven artifact org.apache.maven.plugins:maven-changes-plugin:3.0.0-SNAPSHOT
generated by maven-surefire-plugin:test (default-test): m\target\surefire-reports\*.xml
[windows-jdk8] Recording test results
[Pipeline] [linux-jdk8] // node
[Pipeline] [linux-jdk9] // withMaven
[Pipeline] [windows-jdk8] // withMaven
[Pipeline] [linux-jdk8] }
[Pipeline] [linux-jdk9] }
[Pipeline] [windows-jdk8] }
[Pipeline] [linux-jdk7] }
[Pipeline] [linux-jdk9] // stage
[Pipeline] [windows-jdk8] // stage
[Pipeline] [linux-jdk7] // dir
[windows-jdk10] [INFO] run post-build script verify.bsh
[windows-jdk10] [INFO]           report-changes-system-noissuemanagement\pom.xml .. SUCCESS
(9.2 s)
[windows-jdk10] [INFO] Building: report-jira-invalid-issuemanagement\pom.xml
[windows-jdk9] [INFO] run post-build script verify.bsh
[windows-jdk9] [INFO]           report-changes-system\pom.xml .................... SUCCESS
(10.9 s)
[windows-jdk9] [INFO] Building: report-changes-system-noissuemanagement\pom.xml
[windows-jdk9] [INFO] run post-build script verify.bsh
[windows-jdk9] [INFO]           report-changes-system-noissuemanagement\pom.xml .. SUCCESS
(10.2 s)
[windows-jdk9] [INFO] Building: report-jira-invalid-issuemanagement\pom.xml
[windows-jdk10] [INFO] run post-build script verify.groovy
[windows-jdk10] [INFO]           report-jira-invalid-issuemanagement\pom.xml ...... SUCCESS
(7.7 s)
[windows-jdk10] [INFO] 
[windows-jdk10] [INFO] --- maven-checkstyle-plugin:3.0.0:check (checkstyle-check) @ maven-changes-plugin
---
[windows-jdk10] [INFO] Downloading: https://repo.maven.apache.org/maven2/org/apache/maven/shared/maven-shared-resources/2/maven-shared-resources-2.pom
[windows-jdk10] [INFO] Downloaded: https://repo.maven.apache.org/maven2/org/apache/maven/shared/maven-shared-resources/2/maven-shared-resources-2.pom
(3.0 kB at 4.8 kB/s)
[windows-jdk10] [INFO] Downloading: https://repo.maven.apache.org/maven2/org/apache/maven/doxia/doxia-integration-tools/1.6/doxia-integration-tools-1.6.pom
[windows-jdk10] [INFO] Downloaded: https://repo.maven.apache.org/maven2/org/apache/maven/doxia/doxia-integration-tools/1.6/doxia-integration-tools-1.6.pom
(7.0 kB at 316 kB/s)
[windows-jdk10] [INFO] Downloading: https://repo.maven.apache.org/maven2/org/apache/maven/doxia/doxia-tools/3/doxia-tools-3.pom
[windows-jdk10] [INFO] Downloaded: https://repo.maven.apache.org/maven2/org/apache/maven/doxia/doxia-tools/3/doxia-tools-3.pom
(9.9 kB at 414 kB/s)
[windows-jdk10] [INFO] Downloading: https://repo.maven.apache.org/maven2/org/codehaus/plexus/plexus-resources/1.1.0/plexus-resources-1.1.0.pom
[windows-jdk10] [INFO] Downloaded: https://repo.maven.apache.org/maven2/org/codehaus/plexus/plexus-resources/1.1.0/plexus-resources-1.1.0.pom
(3.2 kB at 176 kB/s)
[windows-jdk10] [INFO] Downloading: https://repo.maven.apache.org/maven2/com/puppycrawl/tools/checkstyle/6.18/checkstyle-6.18.pom
[windows-jdk10] [INFO] Downloaded: https://repo.maven.apache.org/maven2/com/puppycrawl/tools/checkstyle/6.18/checkstyle-6.18.pom
(71 kB at 1.5 MB/s)
[windows-jdk10] [INFO] Downloading: https://repo.maven.apache.org/maven2/antlr/antlr/2.7.7/antlr-2.7.7.pom
[windows-jdk10] [INFO] Downloaded: https://repo.maven.apache.org/maven2/antlr/antlr/2.7.7/antlr-2.7.7.pom
(632 B at 63 kB/s)
[windows-jdk10] [INFO] Downloading: https://repo.maven.apache.org/maven2/org/antlr/antlr4-runtime/4.5.3/antlr4-runtime-4.5.3.pom
[windows-jdk10] [INFO] Downloaded: https://repo.maven.apache.org/maven2/org/antlr/antlr4-runtime/4.5.3/antlr4-runtime-4.5.3.pom
(2.3 kB at 178 kB/s)
[windows-jdk10] [INFO] Downloading: https://repo.maven.apache.org/maven2/org/antlr/antlr4-master/4.5.3/antlr4-master-4.5.3.pom
[windows-jdk10] [INFO] Downloaded: https://repo.maven.apache.org/maven2/org/antlr/antlr4-master/4.5.3/antlr4-master-4.5.3.pom
(3.7 kB at 335 kB/s)
[windows-jdk10] [INFO] Downloading: https://repo.maven.apache.org/maven2/commons-beanutils/commons-beanutils/1.9.2/commons-beanutils-1.9.2.pom
[windows-jdk10] [INFO] Downloaded: https://repo.maven.apache.org/maven2/commons-beanutils/commons-beanutils/1.9.2/commons-beanutils-1.9.2.pom
(14 kB at 841 kB/s)
[windows-jdk10] [INFO] Downloading: https://repo.maven.apache.org/maven2/org/apache/commons/commons-parent/33/commons-parent-33.pom
[windows-jdk10] [INFO] Downloaded: https://repo.maven.apache.org/maven2/org/apache/commons/commons-parent/33/commons-parent-33.pom
(53 kB at 3.1 MB/s)
[windows-jdk10] [INFO] Downloading: https://repo.maven.apache.org/maven2/commons-cli/commons-cli/1.3.1/commons-cli-1.3.1.pom
[windows-jdk10] [INFO] Downloaded: https://repo.maven.apache.org/maven2/commons-cli/commons-cli/1.3.1/commons-cli-1.3.1.pom
(10 kB at 400 kB/s)
[windows-jdk10] [INFO] Downloading: https://repo.maven.apache.org/maven2/com/google/guava/guava/19.0/guava-19.0.pom
[windows-jdk10] [INFO] Downloaded: https://repo.maven.apache.org/maven2/com/google/guava/guava/19.0/guava-19.0.pom
(6.8 kB at 617 kB/s)
[windows-jdk10] [INFO] Downloading: https://repo.maven.apache.org/maven2/com/google/guava/guava-parent/19.0/guava-parent-19.0.pom
[windows-jdk10] [INFO] Downloaded: https://repo.maven.apache.org/maven2/com/google/guava/guava-parent/19.0/guava-parent-19.0.pom
(9.9 kB at 988 kB/s)
[windows-jdk10] [INFO] Downloading: https://repo.maven.apache.org/maven2/javax/xml/bind/jaxb-api/2.3.0/jaxb-api-2.3.0.pom
[windows-jdk10] [INFO] Downloaded: https://repo.maven.apache.org/maven2/javax/xml/bind/jaxb-api/2.3.0/jaxb-api-2.3.0.pom
(23 kB at 2.1 MB/s)
[windows-jdk10] [INFO] Downloading: https://repo.maven.apache.org/maven2/javax/xml/bind/jaxb-api-parent/2.3.0/jaxb-api-parent-2.3.0.pom
[windows-jdk10] [INFO] Downloaded: https://repo.maven.apache.org/maven2/javax/xml/bind/jaxb-api-parent/2.3.0/jaxb-api-parent-2.3.0.pom
(5.6 kB at 256 kB/s)
[windows-jdk10] [INFO] Downloading: https://repo.maven.apache.org/maven2/net/java/jvnet-parent/5/jvnet-parent-5.pom
[windows-jdk10] [INFO] Downloaded: https://repo.maven.apache.org/maven2/net/java/jvnet-parent/5/jvnet-parent-5.pom
(8.9 kB at 886 kB/s)
[windows-jdk10] [INFO] Downloading: https://repo.maven.apache.org/maven2/commons-digester/commons-digester/1.6/commons-digester-1.6.jar
[windows-jdk10] [INFO] Downloading: https://repo.maven.apache.org/maven2/commons-logging/commons-logging/1.0.4/commons-logging-1.0.4.jar
[windows-jdk10] [INFO] Downloading: https://repo.maven.apache.org/maven2/org/apache/maven/doxia/doxia-core/1.2/doxia-core-1.2.jar
[windows-jdk10] [INFO] Downloading: https://repo.maven.apache.org/maven2/org/apache/maven/shared/maven-shared-resources/2/maven-shared-resources-2.jar
[windows-jdk10] [INFO] Downloading: https://repo.maven.apache.org/maven2/org/apache/maven/doxia/doxia-integration-tools/1.6/doxia-integration-tools-1.6.jar
[windows-jdk10] [INFO] Downloaded: https://repo.maven.apache.org/maven2/commons-logging/commons-logging/1.0.4/commons-logging-1.0.4.jar
(38 kB at 304 kB/s)
[windows-jdk10] [INFO] Downloading: https://repo.maven.apache.org/maven2/commons-io/commons-io/1.4/commons-io-1.4.jar
[windows-jdk10] [INFO] Downloaded: https://repo.maven.apache.org/maven2/commons-io/commons-io/1.4/commons-io-1.4.jar
(109 kB at 717 kB/s)
[windows-jdk10] [INFO] Downloading: https://repo.maven.apache.org/maven2/org/codehaus/plexus/plexus-resources/1.1.0/plexus-resources-1.1.0.jar
[windows-jdk10] [INFO] Downloaded: https://repo.maven.apache.org/maven2/org/codehaus/plexus/plexus-resources/1.1.0/plexus-resources-1.1.0.jar
(23 kB at 130 kB/s)
[windows-jdk10] [INFO] Downloading: https://repo.maven.apache.org/maven2/com/puppycrawl/tools/checkstyle/6.18/checkstyle-6.18.jar
[windows-jdk10] [INFO] Downloaded: https://repo.maven.apache.org/maven2/com/puppycrawl/tools/checkstyle/6.18/checkstyle-6.18.jar
(1.2 MB at 4.1 MB/s)
[windows-jdk10] [INFO] Downloading: https://repo.maven.apache.org/maven2/antlr/antlr/2.7.7/antlr-2.7.7.jar
[windows-jdk10] [INFO] Downloaded: https://repo.maven.apache.org/maven2/antlr/antlr/2.7.7/antlr-2.7.7.jar
(445 kB at 1.1 MB/s)
[windows-jdk10] [INFO] Downloading: https://repo.maven.apache.org/maven2/org/antlr/antlr4-runtime/4.5.3/antlr4-runtime-4.5.3.jar
[windows-jdk10] [INFO] Downloaded: https://repo.maven.apache.org/maven2/org/antlr/antlr4-runtime/4.5.3/antlr4-runtime-4.5.3.jar
(302 kB at 567 kB/s)
[windows-jdk10] [INFO] Downloading: https://repo.maven.apache.org/maven2/commons-beanutils/commons-beanutils/1.9.2/commons-beanutils-1.9.2.jar
[windows-jdk10] [INFO] Downloaded: https://repo.maven.apache.org/maven2/commons-beanutils/commons-beanutils/1.9.2/commons-beanutils-1.9.2.jar
(234 kB at 405 kB/s)
[windows-jdk10] [INFO] Downloading: https://repo.maven.apache.org/maven2/commons-cli/commons-cli/1.3.1/commons-cli-1.3.1.jar
[windows-jdk10] [INFO] Downloaded: https://repo.maven.apache.org/maven2/commons-cli/commons-cli/1.3.1/commons-cli-1.3.1.jar
(53 kB at 86 kB/s)
[windows-jdk10] [INFO] Downloading: https://repo.maven.apache.org/maven2/com/google/guava/guava/19.0/guava-19.0.jar
[windows-jdk10] [INFO] Downloaded: https://repo.maven.apache.org/maven2/org/apache/maven/doxia/doxia-core/1.2/doxia-core-1.2.jar
(154 kB at 250 kB/s)
[windows-jdk10] [INFO] Downloading: https://repo.maven.apache.org/maven2/commons-lang/commons-lang/2.1/commons-lang-2.1.jar
[windows-jdk10] [INFO] Downloaded: https://repo.maven.apache.org/maven2/commons-lang/commons-lang/2.1/commons-lang-2.1.jar
(208 kB at 319 kB/s)
[windows-jdk10] [INFO] Downloading: https://repo.maven.apache.org/maven2/javax/xml/bind/jaxb-api/2.3.0/jaxb-api-2.3.0.jar
[windows-jdk10] [INFO] Downloaded: https://repo.maven.apache.org/maven2/javax/xml/bind/jaxb-api/2.3.0/jaxb-api-2.3.0.jar
(126 kB at 183 kB/s)
[windows-jdk10] [INFO] Downloaded: https://repo.maven.apache.org/maven2/commons-digester/commons-digester/1.6/commons-digester-1.6.jar
(168 kB at 210 kB/s)
[windows-jdk10] [INFO] Downloaded: https://repo.maven.apache.org/maven2/com/google/guava/guava/19.0/guava-19.0.jar
(2.3 MB at 2.9 MB/s)
[windows-jdk10] [INFO] Downloaded: https://repo.maven.apache.org/maven2/org/apache/maven/doxia/doxia-integration-tools/1.6/doxia-integration-tools-1.6.jar
(45 kB at 55 kB/s)
[windows-jdk10] [INFO] Downloaded: https://repo.maven.apache.org/maven2/org/apache/maven/shared/maven-shared-resources/2/maven-shared-resources-2.jar
(13 kB at 16 kB/s)
[windows-jdk10] [INFO] 
[windows-jdk10] [INFO] --- maven-invoker-plugin:3.0.1:verify (integration-test) @ maven-changes-plugin
---
[windows-jdk10] [INFO] -------------------------------------------------
[windows-jdk10] [INFO] Build Summary:
[windows-jdk10] [INFO]   Passed: 13, Failed: 0, Errors: 0, Skipped: 0
[windows-jdk10] [INFO] -------------------------------------------------
[windows-jdk10] [INFO] ------------------------------------------------------------------------
[windows-jdk10] [INFO] BUILD SUCCESS
[windows-jdk10] [INFO] ------------------------------------------------------------------------
[windows-jdk10] [INFO] Total time: 02:31 min
[windows-jdk10] [INFO] Finished at: 2018-07-08T20:10:36Z
[windows-jdk10] [INFO] Final Memory: 50M/170M
[windows-jdk10] [INFO] ------------------------------------------------------------------------
[windows-jdk10] [INFO] [jenkins-event-spy] Generated F:\jenkins\jenkins-slave\workspace\changes-plugin_MCHANGES-387-ZGELSLW47SZNOTFX7QYOGFHKUTREF3KY3BMCGH2PM3R7AB47AWCA@2@tmp\withMavene7c4a7a7\maven-spy-20180708-200805-25611065924562022996258.log
[Pipeline] [linux-jdk9] }
[Pipeline] [windows-jdk8] }
[Pipeline] [linux-jdk7] }
[linux-jdk7] [withMaven] artifactsPublisher - Archive artifact m/pom.xml under org/apache/maven/plugins/maven-changes-plugin/3.0.0-SNAPSHOT/maven-changes-plugin-3.0.0-SNAPSHOT.pom
[linux-jdk7] [withMaven] artifactsPublisher - Archive artifact m/target/maven-changes-plugin-3.0.0-SNAPSHOT.jar
under org/apache/maven/plugins/maven-changes-plugin/3.0.0-SNAPSHOT/maven-changes-plugin-3.0.0-SNAPSHOT.jar
[linux-jdk7] [Fast Archiver] No prior successful build to compare, so performing full copy
of artifacts
[linux-jdk7] [withMaven] invokerPublisher - Archive invoker results for Maven artifact MavenArtifact{org.apache.maven.plugins:maven-changes-plugin::3.0.0-SNAPSHOT(version:
3.0.0-SNAPSHOT, snapshot:false) } generated by PluginInvocation{org.apache.maven.plugins:maven-invoker-plugin:3.0.1@integration-test
 integration-test}: m/target/invoker-reports/*.xml
[linux-jdk7] performing MavenInvokerRecorder, reportsFilenamePattern:'**/m/target/invoker-reports/BUILD*.xml',
invokerBuildDir:'**/m/target/it'
[linux-jdk7] Found reports:[/home/jenkins/jenkins-slave/workspace/changes-plugin_MCHANGES-387-ZGELSLW47SZNOTFX7QYOGFHKUTREF3KY3BMCGH2PM3R7AB47AWCA/m/target/invoker-reports/BUILD-announce-generate-inconsistent-issue-management.xml,
/home/jenkins/jenkins-slave/workspace/changes-plugin_MCHANGES-387-ZGELSLW47SZNOTFX7QYOGFHKUTREF3KY3BMCGH2PM3R7AB47AWCA/m/target/invoker-reports/BUILD-announce-generate-no-issue-management.xml,
/home/jenkins/jenkins-slave/workspace/changes-plugin_MCHANGES-387-ZGELSLW47SZNOTFX7QYOGFHKUTREF3KY3BMCGH2PM3R7AB47AWCA/m/target/invoker-reports/BUILD-announce-generate-no-url.xml,
/home/jenkins/jenkins-slave/workspace/changes-plugin_MCHANGES-387-ZGELSLW47SZNOTFX7QYOGFHKUTREF3KY3BMCGH2PM3R7AB47AWCA/m/target/invoker-reports/BUILD-announce-generate.xml,
/home/jenkins/jenkins-slave/workspace/changes-plugin_MCHANGES-387-ZGELSLW47SZNOTFX7QYOGFHKUTREF3KY3BMCGH2PM3R7AB47AWCA/m/target/invoker-reports/BUILD-announcement-generate-custom-template.xml,
/home/jenkins/jenkins-slave/workspace/changes-plugin_MCHANGES-387-ZGELSLW47SZNOTFX7QYOGFHKUTREF3KY3BMCGH2PM3R7AB47AWCA/m/target/invoker-reports/BUILD-report-aggregated-changes-generation.xml,
/home/jenkins/jenkins-slave/workspace/changes-plugin_MCHANGES-387-ZGELSLW47SZNOTFX7QYOGFHKUTREF3KY3BMCGH2PM3R7AB47AWCA/m/target/invoker-reports/BUILD-report-changes-generation.xml,
/home/jenkins/jenkins-slave/workspace/changes-plugin_MCHANGES-387-ZGELSLW47SZNOTFX7QYOGFHKUTREF3KY3BMCGH2PM3R7AB47AWCA/m/target/invoker-reports/BUILD-report-changes-interpolation.xml,
/home/jenkins/jenkins-slave/workspace/changes-plugin_MCHANGES-387-ZGELSLW47SZNOTFX7QYOGFHKUTREF3KY3BMCGH2PM3R7AB47AWCA/m/target/invoker-reports/BUILD-report-changes-nofile.xml,
/home/jenkins/jenkins-slave/workspace/changes-plugin_MCHANGES-387-ZGELSLW47SZNOTFX7QYOGFHKUTREF3KY3BMCGH2PM3R7AB47AWCA/m/target/invoker-reports/BUILD-report-changes-skip-snapshots.xml,
/home/jenkins/jenkins-slave/workspace/changes-plugin_MCHANGES-387-ZGELSLW47SZNOTFX7QYOGFHKUTREF3KY3BMCGH2PM3R7AB47AWCA/m/target/invoker-reports/BUILD-report-changes-system-noissuemanagement.xml,
/home/jenkins/jenkins-slave/workspace/changes-plugin_MCHANGES-387-ZGELSLW47SZNOTFX7QYOGFHKUTREF3KY3BMCGH2PM3R7AB47AWCA/m/target/invoker-reports/BUILD-report-changes-system.xml,
/home/jenkins/jenkins-slave/workspace/changes-plugin_MCHANGES-387-ZGELSLW47SZNOTFX7QYOGFHKUTREF3KY3BMCGH2PM3R7AB47AWCA/m/target/invoker-reports/BUILD-report-jira-invalid-issuemanagement.xml]
[linux-jdk7] Found logs:[/home/jenkins/jenkins-slave/workspace/changes-plugin_MCHANGES-387-ZGELSLW47SZNOTFX7QYOGFHKUTREF3KY3BMCGH2PM3R7AB47AWCA/m/target/it/announce-generate-inconsistent-issue-management/build.log,
/home/jenkins/jenkins-slave/workspace/changes-plugin_MCHANGES-387-ZGELSLW47SZNOTFX7QYOGFHKUTREF3KY3BMCGH2PM3R7AB47AWCA/m/target/it/announce-generate-no-issue-management/build.log,
/home/jenkins/jenkins-slave/workspace/changes-plugin_MCHANGES-387-ZGELSLW47SZNOTFX7QYOGFHKUTREF3KY3BMCGH2PM3R7AB47AWCA/m/target/it/announce-generate-no-url/build.log,
/home/jenkins/jenkins-slave/workspace/changes-plugin_MCHANGES-387-ZGELSLW47SZNOTFX7QYOGFHKUTREF3KY3BMCGH2PM3R7AB47AWCA/m/target/it/announce-generate/build.log,
/home/jenkins/jenkins-slave/workspace/changes-plugin_MCHANGES-387-ZGELSLW47SZNOTFX7QYOGFHKUTREF3KY3BMCGH2PM3R7AB47AWCA/m/target/it/announcement-generate-custom-template/build.log,
/home/jenkins/jenkins-slave/workspace/changes-plugin_MCHANGES-387-ZGELSLW47SZNOTFX7QYOGFHKUTREF3KY3BMCGH2PM3R7AB47AWCA/m/target/it/report-aggregated-changes-generation/build.log,
/home/jenkins/jenkins-slave/workspace/changes-plugin_MCHANGES-387-ZGELSLW47SZNOTFX7QYOGFHKUTREF3KY3BMCGH2PM3R7AB47AWCA/m/target/it/report-changes-generation/build.log,
/home/jenkins/jenkins-slave/workspace/changes-plugin_MCHANGES-387-ZGELSLW47SZNOTFX7QYOGFHKUTREF3KY3BMCGH2PM3R7AB47AWCA/m/target/it/report-changes-interpolation/build.log,
/home/jenkins/jenkins-slave/workspace/changes-plugin_MCHANGES-387-ZGELSLW47SZNOTFX7QYOGFHKUTREF3KY3BMCGH2PM3R7AB47AWCA/m/target/it/report-changes-nofile/build.log,
/home/jenkins/jenkins-slave/workspace/changes-plugin_MCHANGES-387-ZGELSLW47SZNOTFX7QYOGFHKUTREF3KY3BMCGH2PM3R7AB47AWCA/m/target/it/report-changes-skip-snapshots/build.log,
/home/jenkins/jenkins-slave/workspace/changes-plugin_MCHANGES-387-ZGELSLW47SZNOTFX7QYOGFHKUTREF3KY3BMCGH2PM3R7AB47AWCA/m/target/it/report-changes-system-noissuemanagement/build.log,
/home/jenkins/jenkins-slave/workspace/changes-plugin_MCHANGES-387-ZGELSLW47SZNOTFX7QYOGFHKUTREF3KY3BMCGH2PM3R7AB47AWCA/m/target/it/report-changes-system/build.log,
/home/jenkins/jenkins-slave/workspace/changes-plugin_MCHANGES-387-ZGELSLW47SZNOTFX7QYOGFHKUTREF3KY3BMCGH2PM3R7AB47AWCA/m/target/it/report-jira-invalid-issuemanagement/build.log]
[linux-jdk7] Finished parsing Maven Invoker results (found 13)
[linux-jdk7] [withMaven] junitPublisher - Archive test results for Maven artifact org.apache.maven.plugins:maven-changes-plugin:3.0.0-SNAPSHOT
generated by maven-surefire-plugin:test (default-test): m/target/surefire-reports/*.xml
[linux-jdk7] Recording test results
[linux-jdk7] [withMaven] openTasksPublisher - Scan Tasks for Maven artifact org.apache.maven.plugins:maven-changes-plugin:3.0.0-SNAPSHOT
in source directory m/src/main/java
[linux-jdk7] [TASKS] Scanning folder '/home/jenkins/jenkins-slave/workspace/changes-plugin_MCHANGES-387-ZGELSLW47SZNOTFX7QYOGFHKUTREF3KY3BMCGH2PM3R7AB47AWCA'
for files matching the pattern 'm/src/main/java/**/*' - excludes: null
[linux-jdk7] [TASKS] Found 48 files to scan for tasks
[linux-jdk7] [TASKS] Found 4 open tasks.
[linux-jdk7] Skipping warnings blame since pipelines do not have an SCM link.%n
[Pipeline] [linux-jdk9] // node
[Pipeline] [windows-jdk8] // node
[Pipeline] [linux-jdk7] // withMaven
[Pipeline] [linux-jdk9] }
[Pipeline] [windows-jdk8] }
[Pipeline] [linux-jdk7] }
[Pipeline] [windows-jdk10] }
[Pipeline] [linux-jdk7] // stage
[Pipeline] [windows-jdk10] // dir
[Pipeline] [linux-jdk7] }
[Pipeline] [windows-jdk10] }
[windows-jdk10] [withMaven] invokerPublisher - Archive invoker results for Maven artifact
MavenArtifact{org.apache.maven.plugins:maven-changes-plugin::3.0.0-SNAPSHOT(version: 3.0.0-SNAPSHOT,
snapshot:false) } generated by PluginInvocation{org.apache.maven.plugins:maven-invoker-plugin:3.0.1@integration-test
 integration-test}: m\target\invoker-reports\*.xml
[windows-jdk10] performing MavenInvokerRecorder, reportsFilenamePattern:'**/m\target\invoker-reports/BUILD*.xml',
invokerBuildDir:'**/m\target\it'
[windows-jdk10] Found reports:[f:\jenkins\jenkins-slave\workspace\changes-plugin_MCHANGES-387-ZGELSLW47SZNOTFX7QYOGFHKUTREF3KY3BMCGH2PM3R7AB47AWCA@2\m\target\invoker-reports\BUILD-announce-generate-inconsistent-issue-management.xml,
f:\jenkins\jenkins-slave\workspace\changes-plugin_MCHANGES-387-ZGELSLW47SZNOTFX7QYOGFHKUTREF3KY3BMCGH2PM3R7AB47AWCA@2\m\target\invoker-reports\BUILD-announce-generate-no-issue-management.xml,
f:\jenkins\jenkins-slave\workspace\changes-plugin_MCHANGES-387-ZGELSLW47SZNOTFX7QYOGFHKUTREF3KY3BMCGH2PM3R7AB47AWCA@2\m\target\invoker-reports\BUILD-announce-generate-no-url.xml,
f:\jenkins\jenkins-slave\workspace\changes-plugin_MCHANGES-387-ZGELSLW47SZNOTFX7QYOGFHKUTREF3KY3BMCGH2PM3R7AB47AWCA@2\m\target\invoker-reports\BUILD-announce-generate.xml,
f:\jenkins\jenkins-slave\workspace\changes-plugin_MCHANGES-387-ZGELSLW47SZNOTFX7QYOGFHKUTREF3KY3BMCGH2PM3R7AB47AWCA@2\m\target\invoker-reports\BUILD-announcement-generate-custom-template.xml,
f:\jenkins\jenkins-slave\workspace\changes-plugin_MCHANGES-387-ZGELSLW47SZNOTFX7QYOGFHKUTREF3KY3BMCGH2PM3R7AB47AWCA@2\m\target\invoker-reports\BUILD-report-aggregated-changes-generation.xml,
f:\jenkins\jenkins-slave\workspace\changes-plugin_MCHANGES-387-ZGELSLW47SZNOTFX7QYOGFHKUTREF3KY3BMCGH2PM3R7AB47AWCA@2\m\target\invoker-reports\BUILD-report-changes-generation.xml,
f:\jenkins\jenkins-slave\workspace\changes-plugin_MCHANGES-387-ZGELSLW47SZNOTFX7QYOGFHKUTREF3KY3BMCGH2PM3R7AB47AWCA@2\m\target\invoker-reports\BUILD-report-changes-interpolation.xml,
f:\jenkins\jenkins-slave\workspace\changes-plugin_MCHANGES-387-ZGELSLW47SZNOTFX7QYOGFHKUTREF3KY3BMCGH2PM3R7AB47AWCA@2\m\target\invoker-reports\BUILD-report-changes-nofile.xml,
f:\jenkins\jenkins-slave\workspace\changes-plugin_MCHANGES-387-ZGELSLW47SZNOTFX7QYOGFHKUTREF3KY3BMCGH2PM3R7AB47AWCA@2\m\target\invoker-reports\BUILD-report-changes-skip-snapshots.xml,
f:\jenkins\jenkins-slave\workspace\changes-plugin_MCHANGES-387-ZGELSLW47SZNOTFX7QYOGFHKUTREF3KY3BMCGH2PM3R7AB47AWCA@2\m\target\invoker-reports\BUILD-report-changes-system-noissuemanagement.xml,
f:\jenkins\jenkins-slave\workspace\changes-plugin_MCHANGES-387-ZGELSLW47SZNOTFX7QYOGFHKUTREF3KY3BMCGH2PM3R7AB47AWCA@2\m\target\invoker-reports\BUILD-report-changes-system.xml,
f:\jenkins\jenkins-slave\workspace\changes-plugin_MCHANGES-387-ZGELSLW47SZNOTFX7QYOGFHKUTREF3KY3BMCGH2PM3R7AB47AWCA@2\m\target\invoker-reports\BUILD-report-jira-invalid-issuemanagement.xml]
[windows-jdk10] Found logs:[f:\jenkins\jenkins-slave\workspace\changes-plugin_MCHANGES-387-ZGELSLW47SZNOTFX7QYOGFHKUTREF3KY3BMCGH2PM3R7AB47AWCA@2\m\target\it\announce-generate-inconsistent-issue-management\build.log,
f:\jenkins\jenkins-slave\workspace\changes-plugin_MCHANGES-387-ZGELSLW47SZNOTFX7QYOGFHKUTREF3KY3BMCGH2PM3R7AB47AWCA@2\m\target\it\announce-generate-no-issue-management\build.log,
f:\jenkins\jenkins-slave\workspace\changes-plugin_MCHANGES-387-ZGELSLW47SZNOTFX7QYOGFHKUTREF3KY3BMCGH2PM3R7AB47AWCA@2\m\target\it\announce-generate-no-url\build.log,
f:\jenkins\jenkins-slave\workspace\changes-plugin_MCHANGES-387-ZGELSLW47SZNOTFX7QYOGFHKUTREF3KY3BMCGH2PM3R7AB47AWCA@2\m\target\it\announce-generate\build.log,
f:\jenkins\jenkins-slave\workspace\changes-plugin_MCHANGES-387-ZGELSLW47SZNOTFX7QYOGFHKUTREF3KY3BMCGH2PM3R7AB47AWCA@2\m\target\it\announcement-generate-custom-template\build.log,
f:\jenkins\jenkins-slave\workspace\changes-plugin_MCHANGES-387-ZGELSLW47SZNOTFX7QYOGFHKUTREF3KY3BMCGH2PM3R7AB47AWCA@2\m\target\it\report-aggregated-changes-generation\build.log,
f:\jenkins\jenkins-slave\workspace\changes-plugin_MCHANGES-387-ZGELSLW47SZNOTFX7QYOGFHKUTREF3KY3BMCGH2PM3R7AB47AWCA@2\m\target\it\report-changes-generation\build.log,
f:\jenkins\jenkins-slave\workspace\changes-plugin_MCHANGES-387-ZGELSLW47SZNOTFX7QYOGFHKUTREF3KY3BMCGH2PM3R7AB47AWCA@2\m\target\it\report-changes-interpolation\build.log,
f:\jenkins\jenkins-slave\workspace\changes-plugin_MCHANGES-387-ZGELSLW47SZNOTFX7QYOGFHKUTREF3KY3BMCGH2PM3R7AB47AWCA@2\m\target\it\report-changes-nofile\build.log,
f:\jenkins\jenkins-slave\workspace\changes-plugin_MCHANGES-387-ZGELSLW47SZNOTFX7QYOGFHKUTREF3KY3BMCGH2PM3R7AB47AWCA@2\m\target\it\report-changes-skip-snapshots\build.log,
f:\jenkins\jenkins-slave\workspace\changes-plugin_MCHANGES-387-ZGELSLW47SZNOTFX7QYOGFHKUTREF3KY3BMCGH2PM3R7AB47AWCA@2\m\target\it\report-changes-system-noissuemanagement\build.log,
f:\jenkins\jenkins-slave\workspace\changes-plugin_MCHANGES-387-ZGELSLW47SZNOTFX7QYOGFHKUTREF3KY3BMCGH2PM3R7AB47AWCA@2\m\target\it\report-changes-system\build.log,
f:\jenkins\jenkins-slave\workspace\changes-plugin_MCHANGES-387-ZGELSLW47SZNOTFX7QYOGFHKUTREF3KY3BMCGH2PM3R7AB47AWCA@2\m\target\it\report-jira-invalid-issuemanagement\build.log]
[windows-jdk10] Finished parsing Maven Invoker results (found 13)
[windows-jdk10] [withMaven] junitPublisher - Archive test results for Maven artifact org.apache.maven.plugins:maven-changes-plugin:3.0.0-SNAPSHOT
generated by maven-surefire-plugin:test (default-test): m\target\surefire-reports\*.xml
[windows-jdk10] Recording test results
[Pipeline] [linux-jdk7] // node
[Pipeline] [windows-jdk10] // withMaven
[Pipeline] [linux-jdk7] }
[Pipeline] [windows-jdk10] }
[Pipeline] [windows-jdk10] // stage
[Pipeline] [windows-jdk10] }
[Pipeline] [windows-jdk10] // node
[Pipeline] [windows-jdk10] }
[windows-jdk9] [INFO] run post-build script verify.groovy
[windows-jdk9] [INFO]           report-jira-invalid-issuemanagement\pom.xml ...... SUCCESS
(7.1 s)
[windows-jdk9] [INFO] 
[windows-jdk9] [INFO] --- maven-checkstyle-plugin:3.0.0:check (checkstyle-check) @ maven-changes-plugin
---
[windows-jdk9] [INFO] Downloading: https://repo.maven.apache.org/maven2/org/apache/maven/shared/maven-shared-resources/2/maven-shared-resources-2.pom
[windows-jdk9] [INFO] Downloaded: https://repo.maven.apache.org/maven2/org/apache/maven/shared/maven-shared-resources/2/maven-shared-resources-2.pom
(3.0 kB at 7.4 kB/s)
[windows-jdk9] [INFO] Downloading: https://repo.maven.apache.org/maven2/org/apache/maven/doxia/doxia-integration-tools/1.6/doxia-integration-tools-1.6.pom
[windows-jdk9] [INFO] Downloaded: https://repo.maven.apache.org/maven2/org/apache/maven/doxia/doxia-integration-tools/1.6/doxia-integration-tools-1.6.pom
(7.0 kB at 409 kB/s)
[windows-jdk9] [INFO] Downloading: https://repo.maven.apache.org/maven2/org/apache/maven/doxia/doxia-tools/3/doxia-tools-3.pom
[windows-jdk9] [INFO] Downloaded: https://repo.maven.apache.org/maven2/org/apache/maven/doxia/doxia-tools/3/doxia-tools-3.pom
(9.9 kB at 496 kB/s)
[windows-jdk9] [INFO] Downloading: https://repo.maven.apache.org/maven2/org/codehaus/plexus/plexus-resources/1.1.0/plexus-resources-1.1.0.pom
[windows-jdk9] [INFO] Downloaded: https://repo.maven.apache.org/maven2/org/codehaus/plexus/plexus-resources/1.1.0/plexus-resources-1.1.0.pom
(3.2 kB at 265 kB/s)
[windows-jdk9] [INFO] Downloading: https://repo.maven.apache.org/maven2/com/puppycrawl/tools/checkstyle/6.18/checkstyle-6.18.pom
[windows-jdk9] [INFO] Downloaded: https://repo.maven.apache.org/maven2/com/puppycrawl/tools/checkstyle/6.18/checkstyle-6.18.pom
(71 kB at 1.3 MB/s)
[windows-jdk9] [INFO] Downloading: https://repo.maven.apache.org/maven2/antlr/antlr/2.7.7/antlr-2.7.7.pom
[windows-jdk9] [INFO] Downloaded: https://repo.maven.apache.org/maven2/antlr/antlr/2.7.7/antlr-2.7.7.pom
(632 B at 53 kB/s)
[windows-jdk9] [INFO] Downloading: https://repo.maven.apache.org/maven2/org/antlr/antlr4-runtime/4.5.3/antlr4-runtime-4.5.3.pom
[windows-jdk9] [INFO] Downloaded: https://repo.maven.apache.org/maven2/org/antlr/antlr4-runtime/4.5.3/antlr4-runtime-4.5.3.pom
(2.3 kB at 100 kB/s)
[windows-jdk9] [INFO] Downloading: https://repo.maven.apache.org/maven2/org/antlr/antlr4-master/4.5.3/antlr4-master-4.5.3.pom
[windows-jdk9] [INFO] Downloaded: https://repo.maven.apache.org/maven2/org/antlr/antlr4-master/4.5.3/antlr4-master-4.5.3.pom
(3.7 kB at 307 kB/s)
[windows-jdk9] [INFO] Downloading: https://repo.maven.apache.org/maven2/commons-beanutils/commons-beanutils/1.9.2/commons-beanutils-1.9.2.pom
[windows-jdk9] [INFO] Downloaded: https://repo.maven.apache.org/maven2/commons-beanutils/commons-beanutils/1.9.2/commons-beanutils-1.9.2.pom
(14 kB at 1.0 MB/s)
[windows-jdk9] [INFO] Downloading: https://repo.maven.apache.org/maven2/org/apache/commons/commons-parent/33/commons-parent-33.pom
[windows-jdk9] [INFO] Downloaded: https://repo.maven.apache.org/maven2/org/apache/commons/commons-parent/33/commons-parent-33.pom
(53 kB at 1.7 MB/s)
[windows-jdk9] [INFO] Downloading: https://repo.maven.apache.org/maven2/commons-cli/commons-cli/1.3.1/commons-cli-1.3.1.pom
[windows-jdk9] [INFO] Downloaded: https://repo.maven.apache.org/maven2/commons-cli/commons-cli/1.3.1/commons-cli-1.3.1.pom
(10 kB at 650 kB/s)
[windows-jdk9] [INFO] Downloading: https://repo.maven.apache.org/maven2/com/google/guava/guava/19.0/guava-19.0.pom
[windows-jdk9] [INFO] Downloaded: https://repo.maven.apache.org/maven2/com/google/guava/guava/19.0/guava-19.0.pom
(6.8 kB at 485 kB/s)
[windows-jdk9] [INFO] Downloading: https://repo.maven.apache.org/maven2/com/google/guava/guava-parent/19.0/guava-parent-19.0.pom
[windows-jdk9] [INFO] Downloaded: https://repo.maven.apache.org/maven2/com/google/guava/guava-parent/19.0/guava-parent-19.0.pom
(9.9 kB at 823 kB/s)
[windows-jdk9] [INFO] Downloading: https://repo.maven.apache.org/maven2/javax/xml/bind/jaxb-api/2.3.0/jaxb-api-2.3.0.pom
[windows-jdk9] [INFO] Downloaded: https://repo.maven.apache.org/maven2/javax/xml/bind/jaxb-api/2.3.0/jaxb-api-2.3.0.pom
(23 kB at 1.4 MB/s)
[windows-jdk9] [INFO] Downloading: https://repo.maven.apache.org/maven2/javax/xml/bind/jaxb-api-parent/2.3.0/jaxb-api-parent-2.3.0.pom
[windows-jdk9] [INFO] Downloaded: https://repo.maven.apache.org/maven2/javax/xml/bind/jaxb-api-parent/2.3.0/jaxb-api-parent-2.3.0.pom
(5.6 kB at 403 kB/s)
[windows-jdk9] [INFO] Downloading: https://repo.maven.apache.org/maven2/net/java/jvnet-parent/5/jvnet-parent-5.pom
[windows-jdk9] [INFO] Downloaded: https://repo.maven.apache.org/maven2/net/java/jvnet-parent/5/jvnet-parent-5.pom
(8.9 kB at 682 kB/s)
[windows-jdk9] [INFO] Downloading: https://repo.maven.apache.org/maven2/org/apache/maven/shared/maven-shared-resources/2/maven-shared-resources-2.jar
[windows-jdk9] [INFO] Downloading: https://repo.maven.apache.org/maven2/org/apache/maven/doxia/doxia-core/1.2/doxia-core-1.2.jar
[windows-jdk9] [INFO] Downloading: https://repo.maven.apache.org/maven2/commons-logging/commons-logging/1.0.4/commons-logging-1.0.4.jar
[windows-jdk9] [INFO] Downloading: https://repo.maven.apache.org/maven2/commons-digester/commons-digester/1.6/commons-digester-1.6.jar
[windows-jdk9] [INFO] Downloading: https://repo.maven.apache.org/maven2/org/apache/maven/doxia/doxia-integration-tools/1.6/doxia-integration-tools-1.6.jar
[windows-jdk9] [INFO] Downloaded: https://repo.maven.apache.org/maven2/commons-logging/commons-logging/1.0.4/commons-logging-1.0.4.jar
(38 kB at 950 kB/s)
[windows-jdk9] [INFO] Downloading: https://repo.maven.apache.org/maven2/commons-io/commons-io/1.4/commons-io-1.4.jar
[windows-jdk9] [INFO] Downloaded: https://repo.maven.apache.org/maven2/commons-io/commons-io/1.4/commons-io-1.4.jar
(109 kB at 1.5 MB/s)
[windows-jdk9] [INFO] Downloading: https://repo.maven.apache.org/maven2/org/codehaus/plexus/plexus-resources/1.1.0/plexus-resources-1.1.0.jar
[windows-jdk9] [INFO] Downloaded: https://repo.maven.apache.org/maven2/commons-digester/commons-digester/1.6/commons-digester-1.6.jar
(168 kB at 2.2 MB/s)
[windows-jdk9] [INFO] Downloading: https://repo.maven.apache.org/maven2/com/puppycrawl/tools/checkstyle/6.18/checkstyle-6.18.jar
[windows-jdk9] [INFO] Downloaded: https://repo.maven.apache.org/maven2/org/apache/maven/doxia/doxia-integration-tools/1.6/doxia-integration-tools-1.6.jar
(45 kB at 496 kB/s)
[windows-jdk9] [INFO] Downloading: https://repo.maven.apache.org/maven2/antlr/antlr/2.7.7/antlr-2.7.7.jar
[windows-jdk9] [INFO] Downloaded: https://repo.maven.apache.org/maven2/org/codehaus/plexus/plexus-resources/1.1.0/plexus-resources-1.1.0.jar
(23 kB at 149 kB/s)
[windows-jdk9] [INFO] Downloading: https://repo.maven.apache.org/maven2/org/antlr/antlr4-runtime/4.5.3/antlr4-runtime-4.5.3.jar
[windows-jdk9] [INFO] Downloaded: https://repo.maven.apache.org/maven2/antlr/antlr/2.7.7/antlr-2.7.7.jar
(445 kB at 2.2 MB/s)
[windows-jdk9] [INFO] Downloading: https://repo.maven.apache.org/maven2/commons-beanutils/commons-beanutils/1.9.2/commons-beanutils-1.9.2.jar
[windows-jdk9] [INFO] Downloaded: https://repo.maven.apache.org/maven2/org/antlr/antlr4-runtime/4.5.3/antlr4-runtime-4.5.3.jar
(302 kB at 1.4 MB/s)
[windows-jdk9] [INFO] Downloading: https://repo.maven.apache.org/maven2/commons-cli/commons-cli/1.3.1/commons-cli-1.3.1.jar
[windows-jdk9] [INFO] Downloaded: https://repo.maven.apache.org/maven2/org/apache/maven/shared/maven-shared-resources/2/maven-shared-resources-2.jar
(13 kB at 58 kB/s)
[windows-jdk9] [INFO] Downloading: https://repo.maven.apache.org/maven2/com/google/guava/guava/19.0/guava-19.0.jar
[windows-jdk9] [INFO] Downloaded: https://repo.maven.apache.org/maven2/com/puppycrawl/tools/checkstyle/6.18/checkstyle-6.18.jar
(1.2 MB at 4.6 MB/s)
[windows-jdk9] [INFO] Downloading: https://repo.maven.apache.org/maven2/commons-lang/commons-lang/2.1/commons-lang-2.1.jar
[windows-jdk9] [INFO] Downloaded: https://repo.maven.apache.org/maven2/commons-cli/commons-cli/1.3.1/commons-cli-1.3.1.jar
(53 kB at 205 kB/s)
[windows-jdk9] [INFO] Downloading: https://repo.maven.apache.org/maven2/javax/xml/bind/jaxb-api/2.3.0/jaxb-api-2.3.0.jar
[windows-jdk9] [INFO] Downloaded: https://repo.maven.apache.org/maven2/commons-beanutils/commons-beanutils/1.9.2/commons-beanutils-1.9.2.jar
(234 kB at 844 kB/s)
[windows-jdk9] [INFO] Downloaded: https://repo.maven.apache.org/maven2/org/apache/maven/doxia/doxia-core/1.2/doxia-core-1.2.jar
(154 kB at 547 kB/s)
[windows-jdk9] [INFO] Downloaded: https://repo.maven.apache.org/maven2/javax/xml/bind/jaxb-api/2.3.0/jaxb-api-2.3.0.jar
(126 kB at 446 kB/s)
[windows-jdk9] [INFO] Downloaded: https://repo.maven.apache.org/maven2/commons-lang/commons-lang/2.1/commons-lang-2.1.jar
(208 kB at 709 kB/s)
[windows-jdk9] [INFO] Downloaded: https://repo.maven.apache.org/maven2/com/google/guava/guava/19.0/guava-19.0.jar
(2.3 MB at 6.2 MB/s)
[windows-jdk9] [INFO] 
[windows-jdk9] [INFO] --- maven-invoker-plugin:3.0.1:verify (integration-test) @ maven-changes-plugin
---
[windows-jdk9] [INFO] -------------------------------------------------
[windows-jdk9] [INFO] Build Summary:
[windows-jdk9] [INFO]   Passed: 13, Failed: 0, Errors: 0, Skipped: 0
[windows-jdk9] [INFO] -------------------------------------------------
[windows-jdk9] [INFO] ------------------------------------------------------------------------
[windows-jdk9] [INFO] BUILD SUCCESS
[windows-jdk9] [INFO] ------------------------------------------------------------------------
[windows-jdk9] [INFO] Total time: 02:44 min
[windows-jdk9] [INFO] Finished at: 2018-07-08T20:10:47Z
[windows-jdk9] [INFO] Final Memory: 51M/170M
[windows-jdk9] [INFO] ------------------------------------------------------------------------
[windows-jdk9] [INFO] [jenkins-event-spy] Generated F:\jenkins\jenkins-slave\workspace\changes-plugin_MCHANGES-387-ZGELSLW47SZNOTFX7QYOGFHKUTREF3KY3BMCGH2PM3R7AB47AWCA@tmp\withMaven29c2ef23\maven-spy-20180708-200801-9964304738075389710778.log
[Pipeline] [windows-jdk9] }
[Pipeline] [windows-jdk9] // dir
[Pipeline] [windows-jdk9] }
[windows-jdk9] [withMaven] invokerPublisher - Archive invoker results for Maven artifact MavenArtifact{org.apache.maven.plugins:maven-changes-plugin::3.0.0-SNAPSHOT(version:
3.0.0-SNAPSHOT, snapshot:false) } generated by PluginInvocation{org.apache.maven.plugins:maven-invoker-plugin:3.0.1@integration-test
 integration-test}: m\target\invoker-reports\*.xml
[windows-jdk9] performing MavenInvokerRecorder, reportsFilenamePattern:'**/m\target\invoker-reports/BUILD*.xml',
invokerBuildDir:'**/m\target\it'
[windows-jdk9] Found reports:[f:\jenkins\jenkins-slave\workspace\changes-plugin_MCHANGES-387-ZGELSLW47SZNOTFX7QYOGFHKUTREF3KY3BMCGH2PM3R7AB47AWCA\m\target\invoker-reports\BUILD-announce-generate-inconsistent-issue-management.xml,
f:\jenkins\jenkins-slave\workspace\changes-plugin_MCHANGES-387-ZGELSLW47SZNOTFX7QYOGFHKUTREF3KY3BMCGH2PM3R7AB47AWCA\m\target\invoker-reports\BUILD-announce-generate-no-issue-management.xml,
f:\jenkins\jenkins-slave\workspace\changes-plugin_MCHANGES-387-ZGELSLW47SZNOTFX7QYOGFHKUTREF3KY3BMCGH2PM3R7AB47AWCA\m\target\invoker-reports\BUILD-announce-generate-no-url.xml,
f:\jenkins\jenkins-slave\workspace\changes-plugin_MCHANGES-387-ZGELSLW47SZNOTFX7QYOGFHKUTREF3KY3BMCGH2PM3R7AB47AWCA\m\target\invoker-reports\BUILD-announce-generate.xml,
f:\jenkins\jenkins-slave\workspace\changes-plugin_MCHANGES-387-ZGELSLW47SZNOTFX7QYOGFHKUTREF3KY3BMCGH2PM3R7AB47AWCA\m\target\invoker-reports\BUILD-announcement-generate-custom-template.xml,
f:\jenkins\jenkins-slave\workspace\changes-plugin_MCHANGES-387-ZGELSLW47SZNOTFX7QYOGFHKUTREF3KY3BMCGH2PM3R7AB47AWCA\m\target\invoker-reports\BUILD-report-aggregated-changes-generation.xml,
f:\jenkins\jenkins-slave\workspace\changes-plugin_MCHANGES-387-ZGELSLW47SZNOTFX7QYOGFHKUTREF3KY3BMCGH2PM3R7AB47AWCA\m\target\invoker-reports\BUILD-report-changes-generation.xml,
f:\jenkins\jenkins-slave\workspace\changes-plugin_MCHANGES-387-ZGELSLW47SZNOTFX7QYOGFHKUTREF3KY3BMCGH2PM3R7AB47AWCA\m\target\invoker-reports\BUILD-report-changes-interpolation.xml,
f:\jenkins\jenkins-slave\workspace\changes-plugin_MCHANGES-387-ZGELSLW47SZNOTFX7QYOGFHKUTREF3KY3BMCGH2PM3R7AB47AWCA\m\target\invoker-reports\BUILD-report-changes-nofile.xml,
f:\jenkins\jenkins-slave\workspace\changes-plugin_MCHANGES-387-ZGELSLW47SZNOTFX7QYOGFHKUTREF3KY3BMCGH2PM3R7AB47AWCA\m\target\invoker-reports\BUILD-report-changes-skip-snapshots.xml,
f:\jenkins\jenkins-slave\workspace\changes-plugin_MCHANGES-387-ZGELSLW47SZNOTFX7QYOGFHKUTREF3KY3BMCGH2PM3R7AB47AWCA\m\target\invoker-reports\BUILD-report-changes-system-noissuemanagement.xml,
f:\jenkins\jenkins-slave\workspace\changes-plugin_MCHANGES-387-ZGELSLW47SZNOTFX7QYOGFHKUTREF3KY3BMCGH2PM3R7AB47AWCA\m\target\invoker-reports\BUILD-report-changes-system.xml,
f:\jenkins\jenkins-slave\workspace\changes-plugin_MCHANGES-387-ZGELSLW47SZNOTFX7QYOGFHKUTREF3KY3BMCGH2PM3R7AB47AWCA\m\target\invoker-reports\BUILD-report-jira-invalid-issuemanagement.xml]
[windows-jdk9] Found logs:[f:\jenkins\jenkins-slave\workspace\changes-plugin_MCHANGES-387-ZGELSLW47SZNOTFX7QYOGFHKUTREF3KY3BMCGH2PM3R7AB47AWCA\m\target\it\announce-generate-inconsistent-issue-management\build.log,
f:\jenkins\jenkins-slave\workspace\changes-plugin_MCHANGES-387-ZGELSLW47SZNOTFX7QYOGFHKUTREF3KY3BMCGH2PM3R7AB47AWCA\m\target\it\announce-generate-no-issue-management\build.log,
f:\jenkins\jenkins-slave\workspace\changes-plugin_MCHANGES-387-ZGELSLW47SZNOTFX7QYOGFHKUTREF3KY3BMCGH2PM3R7AB47AWCA\m\target\it\announce-generate-no-url\build.log,
f:\jenkins\jenkins-slave\workspace\changes-plugin_MCHANGES-387-ZGELSLW47SZNOTFX7QYOGFHKUTREF3KY3BMCGH2PM3R7AB47AWCA\m\target\it\announce-generate\build.log,
f:\jenkins\jenkins-slave\workspace\changes-plugin_MCHANGES-387-ZGELSLW47SZNOTFX7QYOGFHKUTREF3KY3BMCGH2PM3R7AB47AWCA\m\target\it\announcement-generate-custom-template\build.log,
f:\jenkins\jenkins-slave\workspace\changes-plugin_MCHANGES-387-ZGELSLW47SZNOTFX7QYOGFHKUTREF3KY3BMCGH2PM3R7AB47AWCA\m\target\it\report-aggregated-changes-generation\build.log,
f:\jenkins\jenkins-slave\workspace\changes-plugin_MCHANGES-387-ZGELSLW47SZNOTFX7QYOGFHKUTREF3KY3BMCGH2PM3R7AB47AWCA\m\target\it\report-changes-generation\build.log,
f:\jenkins\jenkins-slave\workspace\changes-plugin_MCHANGES-387-ZGELSLW47SZNOTFX7QYOGFHKUTREF3KY3BMCGH2PM3R7AB47AWCA\m\target\it\report-changes-interpolation\build.log,
f:\jenkins\jenkins-slave\workspace\changes-plugin_MCHANGES-387-ZGELSLW47SZNOTFX7QYOGFHKUTREF3KY3BMCGH2PM3R7AB47AWCA\m\target\it\report-changes-nofile\build.log,
f:\jenkins\jenkins-slave\workspace\changes-plugin_MCHANGES-387-ZGELSLW47SZNOTFX7QYOGFHKUTREF3KY3BMCGH2PM3R7AB47AWCA\m\target\it\report-changes-skip-snapshots\build.log,
f:\jenkins\jenkins-slave\workspace\changes-plugin_MCHANGES-387-ZGELSLW47SZNOTFX7QYOGFHKUTREF3KY3BMCGH2PM3R7AB47AWCA\m\target\it\report-changes-system-noissuemanagement\build.log,
f:\jenkins\jenkins-slave\workspace\changes-plugin_MCHANGES-387-ZGELSLW47SZNOTFX7QYOGFHKUTREF3KY3BMCGH2PM3R7AB47AWCA\m\target\it\report-changes-system\build.log,
f:\jenkins\jenkins-slave\workspace\changes-plugin_MCHANGES-387-ZGELSLW47SZNOTFX7QYOGFHKUTREF3KY3BMCGH2PM3R7AB47AWCA\m\target\it\report-jira-invalid-issuemanagement\build.log]
[windows-jdk9] Finished parsing Maven Invoker results (found 13)
[windows-jdk9] [withMaven] junitPublisher - Archive test results for Maven artifact org.apache.maven.plugins:maven-changes-plugin:3.0.0-SNAPSHOT
generated by maven-surefire-plugin:test (default-test): m\target\surefire-reports\*.xml
[windows-jdk9] Recording test results
[Pipeline] [windows-jdk9] // withMaven
[Pipeline] [windows-jdk9] }
[Pipeline] [windows-jdk9] // stage
[Pipeline] [windows-jdk9] }
[Pipeline] [windows-jdk9] // node
[Pipeline] [windows-jdk9] }
[Pipeline] // parallel
[Pipeline] stage
[Pipeline] { (Notifications)
[Pipeline] echo
Build result: UNSTABLE
[Pipeline] jiraIssueSelector
[Pipeline] emailext
Mime
  • Unnamed multipart/mixed (inline, None, 0 bytes)
View raw message