maven-notifications mailing list archives

Site index · List index
Message view « Date » · « Thread »
Top « Date » · « Thread »
From Apache Jenkins Server <jenk...@builds.apache.org>
Subject Build failed in Jenkins: Maven TLP » maven-pmd-plugin » master #43
Date Fri, 13 Jul 2018 07:56:20 GMT
See https://builds.apache.org/job/maven-box/job/maven-pmd-plugin/job/master/43/

No changes.

All tests passed

Build log:
[...truncated 4.34 MB...]
[linux-jdk8]        |        [DEBUG]   (f) classpathElements = [/home/jenkins/jenkins-slave/workspace/box_maven-pmd-plugin_master-723XUI4HKC5A6CYF5JA2PBPNJGNR6SKD4M55XBOMRDY4Z3ISJGVQ/m/target/it/MPMD-205-pmd-js-check/target/test-classes,
/home/jenkins/jenkins-slave/workspace/box_maven-pmd-plugin_master-723XUI4HKC5A6CYF5JA2PBPNJGNR6SKD4M55XBOMRDY4Z3ISJGVQ/m/target/it/MPMD-205-pmd-js-check/target/classes]
[linux-jdk8]        |        [DEBUG]   (f) compileSourceRoots = [/home/jenkins/jenkins-slave/workspace/box_maven-pmd-plugin_master-723XUI4HKC5A6CYF5JA2PBPNJGNR6SKD4M55XBOMRDY4Z3ISJGVQ/m/target/it/MPMD-205-pmd-js-check/src/test/java]
[linux-jdk8]        |        [DEBUG]   (f) compilerId = javac
[linux-jdk8]        |        [DEBUG]   (f) debug = true
[linux-jdk8]        |        [DEBUG]   (f) encoding = UTF-8
[linux-jdk8]        |        [DEBUG]   (f) failOnError = true
[linux-jdk8]        |        [DEBUG]   (f) forceJavacCompilerUse = false
[linux-jdk8]        |        [DEBUG]   (f) fork = false
[linux-jdk8]        |        [DEBUG]   (f) generatedTestSourcesDirectory = /home/jenkins/jenkins-slave/workspace/box_maven-pmd-plugin_master-723XUI4HKC5A6CYF5JA2PBPNJGNR6SKD4M55XBOMRDY4Z3ISJGVQ/m/target/it/MPMD-205-pmd-js-check/target/generated-test-sources/test-annotations
[linux-jdk8]        |        [DEBUG]   (f) mojoExecution = org.apache.maven.plugins:maven-compiler-plugin:3.1:testCompile
{execution: default-testCompile}
[linux-jdk8]        |        [DEBUG]   (f) optimize = false
[linux-jdk8]        |        [DEBUG]   (f) outputDirectory = /home/jenkins/jenkins-slave/workspace/box_maven-pmd-plugin_master-723XUI4HKC5A6CYF5JA2PBPNJGNR6SKD4M55XBOMRDY4Z3ISJGVQ/m/target/it/MPMD-205-pmd-js-check/target/test-classes
[linux-jdk8]        |        [DEBUG]   (f) showDeprecation = false
[linux-jdk8]        |        [DEBUG]   (f) showWarnings = false
[linux-jdk8]        |        [DEBUG]   (f) skipMultiThreadWarning = false
[linux-jdk8]        |        [DEBUG]   (f) source = 1.7
[linux-jdk8]        |        [DEBUG]   (f) staleMillis = 0
[linux-jdk8]        |        [DEBUG]   (f) target = 1.7
[linux-jdk8]        |        [DEBUG]   (f) useIncrementalCompilation = true
[linux-jdk8]        |        [DEBUG]   (f) verbose = false
[linux-jdk8]        |        [DEBUG]   (f) mavenSession = org.apache.maven.execution.MavenSession@7551da2a
[linux-jdk8]        |        [DEBUG]   (f) session = org.apache.maven.execution.MavenSession@7551da2a
[linux-jdk8]        |        [DEBUG] -- end configuration --
[linux-jdk8]        |        [DEBUG] Using compiler 'javac'.
[linux-jdk8]        |        [INFO] No sources to compile
[linux-jdk8]        |        [INFO] 
[linux-jdk8]        |        [INFO] --- maven-surefire-plugin:2.12.4:test (default-test) @
MPMD-205-pmd-js-check ---
[linux-jdk8]        |        [DEBUG] Dependency collection stats: {ConflictMarker.analyzeTime=297972,
ConflictMarker.markTime=148486, ConflictMarker.nodeCount=132, ConflictIdSorter.graphTime=170553,
ConflictIdSorter.topsortTime=61206, ConflictIdSorter.conflictIdCount=27, ConflictIdSorter.conflictIdCycleCount=0,
ConflictResolver.totalTime=1429199, ConflictResolver.conflictItemCount=77, DefaultDependencyCollector.collectTime=54264203,
DefaultDependencyCollector.transformTime=2146901}
[linux-jdk8]        |        [DEBUG] org.apache.maven.plugins:maven-surefire-plugin:jar:2.12.4:
[linux-jdk8]        |        [DEBUG]    org.apache.maven:maven-plugin-api:jar:2.0.9:compile
[linux-jdk8]        |        [DEBUG]    org.apache.maven.surefire:surefire-booter:jar:2.12.4:compile
[linux-jdk8]        |        [DEBUG]       org.apache.maven.surefire:surefire-api:jar:2.12.4:compile
[linux-jdk8]        |        [DEBUG]    org.apache.maven.surefire:maven-surefire-common:jar:2.12.4:compile
[linux-jdk8]        |        [DEBUG]       org.apache.commons:commons-lang3:jar:3.1:compile
[linux-jdk8]        |        [DEBUG]       org.apache.maven.shared:maven-common-artifact-filters:jar:1.3:compile
[linux-jdk8]        |        [DEBUG]    org.codehaus.plexus:plexus-utils:jar:3.0.8:compile
[linux-jdk8]        |        [DEBUG]    org.apache.maven:maven-artifact:jar:2.0.9:compile
[linux-jdk8]        |        [DEBUG]    org.apache.maven:maven-project:jar:2.0.9:compile
[linux-jdk8]        |        [DEBUG]       org.apache.maven:maven-settings:jar:2.0.9:compile
[linux-jdk8]        |        [DEBUG]       org.apache.maven:maven-profile:jar:2.0.9:compile
[linux-jdk8]        |        [DEBUG]       org.apache.maven:maven-model:jar:2.0.9:compile
[linux-jdk8]        |        [DEBUG]       org.apache.maven:maven-artifact-manager:jar:2.0.9:compile
[linux-jdk8]        |        [DEBUG]       org.apache.maven:maven-plugin-registry:jar:2.0.9:compile
[linux-jdk8]        |        [DEBUG]       org.codehaus.plexus:plexus-container-default:jar:1.0-alpha-9-stable-1:compile
[linux-jdk8]        |        [DEBUG]          junit:junit:jar:3.8.1:test
[linux-jdk8]        |        [DEBUG]    org.apache.maven:maven-core:jar:2.0.9:compile
[linux-jdk8]        |        [DEBUG]       org.apache.maven:maven-plugin-parameter-documenter:jar:2.0.9:compile
[linux-jdk8]        |        [DEBUG]       org.apache.maven.reporting:maven-reporting-api:jar:2.0.9:compile
[linux-jdk8]        |        [DEBUG]       org.apache.maven:maven-repository-metadata:jar:2.0.9:compile
[linux-jdk8]        |        [DEBUG]       org.apache.maven:maven-error-diagnostics:jar:2.0.9:compile
[linux-jdk8]        |        [DEBUG]       org.apache.maven:maven-plugin-descriptor:jar:2.0.9:compile
[linux-jdk8]        |        [DEBUG]       org.apache.maven:maven-monitor:jar:2.0.9:compile
[linux-jdk8]        |        [DEBUG]       classworlds:classworlds:jar:1.1:compile
[linux-jdk8]        |        [DEBUG]    org.apache.maven:maven-toolchain:jar:2.0.9:compile
[linux-jdk8]        |        [DEBUG]    org.apache.maven.plugin-tools:maven-plugin-annotations:jar:3.1:compile
[linux-jdk8]        |        [DEBUG] Created new class realm plugin>org.apache.maven.plugins:maven-surefire-plugin:2.12.4
[linux-jdk8]        |        [DEBUG] Importing foreign packages into class realm plugin>org.apache.maven.plugins:maven-surefire-plugin:2.12.4
[linux-jdk8]        |        [DEBUG]   Imported:  < maven.api
[linux-jdk8]        |        [DEBUG] Populating class realm plugin>org.apache.maven.plugins:maven-surefire-plugin:2.12.4
[linux-jdk8]        |        [DEBUG]   Included: org.apache.maven.plugins:maven-surefire-plugin:jar:2.12.4
[linux-jdk8]        |        [DEBUG]   Included: org.apache.maven.surefire:surefire-booter:jar:2.12.4
[linux-jdk8]        |        [DEBUG]   Included: org.apache.maven.surefire:surefire-api:jar:2.12.4
[linux-jdk8]        |        [DEBUG]   Included: org.apache.maven.surefire:maven-surefire-common:jar:2.12.4
[linux-jdk8]        |        [DEBUG]   Included: org.apache.commons:commons-lang3:jar:3.1
[linux-jdk8]        |        [DEBUG]   Included: org.apache.maven.shared:maven-common-artifact-filters:jar:1.3
[linux-jdk8]        |        [DEBUG]   Included: org.codehaus.plexus:plexus-utils:jar:3.0.8
[linux-jdk8]        |        [DEBUG]   Included: org.apache.maven.reporting:maven-reporting-api:jar:2.0.9
[linux-jdk8]        |        [DEBUG]   Included: org.apache.maven.plugin-tools:maven-plugin-annotations:jar:3.1
[linux-jdk8]        |        [DEBUG] Configuring mojo org.apache.maven.plugins:maven-surefire-plugin:2.12.4:test
from plugin realm ClassRealm[plugin>org.apache.maven.plugins:maven-surefire-plugin:2.12.4,
parent: sun.misc.Launcher$AppClassLoader@5c647e05]
[linux-jdk8]        |        [DEBUG] Configuring mojo 'org.apache.maven.plugins:maven-surefire-plugin:2.12.4:test'
with basic configurator -->
[linux-jdk8]        |        [DEBUG]   (s) basedir = /home/jenkins/jenkins-slave/workspace/box_maven-pmd-plugin_master-723XUI4HKC5A6CYF5JA2PBPNJGNR6SKD4M55XBOMRDY4Z3ISJGVQ/m/target/it/MPMD-205-pmd-js-check
[linux-jdk8]        |        [DEBUG]   (s) childDelegation = false
[linux-jdk8]        |        [DEBUG]   (s) classesDirectory = /home/jenkins/jenkins-slave/workspace/box_maven-pmd-plugin_master-723XUI4HKC5A6CYF5JA2PBPNJGNR6SKD4M55XBOMRDY4Z3ISJGVQ/m/target/it/MPMD-205-pmd-js-check/target/classes
[linux-jdk8]        |        [DEBUG]   (s) disableXmlReport = false
[linux-jdk8]        |        [DEBUG]   (s) enableAssertions = true
[linux-jdk8]        |        [DEBUG]   (s) forkMode = once
[linux-jdk8]        |        [DEBUG]   (s) junitArtifactName = junit:junit
[linux-jdk8]        |        [DEBUG]   (s) localRepository =       id: local
[linux-jdk8]        |              url: file:///home/jenkins/jenkins-slave/workspace/box_maven-pmd-plugin_master-723XUI4HKC5A6CYF5JA2PBPNJGNR6SKD4M55XBOMRDY4Z3ISJGVQ/m/target/local-repo/
[linux-jdk8]        |           layout: default
[linux-jdk8]        |        snapshots: [enabled => true, update => always]
[linux-jdk8]        |         releases: [enabled => true, update => always]
[linux-jdk8]        |         
[linux-jdk8]        |        [DEBUG]   (f) parallelMavenExecution = false
[linux-jdk8]        |        [DEBUG]   (s) perCoreThreadCount = true
[linux-jdk8]        |        [DEBUG]   (s) pluginArtifactMap = {org.apache.maven.plugins:maven-surefire-plugin=org.apache.maven.plugins:maven-surefire-plugin:maven-plugin:2.12.4:,
org.apache.maven:maven-plugin-api=org.apache.maven:maven-plugin-api:jar:2.0.9:compile, org.apache.maven.surefire:surefire-booter=org.apache.maven.surefire:surefire-booter:jar:2.12.4:compile,
org.apache.maven.surefire:surefire-api=org.apache.maven.surefire:surefire-api:jar:2.12.4:compile,
org.apache.maven.surefire:maven-surefire-common=org.apache.maven.surefire:maven-surefire-common:jar:2.12.4:compile,
org.apache.commons:commons-lang3=org.apache.commons:commons-lang3:jar:3.1:compile, org.apache.maven.shared:maven-common-artifact-filters=org.apache.maven.shared:maven-common-artifact-filters:jar:1.3:compile,
org.codehaus.plexus:plexus-utils=org.codehaus.plexus:plexus-utils:jar:3.0.8:compile, org.apache.maven:maven-artifact=org.apache.maven:maven-artifact:jar:2.0.9:compile,
org.apache.maven:maven-project=org.apache.maven:maven-project:jar:2.0.9:compile, org.apache.maven:maven-settings=org.apache.maven:maven-settings:jar:2.0.9:compile,
org.apache.maven:maven-profile=org.apache.maven:maven-profile:jar:2.0.9:compile, org.apache.maven:maven-model=org.apache.maven:maven-model:jar:2.0.9:compile,
org.apache.maven:maven-artifact-manager=org.apache.maven:maven-artifact-manager:jar:2.0.9:compile,
org.apache.maven:maven-plugin-registry=org.apache.maven:maven-plugin-registry:jar:2.0.9:compile,
org.codehaus.plexus:plexus-container-default=org.codehaus.plexus:plexus-container-default:jar:1.0-alpha-9-stable-1:compile,
org.apache.maven:maven-core=org.apache.maven:maven-core:jar:2.0.9:compile, org.apache.maven:maven-plugin-parameter-documenter=org.apache.maven:maven-plugin-parameter-documenter:jar:2.0.9:compile,
org.apache.maven.reporting:maven-reporting-api=org.apache.maven.reporting:maven-reporting-api:jar:2.0.9:compile,
org.apache.maven:maven-repository-metadata=org.apache.maven:maven-repository-metadata:jar:2.0.9:compile,
org.apache.maven:maven-error-diagnostics=org.apache.maven:maven-error-diagnostics:jar:2.0.9:compile,
org.apache.maven:maven-plugin-descriptor=org.apache.maven:maven-plugin-descriptor:jar:2.0.9:compile,
org.apache.maven:maven-monitor=org.apache.maven:maven-monitor:jar:2.0.9:compile, classworlds:classworlds=classworlds:classworlds:jar:1.1:compile,
org.apache.maven:maven-toolchain=org.apache.maven:maven-toolchain:jar:2.0.9:compile, org.apache.maven.plugin-tools:maven-plugin-annotations=org.apache.maven.plugin-tools:maven-plugin-annotations:jar:3.1:compile}
[linux-jdk8]        |        [DEBUG]   (f) pluginDescriptor = Component Descriptor: role:
'org.apache.maven.plugin.Mojo', implementation: 'org.apache.maven.plugin.surefire.HelpMojo',
role hint: 'org.apache.maven.plugins:maven-surefire-plugin:2.12.4:help'
[linux-jdk8]        |        role: 'org.apache.maven.plugin.Mojo', implementation: 'org.apache.maven.plugin.surefire.SurefirePlugin',
role hint: 'org.apache.maven.plugins:maven-surefire-plugin:2.12.4:test'
[linux-jdk8]        |        ---
[linux-jdk8]        |        [DEBUG]   (s) printSummary = true
[linux-jdk8]        |        [DEBUG]   (s) projectArtifactMap = {}
[linux-jdk8]        |        [DEBUG]   (s) redirectTestOutputToFile = false
[linux-jdk8]        |        [DEBUG]   (s) remoteRepositories = [      id: local.central
[linux-jdk8]        |              url: file:///home/jenkins/jenkins-slave/workspace/box_maven-pmd-plugin_master-723XUI4HKC5A6CYF5JA2PBPNJGNR6SKD4M55XBOMRDY4Z3ISJGVQ/.repository
[linux-jdk8]        |           layout: default
[linux-jdk8]        |        snapshots: [enabled => true, update => daily]
[linux-jdk8]        |         releases: [enabled => true, update => daily]
[linux-jdk8]        |        ,       id: central
[linux-jdk8]        |              url: https://repo.maven.apache.org/maven2
[linux-jdk8]        |           layout: default
[linux-jdk8]        |        snapshots: [enabled => false, update => daily]
[linux-jdk8]        |         releases: [enabled => true, update => never]
[linux-jdk8]        |        ]
[linux-jdk8]        |        [DEBUG]   (s) reportFormat = brief
[linux-jdk8]        |        [DEBUG]   (s) reportsDirectory = /home/jenkins/jenkins-slave/workspace/box_maven-pmd-plugin_master-723XUI4HKC5A6CYF5JA2PBPNJGNR6SKD4M55XBOMRDY4Z3ISJGVQ/m/target/it/MPMD-205-pmd-js-check/target/surefire-reports
[linux-jdk8]        |        [DEBUG]   (s) runOrder = filesystem
[linux-jdk8]        |        [DEBUG]   (s) skip = false
[linux-jdk8]        |        [DEBUG]   (s) skipTests = false
[linux-jdk8]        |        [DEBUG]   (s) testClassesDirectory = /home/jenkins/jenkins-slave/workspace/box_maven-pmd-plugin_master-723XUI4HKC5A6CYF5JA2PBPNJGNR6SKD4M55XBOMRDY4Z3ISJGVQ/m/target/it/MPMD-205-pmd-js-check/target/test-classes
[linux-jdk8]        |        [DEBUG]   (s) testFailureIgnore = false
[linux-jdk8]        |        [DEBUG]   (s) testNGArtifactName = org.testng:testng
[linux-jdk8]        |        [DEBUG]   (s) testSourceDirectory = /home/jenkins/jenkins-slave/workspace/box_maven-pmd-plugin_master-723XUI4HKC5A6CYF5JA2PBPNJGNR6SKD4M55XBOMRDY4Z3ISJGVQ/m/target/it/MPMD-205-pmd-js-check/src/test/java
[linux-jdk8]        |        [DEBUG]   (s) trimStackTrace = true
[linux-jdk8]        |        [DEBUG]   (s) useFile = true
[linux-jdk8]        |        [DEBUG]   (s) useManifestOnlyJar = true
[linux-jdk8]        |        [DEBUG]   (s) useSystemClassLoader = true
[linux-jdk8]        |        [DEBUG]   (s) useUnlimitedThreads = false
[linux-jdk8]        |        [DEBUG]   (s) workingDirectory = /home/jenkins/jenkins-slave/workspace/box_maven-pmd-plugin_master-723XUI4HKC5A6CYF5JA2PBPNJGNR6SKD4M55XBOMRDY4Z3ISJGVQ/m/target/it/MPMD-205-pmd-js-check
[linux-jdk8]        |        [DEBUG]   (s) project = MavenProject: org.apache.maven.plugins.pmd.its:MPMD-205-pmd-js-check:1.0-SNAPSHOT
@ /home/jenkins/jenkins-slave/workspace/box_maven-pmd-plugin_master-723XUI4HKC5A6CYF5JA2PBPNJGNR6SKD4M55XBOMRDY4Z3ISJGVQ/m/target/it/MPMD-205-pmd-js-check/pom.xml
[linux-jdk8]        |        [DEBUG]   (s) session = org.apache.maven.execution.MavenSession@7551da2a
[linux-jdk8]        |        [DEBUG] -- end configuration --
[linux-jdk8]        |        [INFO] No tests to run.
[linux-jdk8]        |        [INFO] 
[linux-jdk8]        |        [INFO] --- maven-jar-plugin:2.4:jar (default-jar) @ MPMD-205-pmd-js-check
---
[linux-jdk8]        |        [DEBUG] Dependency collection stats: {ConflictMarker.analyzeTime=169889,
ConflictMarker.markTime=84758, ConflictMarker.nodeCount=74, ConflictIdSorter.graphTime=62087,
ConflictIdSorter.topsortTime=50143, ConflictIdSorter.conflictIdCount=28, ConflictIdSorter.conflictIdCycleCount=0,
ConflictResolver.totalTime=1376524, ConflictResolver.conflictItemCount=70, DefaultDependencyCollector.collectTime=23857908,
DefaultDependencyCollector.transformTime=1791699}
[linux-jdk8]        |        [DEBUG] org.apache.maven.plugins:maven-jar-plugin:jar:2.4:
[linux-jdk8]        |        [DEBUG]    org.apache.maven:maven-plugin-api:jar:2.0.6:compile
[linux-jdk8]        |        [DEBUG]    org.apache.maven:maven-project:jar:2.0.6:compile
[linux-jdk8]        |        [DEBUG]       org.apache.maven:maven-settings:jar:2.0.6:compile
[linux-jdk8]        |        [DEBUG]       org.apache.maven:maven-profile:jar:2.0.6:compile
[linux-jdk8]        |        [DEBUG]       org.apache.maven:maven-artifact-manager:jar:2.0.6:compile
[linux-jdk8]        |        [DEBUG]          org.apache.maven:maven-repository-metadata:jar:2.0.6:compile
[linux-jdk8]        |        [DEBUG]       org.apache.maven:maven-plugin-registry:jar:2.0.6:compile
[linux-jdk8]        |        [DEBUG]       org.codehaus.plexus:plexus-container-default:jar:1.0-alpha-9-stable-1:compile
[linux-jdk8]        |        [DEBUG]          junit:junit:jar:3.8.1:compile
[linux-jdk8]        |        [DEBUG]          classworlds:classworlds:jar:1.1-alpha-2:compile
[linux-jdk8]        |        [DEBUG]    org.apache.maven:maven-model:jar:2.0.6:runtime
[linux-jdk8]        |        [DEBUG]    org.apache.maven:maven-artifact:jar:2.0.6:compile
[linux-jdk8]        |        [DEBUG]    org.apache.maven:maven-archiver:jar:2.5:compile
[linux-jdk8]        |        [DEBUG]       org.apache.maven:maven-core:jar:2.0.6:compile
[linux-jdk8]        |        [DEBUG]          org.apache.maven:maven-plugin-parameter-documenter:jar:2.0.6:compile
[linux-jdk8]        |        [DEBUG]          org.apache.maven.reporting:maven-reporting-api:jar:2.0.6:compile
[linux-jdk8]        |        [DEBUG]             org.apache.maven.doxia:doxia-sink-api:jar:1.0-alpha-7:compile
[linux-jdk8]        |        [DEBUG]          org.apache.maven:maven-error-diagnostics:jar:2.0.6:compile
[linux-jdk8]        |        [DEBUG]          commons-cli:commons-cli:jar:1.0:compile
[linux-jdk8]        |        [DEBUG]          org.apache.maven:maven-plugin-descriptor:jar:2.0.6:compile
[linux-jdk8]        |        [DEBUG]          org.codehaus.plexus:plexus-interactivity-api:jar:1.0-alpha-4:compile
[linux-jdk8]        |        [DEBUG]          org.apache.maven:maven-monitor:jar:2.0.6:compile
[linux-jdk8]        |        [DEBUG]       org.codehaus.plexus:plexus-interpolation:jar:1.15:compile
[linux-jdk8]        |        [DEBUG]    org.codehaus.plexus:plexus-archiver:jar:2.1:compile
[linux-jdk8]        |        [DEBUG]       org.codehaus.plexus:plexus-io:jar:2.0.2:compile
[linux-jdk8]        |        [DEBUG]    commons-lang:commons-lang:jar:2.1:compile
[linux-jdk8]        |        [DEBUG]    org.codehaus.plexus:plexus-utils:jar:3.0:compile
[linux-jdk8]        |        [DEBUG] Created new class realm plugin>org.apache.maven.plugins:maven-jar-plugin:2.4
[linux-jdk8]        |        [DEBUG] Importing foreign packages into class realm plugin>org.apache.maven.plugins:maven-jar-plugin:2.4
[linux-jdk8]        |        [DEBUG]   Imported:  < maven.api
[linux-jdk8]        |        [DEBUG] Populating class realm plugin>org.apache.maven.plugins:maven-jar-plugin:2.4
[linux-jdk8]        |        [DEBUG]   Included: org.apache.maven.plugins:maven-jar-plugin:jar:2.4
[linux-jdk8]        |        [DEBUG]   Included: junit:junit:jar:3.8.1
[linux-jdk8]        |        [DEBUG]   Included: org.apache.maven:maven-archiver:jar:2.5
[linux-jdk8]        |        [DEBUG]   Included: org.apache.maven.reporting:maven-reporting-api:jar:2.0.6
[linux-jdk8]        |        [DEBUG]   Included: org.apache.maven.doxia:doxia-sink-api:jar:1.0-alpha-7
[linux-jdk8]        |        [DEBUG]   Included: commons-cli:commons-cli:jar:1.0
[linux-jdk8]        |        [DEBUG]   Included: org.codehaus.plexus:plexus-interactivity-api:jar:1.0-alpha-4
[linux-jdk8]        |        [DEBUG]   Included: org.codehaus.plexus:plexus-interpolation:jar:1.15
[linux-jdk8]        |        [DEBUG]   Included: org.codehaus.plexus:plexus-archiver:jar:2.1
[linux-jdk8]        |        [DEBUG]   Included: org.codehaus.plexus:plexus-io:jar:2.0.2
[linux-jdk8]        |        [DEBUG]   Included: commons-lang:commons-lang:jar:2.1
[linux-jdk8]        |        [DEBUG]   Included: org.codehaus.plexus:plexus-utils:jar:3.0
[linux-jdk8]        |        Running post-build script: /home/jenkins/jenkins-slave/workspace/box_maven-pmd-plugin_master-723XUI4HKC5A6CYF5JA2PBPNJGNR6SKD4M55XBOMRDY4Z3ISJGVQ/m/target/it/MPMD-205-pmd-js-check/verify.groovy
[linux-jdk8]        /home/jenkins/jenkins-slave/workspace/box_maven-pmd-plugin_master-723XUI4HKC5A6CYF5JA2PBPNJGNR6SKD4M55XBOMRDY4Z3ISJGVQ/m/target/it/MPMD-205-pmd-js-check/build.log
[linux-jdk8] [INFO] Building: MPMD-219-pmd-processing-error/pom.xml
[linux-jdk8] Terminated
[linux-jdk8] [INFO] run post-build script verify.groovy
[linux-jdk9] [INFO]           MPMD-182/pom.xml ................................. FAILED (1.1
s)
[linux-jdk9] [INFO]   The build exited with code 143. See /home/jenkins/jenkins-slave/workspace/box_maven-pmd-plugin_master-723XUI4HKC5A6CYF5JA2PBPNJGNR6SKD4M55XBOMRDY4Z3ISJGVQ@2/m/target/it/MPMD-182/build.log
for details.
[linux-jdk9] [INFO] Building: multi-module/pom.xml
[linux-jdk9] Terminated
[linux-jdk9] [INFO] run post-build script verify.bsh
[linux-jdk10]  > git config remote.origin.url https://gitbox.apache.org/repos/asf/maven-pmd-plugin.git
# timeout=10
[linux-jdk10]  > git config --add remote.origin.fetch +refs/heads/*:refs/remotes/origin/*
# timeout=10
[linux-jdk10]  > git config remote.origin.url https://gitbox.apache.org/repos/asf/maven-pmd-plugin.git
# timeout=10
[linux-jdk10] Fetching without tags
[linux-jdk10] Fetching upstream changes from https://gitbox.apache.org/repos/asf/maven-pmd-plugin.git
[linux-jdk10]  > git fetch --no-tags --progress https://gitbox.apache.org/repos/asf/maven-pmd-plugin.git
+refs/heads/*:refs/remotes/origin/*
[windows-jdk8] Sending interrupt signal to process
[Pipeline] [linux-jdk8] }
[Pipeline] [linux-jdk9] }
[Pipeline] [linux-jdk10] }
[Pipeline] [linux-jdk8] // dir
[Pipeline] [linux-jdk9] // dir
[Pipeline] [linux-jdk10] // dir
[Pipeline] [linux-jdk8] }
[linux-jdk8] [withMaven] One or multiple Maven executions have been ignored by the Jenkins
Pipeline Maven Plugin because they have been interrupted before completion (1). See Pipeline
Maven Plugin FAQ for more details.
[Pipeline] [linux-jdk9] }
[linux-jdk9] [withMaven] One or multiple Maven executions have been ignored by the Jenkins
Pipeline Maven Plugin because they have been interrupted before completion (1). See Pipeline
Maven Plugin FAQ for more details.
[Pipeline] [linux-jdk10] echo
[linux-jdk10] [FAIL FAST] windows-jdk9 had first failure, ignoring null
[Pipeline] [linux-jdk10] }
[Pipeline] [linux-jdk8] // withMaven
[Pipeline] [linux-jdk9] // withMaven
[Pipeline] [linux-jdk10] // stage
[Pipeline] [windows-jdk8] }
[Pipeline] [linux-jdk8] echo
[linux-jdk8] [FAIL FAST] windows-jdk9 had first failure, ignoring script returned exit code
143
[Pipeline] [linux-jdk8] }
[Pipeline] [linux-jdk9] echo
[linux-jdk9] [FAIL FAST] windows-jdk9 had first failure, ignoring script returned exit code
143
[Pipeline] [linux-jdk9] }
[Pipeline] [linux-jdk10] stage
[Pipeline] [linux-jdk10] { (Build linux-jdk10)
[Pipeline] [linux-jdk10] echo
[linux-jdk10] [FAIL FAST] windows-jdk9 has failed. Skipping linux-jdk10.
[Pipeline] [linux-jdk10] }
[Pipeline] [windows-jdk8] // dir
[Pipeline] [linux-jdk8] // stage
[Pipeline] [linux-jdk9] // stage
[Pipeline] [windows-jdk8] }
[windows-jdk8] [withMaven] One or multiple Maven executions have been ignored by the Jenkins
Pipeline Maven Plugin because they have been interrupted before completion (1). See Pipeline
Maven Plugin FAQ for more details.
[Pipeline] [linux-jdk8] }
[Pipeline] [linux-jdk9] }
[Pipeline] [linux-jdk10] // stage
[Pipeline] [linux-jdk10] }
[Pipeline] [windows-jdk8] // withMaven
[Pipeline] [linux-jdk8] // node
[Pipeline] [linux-jdk9] // node
[Pipeline] [linux-jdk8] }
[Pipeline] [linux-jdk9] }
[Pipeline] [windows-jdk8] echo
[windows-jdk8] [FAIL FAST] windows-jdk9 had first failure, ignoring script returned exit code
-1
[Pipeline] [windows-jdk8] }
[Pipeline] [linux-jdk10] // node
[Pipeline] [linux-jdk10] }
[Pipeline] [windows-jdk8] // stage
[Pipeline] [windows-jdk8] }
[Pipeline] [windows-jdk8] // node
[Pipeline] [windows-jdk8] }
[Pipeline] // parallel
[Pipeline] echo
***** FAST FAILURE *****

Fast failure triggered by windows-jdk9

***** FAST FAILURE *****
[Pipeline] stage
[Pipeline] { (Notifications)
[Pipeline] echo
Build result: FAILURE
[Pipeline] jiraIssueSelector
Mime
  • Unnamed multipart/mixed (inline, None, 0 bytes)
View raw message