maven-notifications mailing list archives

Site index · List index
Message view « Date » · « Thread »
Top « Date » · « Thread »
From Apache Jenkins Server <jenk...@builds.apache.org>
Subject Build failed in Jenkins: Maven TLP » maven-enforcer » master #19
Date Mon, 11 Jun 2018 18:09:24 GMT
See https://builds.apache.org/job/maven-box/job/maven-enforcer/job/master/19/

Changes:

* enable TLS 1.2 for Java 7

No tests ran.

Build log:
[...truncated 2.04 MB...]
[windows-jdk9] [debug] Parent cannot be a release: testGroupId:release:jar:1.0
[windows-jdk9] [debug] This project cannot be a release:testGroupId:release:jar:1.0
[windows-jdk9] [INFO] Tests run: 3, Failures: 0, Errors: 0, Skipped: 0, Time elapsed: 0 s
- in org.apache.maven.plugins.enforcer.TestRequireSnapshotVersion
[windows-jdk9] [INFO] Running org.apache.maven.plugins.enforcer.utils.TestArtifactMatcher
[windows-jdk9] [INFO] Tests run: 3, Failures: 0, Errors: 0, Skipped: 0, Time elapsed: 0 s
- in org.apache.maven.plugins.enforcer.utils.TestArtifactMatcher
[windows-jdk9] [INFO] Running org.apache.maven.plugins.enforcer.utils.TestMockEnforcerExpressionEvaluator
[windows-jdk9] [INFO] Tests run: 1, Failures: 0, Errors: 0, Skipped: 0, Time elapsed: 0 s
- in org.apache.maven.plugins.enforcer.utils.TestMockEnforcerExpressionEvaluator
[windows-jdk9] [INFO] 
[windows-jdk9] [INFO] Results:
[windows-jdk9] [INFO] 
[windows-jdk9] [WARNING] Tests run: 158, Failures: 0, Errors: 0, Skipped: 1
[windows-jdk9] [INFO] 
[windows-jdk9] [INFO] 
[windows-jdk9] [INFO] --- maven-jar-plugin:3.0.2:jar (default-jar) @ enforcer-rules ---
[windows-jdk9] [INFO] Building jar: F:\jenkins\jenkins-slave\workspace\n-box_maven-enforcer_master-KHI64AG3D4VZKUKLMNAYHKONI5AIQBLJ5ZKYGGSW7DAZVXCJBFHQ@2\m\enforcer-rules\target\enforcer-rules-3.0.0-SNAPSHOT.jar
[windows-jdk9] [INFO] 
[windows-jdk9] [INFO] --- maven-site-plugin:3.7:attach-descriptor (attach-descriptor) @ enforcer-rules
---
[windows-jdk9] [INFO] Skipping because packaging 'jar' is not pom.
[windows-jdk9] [INFO] 
[windows-jdk9] [INFO] --- maven-jar-plugin:3.0.2:test-jar (default) @ enforcer-rules ---
[windows-jdk9] [INFO] Building jar: F:\jenkins\jenkins-slave\workspace\n-box_maven-enforcer_master-KHI64AG3D4VZKUKLMNAYHKONI5AIQBLJ5ZKYGGSW7DAZVXCJBFHQ@2\m\enforcer-rules\target\enforcer-rules-3.0.0-SNAPSHOT-tests.jar
[windows-jdk9] [INFO] 
[windows-jdk9] [INFO] --- maven-checkstyle-plugin:3.0.0:check (checkstyle-check) @ enforcer-rules
---
[windows-jdk7] [INFO] Tests run: 8, Failures: 0, Errors: 0, Skipped: 0, Time elapsed: 2.857
s - in org.apache.maven.plugins.enforcer.BanDistributionManagementTest
[windows-jdk7] [INFO] Running org.apache.maven.plugins.enforcer.ReactorModuleConvergenceTest
[windows-jdk7] [INFO] Tests run: 9, Failures: 0, Errors: 0, Skipped: 0, Time elapsed: 0.386
s - in org.apache.maven.plugins.enforcer.ReactorModuleConvergenceTest
[windows-jdk7] [INFO] Running org.apache.maven.plugins.enforcer.RequireActiveProfileTest
[windows-jdk7] [INFO] Tests run: 9, Failures: 0, Errors: 0, Skipped: 0, Time elapsed: 0.004
s - in org.apache.maven.plugins.enforcer.RequireActiveProfileTest
[windows-jdk7] [INFO] Running org.apache.maven.plugins.enforcer.RequirePrerequisiteTest
[windows-jdk7] [INFO] Tests run: 9, Failures: 0, Errors: 0, Skipped: 0, Time elapsed: 0.034
s - in org.apache.maven.plugins.enforcer.RequirePrerequisiteTest
[windows-jdk7] [INFO] Running org.apache.maven.plugins.enforcer.TestAbstractVersionEnforcer
[windows-jdk7] [debug] Detected test Version: 2.0.5 is allowed in the range [2.0.5,).
[windows-jdk7] [debug] Detected test Version: 2.0.5 is allowed in the range [2.0.4,).
[windows-jdk7] [debug] Detected test Version: 2.0.5 is allowed in the range [2.0.4,2.0.5].
[windows-jdk7] [debug] Detected test Version: 2.0.5 is allowed in the range [2.0.4,2.0.6].
[windows-jdk7] [debug] Detected test Version: 2.0.5 is allowed in the range [2.0.4,2.0.6).
[windows-jdk7] [debug] Detected test Version: 2.0.5 is allowed in the range [2.0,).
[windows-jdk7] [debug] Detected test Version: 2.0.5 is allowed in the range [2.0.0,).
[windows-jdk7] [debug] Detected test Version: 2.0.5 is allowed in the range 2.0.
[windows-jdk7] [debug] Detected test Version: 2.0.5 is allowed in the range 2.0.4.
[windows-jdk7] [debug] Detected test Version: 2.0.5 is allowed in the range 2.0.5.
[windows-jdk7] [INFO] Tests run: 2, Failures: 0, Errors: 0, Skipped: 0, Time elapsed: 0.013
s - in org.apache.maven.plugins.enforcer.TestAbstractVersionEnforcer
[windows-jdk7] [INFO] Running org.apache.maven.plugins.enforcer.TestAlwaysFail
[windows-jdk7] [INFO] Tests run: 1, Failures: 0, Errors: 0, Skipped: 0, Time elapsed: 0.384
s - in org.apache.maven.plugins.enforcer.TestAlwaysFail
[windows-jdk7] [INFO] Running org.apache.maven.plugins.enforcer.TestAlwaysPass
[windows-jdk7] [info] Always pass!
[windows-jdk7] [INFO] Tests run: 1, Failures: 0, Errors: 0, Skipped: 0, Time elapsed: 0.001
s - in org.apache.maven.plugins.enforcer.TestAlwaysPass
[windows-jdk7] [INFO] Running org.apache.maven.plugins.enforcer.TestBannedDependencies
[windows-jdk7] [INFO] Tests run: 21, Failures: 0, Errors: 0, Skipped: 0, Time elapsed: 0.065
s - in org.apache.maven.plugins.enforcer.TestBannedDependencies
[windows-jdk7] [INFO] Running org.apache.maven.plugins.enforcer.TestBannedRepositories
[windows-jdk7] [INFO] Tests run: 4, Failures: 0, Errors: 0, Skipped: 0, Time elapsed: 0.006
s - in org.apache.maven.plugins.enforcer.TestBannedRepositories
[windows-jdk7] [INFO] Running org.apache.maven.plugins.enforcer.TestEvaluateBeanshell
[windows-jdk7] [debug] Echo condition : ${env} == null
[windows-jdk7] [debug] Echo script : "This is a test." == null
[windows-jdk7] [debug] Echo evaluating : false
[windows-jdk7] [debug] Echo condition : this is not valid beanshell
[windows-jdk7] [debug] Echo script : this is not valid beanshell
[windows-jdk7] [debug] Echo condition : ${env} == null
[windows-jdk7] [debug] Echo condition : ${env} == null
[windows-jdk7] [debug] Echo script : "This is a test." == null
[windows-jdk7] [debug] Echo evaluating : false
[windows-jdk7] [debug] Echo condition : ${env} == "This is a test."
[windows-jdk7] [debug] Echo script : "This is a test." == "This is a test."
[windows-jdk7] [debug] Echo evaluating : true
[windows-jdk7] [INFO] Tests run: 5, Failures: 0, Errors: 0, Skipped: 0, Time elapsed: 0.104
s - in org.apache.maven.plugins.enforcer.TestEvaluateBeanshell
[windows-jdk7] [INFO] Running org.apache.maven.plugins.enforcer.TestMavenVersion
[windows-jdk7] [debug] Detected Maven Version: 3.0
[windows-jdk7] [debug] Detected Maven Version: 3.0 is allowed in the range 2.0.5.
[windows-jdk7] [debug] Detected Maven Version: 3.0
[windows-jdk7] [debug] Detected Maven Version: 3.0
[windows-jdk7] [debug] Detected Maven Version: 3.0 is allowed in the range 2.0.5_01.
[windows-jdk7] [INFO] Tests run: 2, Failures: 0, Errors: 0, Skipped: 0, Time elapsed: 0 s
- in org.apache.maven.plugins.enforcer.TestMavenVersion
[windows-jdk7] [INFO] Running org.apache.maven.plugins.enforcer.TestRequireEnvironmentVariable
[windows-jdk7] [INFO] Tests run: 2, Failures: 0, Errors: 0, Skipped: 0, Time elapsed: 0 s
- in org.apache.maven.plugins.enforcer.TestRequireEnvironmentVariable
[windows-jdk7] [INFO] Running org.apache.maven.plugins.enforcer.TestRequireFileChecksum
[windows-jdk7] Sending interrupt signal to process
[linux-jdk9] [INFO] /home/jenkins/jenkins-slave/workspace/n-box_maven-enforcer_master-KHI64AG3D4VZKUKLMNAYHKONI5AIQBLJ5ZKYGGSW7DAZVXCJBFHQ/m/enforcer-rules/src/main/java/org/apache/maven/plugins/enforcer/DependencyConvergence.java:
Some input files use or override a deprecated API.
[linux-jdk9] [INFO] /home/jenkins/jenkins-slave/workspace/n-box_maven-enforcer_master-KHI64AG3D4VZKUKLMNAYHKONI5AIQBLJ5ZKYGGSW7DAZVXCJBFHQ/m/enforcer-rules/src/main/java/org/apache/maven/plugins/enforcer/DependencyConvergence.java:
Recompile with -Xlint:deprecation for details.
[linux-jdk9] [INFO] /home/jenkins/jenkins-slave/workspace/n-box_maven-enforcer_master-KHI64AG3D4VZKUKLMNAYHKONI5AIQBLJ5ZKYGGSW7DAZVXCJBFHQ/m/enforcer-rules/src/main/java/org/apache/maven/plugins/enforcer/RequirePluginVersions.java:
/home/jenkins/jenkins-slave/workspace/n-box_maven-enforcer_master-KHI64AG3D4VZKUKLMNAYHKONI5AIQBLJ5ZKYGGSW7DAZVXCJBFHQ/m/enforcer-rules/src/main/java/org/apache/maven/plugins/enforcer/RequirePluginVersions.java
uses unchecked or unsafe operations.
[linux-jdk9] [INFO] /home/jenkins/jenkins-slave/workspace/n-box_maven-enforcer_master-KHI64AG3D4VZKUKLMNAYHKONI5AIQBLJ5ZKYGGSW7DAZVXCJBFHQ/m/enforcer-rules/src/main/java/org/apache/maven/plugins/enforcer/RequirePluginVersions.java:
Recompile with -Xlint:unchecked for details.
[linux-jdk9] [INFO] 
[linux-jdk9] [INFO] --- maven-resources-plugin:3.0.2:testResources (default-testResources)
@ enforcer-rules ---
[linux-jdk9] [INFO] Using 'UTF-8' encoding to copy filtered resources.
[linux-jdk9] [INFO] Copying 11 resources
[linux-jdk9] [INFO] Copying 3 resources
[linux-jdk9] [INFO] 
[linux-jdk9] [INFO] --- maven-compiler-plugin:3.7.0:testCompile (default-testCompile) @ enforcer-rules
---
[linux-jdk9] [INFO] Changes detected - recompiling the module!
[linux-jdk9] [INFO] Compiling 34 source files to /home/jenkins/jenkins-slave/workspace/n-box_maven-enforcer_master-KHI64AG3D4VZKUKLMNAYHKONI5AIQBLJ5ZKYGGSW7DAZVXCJBFHQ/m/enforcer-rules/target/test-classes
[windows-jdk7] [INFO] Tests run: 12, Failures: 0, Errors: 0, Skipped: 0, Time elapsed: 0.138
s - in org.apache.maven.plugins.enforcer.TestRequireFileChecksum
[windows-jdk7] [INFO] Running org.apache.maven.plugins.enforcer.TestRequireFilesDontExist
[windows-jdk7] [INFO] Tests run: 7, Failures: 0, Errors: 0, Skipped: 0, Time elapsed: 0.012
s - in org.apache.maven.plugins.enforcer.TestRequireFilesDontExist
[windows-jdk7] [INFO] Running org.apache.maven.plugins.enforcer.TestRequireFilesExist
[windows-jdk7] [INFO] Tests run: 7, Failures: 0, Errors: 0, Skipped: 0, Time elapsed: 0.005
s - in org.apache.maven.plugins.enforcer.TestRequireFilesExist
[windows-jdk7] [INFO] Running org.apache.maven.plugins.enforcer.TestRequireFilesSize
[windows-jdk7] [debug] C:\Users\jenkins\AppData\Local\Temp\1\enforcer7695028793140960738tmp
size (0) is OK (max. 10000 byte).
[windows-jdk7] [debug] C:\Users\jenkins\AppData\Local\Temp\1\enforcer8137497273800262726tmp
size (0) is OK (max. 10000 byte).
[windows-jdk7] [INFO] Tests run: 8, Failures: 0, Errors: 0, Skipped: 0, Time elapsed: 0.01
s - in org.apache.maven.plugins.enforcer.TestRequireFilesSize
[windows-jdk7] [INFO] Running org.apache.maven.plugins.enforcer.TestRequireJavaVersion
[windows-jdk7] [debug] Detected Java String: '1.7.0_79'
[windows-jdk7] [debug] Normalized Java String: '1.7.0-79'
[windows-jdk7] [debug] Parsed Version: Major: 1 Minor: 7 Incremental: 0 Build: 79 Qualifier:
null
[windows-jdk7] [debug] Detected JDK Version: 1.7.0-79 is allowed in the range 1.7.0-79.
[windows-jdk7] [debug] Detected Java String: '1.7.0_79'
[windows-jdk7] [debug] Normalized Java String: '1.7.0-79'
[windows-jdk7] [debug] Parsed Version: Major: 1 Minor: 7 Incremental: 0 Build: 79 Qualifier:
null
[windows-jdk7] [WARNING] Tests run: 5, Failures: 0, Errors: 0, Skipped: 1, Time elapsed: 0.11
s - in org.apache.maven.plugins.enforcer.TestRequireJavaVersion
[windows-jdk7] [INFO] Running org.apache.maven.plugins.enforcer.TestRequireNoRepositories
[windows-jdk8] Sending interrupt signal to process
[windows-jdk9] Sending interrupt signal to process
[windows-jdk9] [INFO] There is 1 error reported by Checkstyle 6.18 with config/maven_checks.xml
ruleset.
[windows-jdk9] [INFO] Ignored 1 error, 0 violation remaining.
[windows-jdk9] [INFO] 
[windows-jdk9] [INFO] ------------------------------------------------------------------------
[windows-jdk9] [INFO] Building Apache Maven Enforcer Plugin 3.0.0-SNAPSHOT
[windows-jdk9] [INFO] ------------------------------------------------------------------------
[windows-jdk9] [INFO] Downloading: https://repo.maven.apache.org/maven2/org/apache/maven/plugins/maven-plugin-plugin/3.5.1/maven-plugin-plugin-3.5.1.pom
[windows-jdk9] [INFO] Downloaded: https://repo.maven.apache.org/maven2/org/apache/maven/plugins/maven-plugin-plugin/3.5.1/maven-plugin-plugin-3.5.1.pom
(14 kB at 448 kB/s)
[windows-jdk9] [INFO] Downloading: https://repo.maven.apache.org/maven2/org/apache/maven/plugin-tools/maven-plugin-tools/3.5.1/maven-plugin-tools-3.5.1.pom
[windows-jdk9] [INFO] Downloaded: https://repo.maven.apache.org/maven2/org/apache/maven/plugin-tools/maven-plugin-tools/3.5.1/maven-plugin-tools-3.5.1.pom
(16 kB at 1.7 MB/s)
[windows-jdk9] [INFO] Downloading: https://repo.maven.apache.org/maven2/org/apache/maven/plugins/maven-plugin-plugin/3.5.1/maven-plugin-plugin-3.5.1.jar
[windows-jdk9] [INFO] Downloaded: https://repo.maven.apache.org/maven2/org/apache/maven/plugins/maven-plugin-plugin/3.5.1/maven-plugin-plugin-3.5.1.jar
(57 kB at 1.8 MB/s)
[windows-jdk9] [INFO] Downloading: https://repo.maven.apache.org/maven2/org/apache/maven/plugins/maven-invoker-plugin/3.0.1/maven-invoker-plugin-3.0.1.pom
[windows-jdk9] [INFO] Downloaded: https://repo.maven.apache.org/maven2/org/apache/maven/plugins/maven-invoker-plugin/3.0.1/maven-invoker-plugin-3.0.1.pom
(14 kB at 1.4 MB/s)
[windows-jdk9] [INFO] Downloading: https://repo.maven.apache.org/maven2/org/apache/maven/plugins/maven-invoker-plugin/3.0.1/maven-invoker-plugin-3.0.1.jar
[windows-jdk9] [INFO] Downloaded: https://repo.maven.apache.org/maven2/org/apache/maven/plugins/maven-invoker-plugin/3.0.1/maven-invoker-plugin-3.0.1.jar
(112 kB at 5.9 MB/s)
[windows-jdk9] [INFO] Downloading: https://repo.maven.apache.org/maven2/org/codehaus/mojo/mrm-maven-plugin/1.0.0/mrm-maven-plugin-1.0.0.pom
[windows-jdk9] [INFO] Downloaded: https://repo.maven.apache.org/maven2/org/codehaus/mojo/mrm-maven-plugin/1.0.0/mrm-maven-plugin-1.0.0.pom
(4.1 kB at 513 kB/s)
[windows-jdk9] [INFO] Downloading: https://repo.maven.apache.org/maven2/org/codehaus/mojo/mrm/1.0.0/mrm-1.0.0.pom
[windows-jdk9] [INFO] Downloaded: https://repo.maven.apache.org/maven2/org/codehaus/mojo/mrm/1.0.0/mrm-1.0.0.pom
(10 kB at 1.4 MB/s)
[windows-jdk9] [INFO] Downloading: https://repo.maven.apache.org/maven2/org/codehaus/mojo/mojo-parent/39/mojo-parent-39.pom
[windows-jdk9] [INFO] Downloaded: https://repo.maven.apache.org/maven2/org/codehaus/mojo/mojo-parent/39/mojo-parent-39.pom
(34 kB at 3.8 MB/s)
[windows-jdk9] [INFO] Downloading: https://repo.maven.apache.org/maven2/org/codehaus/mojo/mrm-maven-plugin/1.0.0/mrm-maven-plugin-1.0.0.jar
[windows-jdk9] [INFO] Downloaded: https://repo.maven.apache.org/maven2/org/codehaus/mojo/mrm-maven-plugin/1.0.0/mrm-maven-plugin-1.0.0.jar
(36 kB at 3.6 MB/s)
[windows-jdk9] [INFO] Downloading: https://repo.maven.apache.org/maven2/org/apache/maven/plugin-tools/maven-plugin-annotations/3.5.1/maven-plugin-annotations-3.5.1.pom
[windows-jdk9] [INFO] Downloaded: https://repo.maven.apache.org/maven2/org/apache/maven/plugin-tools/maven-plugin-annotations/3.5.1/maven-plugin-annotations-3.5.1.pom
(1.6 kB at 45 kB/s)
[windows-jdk9] [INFO] Downloading: https://repo.maven.apache.org/maven2/org/apache/maven/plugin-tools/maven-plugin-annotations/3.5.1/maven-plugin-annotations-3.5.1.jar
[windows-jdk9] [INFO] Downloaded: https://repo.maven.apache.org/maven2/org/apache/maven/plugin-tools/maven-plugin-annotations/3.5.1/maven-plugin-annotations-3.5.1.jar
(14 kB at 753 kB/s)
[windows-jdk9] [INFO] 
[windows-jdk9] [INFO] --- maven-clean-plugin:3.0.0:clean (default-clean) @ maven-enforcer-plugin
---
[windows-jdk9] [INFO] 
[windows-jdk9] [INFO] --- maven-enforcer-plugin:1.4.1:enforce (enforce-maven-version) @ maven-enforcer-plugin
---
[windows-jdk9] [INFO] 
[windows-jdk9] [INFO] --- maven-enforcer-plugin:1.4.1:enforce (enforce-bytecode-version) @
maven-enforcer-plugin ---
[windows-jdk10] Sending interrupt signal to process
[Pipeline] [windows-jdk9] }
[Pipeline] [linux-jdk8] }
[Pipeline] [linux-jdk7] }
[Pipeline] [linux-jdk9] }
[Pipeline] [windows-jdk10] }
[Pipeline] [windows-jdk9] // dir
[Pipeline] [linux-jdk8] // dir
[Pipeline] [linux-jdk7] // dir
[Pipeline] [linux-jdk9] // dir
[Pipeline] [windows-jdk10] // dir
[Pipeline] [windows-jdk9] }
[windows-jdk9] [withMaven] One or multiple Maven executions have been ignored by the Jenkins
Pipeline Maven Plugin because they have been interrupted before completion (1). See Pipeline
Maven Plugin FAQ for more details.
[Pipeline] [linux-jdk8] }
[linux-jdk8] [withMaven] One or multiple Maven executions have been ignored by the Jenkins
Pipeline Maven Plugin because they have been interrupted before completion (1). See Pipeline
Maven Plugin FAQ for more details.
[Pipeline] [linux-jdk7] }
[linux-jdk7] [withMaven] One or multiple Maven executions have been ignored by the Jenkins
Pipeline Maven Plugin because they have been interrupted before completion (1). See Pipeline
Maven Plugin FAQ for more details.
[Pipeline] [linux-jdk9] }
[linux-jdk9] [withMaven] One or multiple Maven executions have been ignored by the Jenkins
Pipeline Maven Plugin because they have been interrupted before completion (1). See Pipeline
Maven Plugin FAQ for more details.
[Pipeline] [windows-jdk10] }
[windows-jdk10] [withMaven] junitPublisher - Archive test results for Maven artifact org.apache.maven.enforcer:enforcer-api:3.0.0-SNAPSHOT
generated by maven-surefire-plugin:test (default-test): m\enforcer-api\target\surefire-reports\*.xml
[windows-jdk10] Recording test results
[windows-jdk10] None of the test reports contained any result
[windows-jdk10] [withMaven] junitPublisher - Archive test results for Maven artifact org.apache.maven.enforcer:enforcer-rules:3.0.0-SNAPSHOT
generated by maven-surefire-plugin:test (default-test): m\enforcer-rules\target\surefire-reports\*.xml
[windows-jdk10] Recording test results
[windows-jdk10] None of the test reports contained any result
[Pipeline] [windows-jdk9] // withMaven
[Pipeline] [linux-jdk8] // withMaven
[Pipeline] [linux-jdk7] // withMaven
[Pipeline] [linux-jdk9] // withMaven
[Pipeline] [windows-jdk10] // withMaven
[Pipeline] [windows-jdk9] echo
[windows-jdk9] [FAIL FAST] linux-jdk10 had first failure, ignoring script returned exit code
-1
[Pipeline] [windows-jdk9] }
[Pipeline] [linux-jdk8] echo
[linux-jdk8] [FAIL FAST] linux-jdk10 had first failure, ignoring script returned exit code
143
[Pipeline] [linux-jdk8] }
[Pipeline] [linux-jdk7] echo
[linux-jdk7] [FAIL FAST] linux-jdk10 had first failure, ignoring script returned exit code
143
[Pipeline] [linux-jdk7] }
[Pipeline] [linux-jdk9] echo
[linux-jdk9] [FAIL FAST] linux-jdk10 had first failure, ignoring script returned exit code
143
[Pipeline] [linux-jdk9] }
[Pipeline] [windows-jdk10] echo
[windows-jdk10] [FAIL FAST] linux-jdk10 had first failure, ignoring script returned exit code
1
[Pipeline] [windows-jdk10] }
[Pipeline] [windows-jdk9] // stage
[Pipeline] [linux-jdk8] // stage
[Pipeline] [linux-jdk7] // stage
[Pipeline] [linux-jdk9] // stage
[Pipeline] [windows-jdk10] // stage
[Pipeline] [linux-jdk7] }
[Pipeline] [linux-jdk8] }
[Pipeline] [linux-jdk9] }
[Pipeline] [windows-jdk9] }
[Pipeline] [windows-jdk10] }
[Pipeline] [linux-jdk7] // node
[Pipeline] [linux-jdk8] // node
[Pipeline] [linux-jdk9] // node
[Pipeline] [windows-jdk9] // node
[Pipeline] [windows-jdk10] // node
[Pipeline] [linux-jdk7] }
[Pipeline] [linux-jdk8] }
[Pipeline] [linux-jdk9] }
[Pipeline] [windows-jdk9] }
[Pipeline] [windows-jdk10] }
[windows-jdk7] After 10s process did not stop
[Pipeline] [windows-jdk7] }
[Pipeline] [windows-jdk7] // dir
[Pipeline] [windows-jdk7] }
[windows-jdk7] [withMaven] One or multiple Maven executions have been ignored by the Jenkins
Pipeline Maven Plugin because they have been interrupted before completion (1). See Pipeline
Maven Plugin FAQ for more details.
[Pipeline] [windows-jdk7] // withMaven
[Pipeline] [windows-jdk7] echo
[windows-jdk7] [FAIL FAST] linux-jdk10 had first failure, ignoring null
[Pipeline] [windows-jdk7] }
[Pipeline] [windows-jdk7] // stage
[Pipeline] [windows-jdk7] }
[Pipeline] [windows-jdk7] // node
[Pipeline] [windows-jdk7] }
[windows-jdk8] After 10s process did not stop
[Pipeline] [windows-jdk8] }
[Pipeline] [windows-jdk8] // dir
[Pipeline] [windows-jdk8] }
[windows-jdk8] [withMaven] One or multiple Maven executions have been ignored by the Jenkins
Pipeline Maven Plugin because they have been interrupted before completion (1). See Pipeline
Maven Plugin FAQ for more details.
[Pipeline] [windows-jdk8] // withMaven
[Pipeline] [windows-jdk8] echo
[windows-jdk8] [FAIL FAST] linux-jdk10 had first failure, ignoring null
[Pipeline] [windows-jdk8] }
[Pipeline] [windows-jdk8] // stage
[Pipeline] [windows-jdk8] }
[Pipeline] [windows-jdk8] // node
[Pipeline] [windows-jdk8] }
[Pipeline] // parallel
[Pipeline] echo
***** FAST FAILURE *****

Fast failure triggered by linux-jdk10

***** FAST FAILURE *****
[Pipeline] stage
[Pipeline] { (Notifications)
[Pipeline] echo
Build result: FAILURE
[Pipeline] jiraIssueSelector
[Pipeline] emailext
Mime
  • Unnamed multipart/mixed (inline, None, 0 bytes)
View raw message