maven-notifications mailing list archives

Site index · List index
Message view « Date » · « Thread »
Top « Date » · « Thread »
From Apache Jenkins Server <jenk...@builds.apache.org>
Subject Build failed in Jenkins: Maven TLP » maven-archiver » MSHARED-668-test #12
Date Thu, 21 Jun 2018 18:04:38 GMT
See https://builds.apache.org/job/maven-box/job/maven-archiver/job/MSHARED-668-test/12/

Changes:

* [CLOSES INFRA-15651] ubuntu-4 is confirmed fixed
* Stop commenting on INFRA tickets
* Add JDK 10 b37 (early access build) (Windows Only)
* Add JDK 10 (latest)
* Change JDK10 on Windows to 'JDK 10 b46 (Windows Only)'
* Add Java 11-ea
* Better fail-fast diagnostics (hopefully)
* Better fail-fast diagnostics (hopefully)
* fix scoping
* Correctly attribute fast failure root node
* Correctly attribute fast failure root node
* Handle other parts of the parallel being interrupted by fast fail
* suppress duplicate changelogs
* take 2 on changelog optimization
* debug
* Seems we have to live with duplicate changelogs
* Add JDK 10 to the jdk default
* auto deploy if we are currently on master branch
* revert as it seems to fail on jenkins asf
* revert this one as well
* enable TLS 1.2 for Java 7

All tests passed

Build log:
[...truncated 533.98 KB...]
[windows-jdk10] Picked up JAVA_TOOL_OPTIONS: -Dmaven.ext.class.path="f:\jenkins\jenkins-slave\workspace\n-archiver_MSHARED-668-test-WG4DQP6EJS2N73J3VGM2JH6SMRRHF477RDRLQRWF4WAHIMWMG5OA@tmp\withMaven26e86bc2\pipeline-maven-spy.jar"
-Dorg.jenkinsci.plugins.pipeline.maven.reportsFolder="f:\jenkins\jenkins-slave\workspace\n-archiver_MSHARED-668-test-WG4DQP6EJS2N73J3VGM2JH6SMRRHF477RDRLQRWF4WAHIMWMG5OA@tmp\withMaven26e86bc2"

[windows-jdk9] [INFO] /F:/jenkins/jenkins-slave/workspace/n-archiver_MSHARED-668-test-WG4DQP6EJS2N73J3VGM2JH6SMRRHF477RDRLQRWF4WAHIMWMG5OA/m/src/test/java/org/apache/maven/archiver/MockArtifact.java:
Some input files use or override a deprecated API.
[windows-jdk9] [INFO] /F:/jenkins/jenkins-slave/workspace/n-archiver_MSHARED-668-test-WG4DQP6EJS2N73J3VGM2JH6SMRRHF477RDRLQRWF4WAHIMWMG5OA/m/src/test/java/org/apache/maven/archiver/MockArtifact.java:
Recompile with -Xlint:deprecation for details.
[windows-jdk9] [INFO] 
[windows-jdk9] [INFO] --- maven-surefire-plugin:2.20.1:test (default-test) @ maven-archiver
---
[windows-jdk9] [INFO] 
[windows-jdk9] [INFO] -------------------------------------------------------
[windows-jdk9] [INFO]  T E S T S
[windows-jdk9] [INFO] -------------------------------------------------------
[windows-jdk10] Apache Maven 3.5.0 (ff8f5e7444045639af65f6095c62210b5713f426; 2017-04-03T19:39:06Z)
[windows-jdk10] Maven home: F:\jenkins\tools\maven\apache-maven-3.5.0\bin\..
[windows-jdk10] Java version: 10, vendor: Oracle Corporation
[windows-jdk10] Java home: F:\jenkins\tools\java\jdk10_46
[windows-jdk10] Default locale: en_US, platform encoding: Cp1252
[windows-jdk10] OS name: "windows server 2012 r2", version: "6.3", arch: "amd64", family:
"windows"
[windows-jdk9] [INFO] Running org.apache.maven.archiver.ManifestConfigurationTest
[windows-jdk9] [INFO] Tests run: 4, Failures: 0, Errors: 0, Skipped: 0, Time elapsed: 0.137
s - in org.apache.maven.archiver.ManifestConfigurationTest
[windows-jdk9] [INFO] Running org.apache.maven.archiver.MavenArchiveConfigurationTest
[windows-jdk9] [INFO] Tests run: 3, Failures: 0, Errors: 0, Skipped: 0, Time elapsed: 0 s
- in org.apache.maven.archiver.MavenArchiveConfigurationTest
[windows-jdk9] [INFO] Running org.apache.maven.archiver.MavenArchiverTest
[windows-jdk9] [INFO] Building jar: f:\jenkins\jenkins-slave\workspace\n-archiver_MSHARED-668-test-WG4DQP6EJS2N73J3VGM2JH6SMRRHF477RDRLQRWF4WAHIMWMG5OA\m\target\test\dummy.jar
[windows-jdk9] [INFO] Building jar: f:\jenkins\jenkins-slave\workspace\n-archiver_MSHARED-668-test-WG4DQP6EJS2N73J3VGM2JH6SMRRHF477RDRLQRWF4WAHIMWMG5OA\m\target\test\dummy.jar
[windows-jdk9] Class-Path:
[windows-jdk9] lib/dummy1-1.0.jar lib/dummy2-1.5.jar lib/dummy3-2.0.jar
[windows-jdk9] [INFO] Building jar: f:\jenkins\jenkins-slave\workspace\n-archiver_MSHARED-668-test-WG4DQP6EJS2N73J3VGM2JH6SMRRHF477RDRLQRWF4WAHIMWMG5OA\m\target\test\dummy-defaults.jar
[windows-jdk9] Class-Path:
[windows-jdk9] lib/dummy1-1.0.jar lib/dummy2-1.5.jar lib/dummy3-2.0.jar
[windows-jdk9] Class-Path:
[windows-jdk9] lib/dummy1-1.0.jar lib/dummy2-1.5.jar lib/dummy3-2.0.jar
[windows-jdk9] [INFO] Building jar: f:\jenkins\jenkins-slave\workspace\n-archiver_MSHARED-668-test-WG4DQP6EJS2N73J3VGM2JH6SMRRHF477RDRLQRWF4WAHIMWMG5OA\m\target\test\dummy-explicit-simple.jar
[windows-jdk9] Class-Path:
[windows-jdk9] lib/dummy1-1.0.jar lib/dummy2-1.5.jar lib/dummy3-2.0.jar
[windows-jdk9] Class-Path:
[windows-jdk9] org/apache/dummy/dummy1/1.0/TEST-dummy1-1.0.jar org/apache/dummy/foo/dummy2/1.5/TEST-dummy2-1.5.jar
org/apache/dummy/bar/dummy3/2.0/TEST-dummy3-2.0.jar
[windows-jdk9] [INFO] Building jar: f:\jenkins\jenkins-slave\workspace\n-archiver_MSHARED-668-test-WG4DQP6EJS2N73J3VGM2JH6SMRRHF477RDRLQRWF4WAHIMWMG5OA\m\target\test\dummy.jar
[windows-jdk9] Class-Path:
[windows-jdk9] org/apache/dummy/dummy1/1.0/TEST-dummy1-1.0.jar org/apache/dummy/foo/dummy2/1.5/TEST-dummy2-1.5.jar
org/apache/dummy/bar/dummy3/2.0/TEST-dummy3-2.0.jar
[windows-jdk9] [INFO] Building jar: f:\jenkins\jenkins-slave\workspace\n-archiver_MSHARED-668-test-WG4DQP6EJS2N73J3VGM2JH6SMRRHF477RDRLQRWF4WAHIMWMG5OA\m\target\test\dummy.jar
[windows-jdk9] Class-Path:
[windows-jdk9] org/apache/dummy/dummy1/1.1-SNAPSHOT/TEST-dummy1-1.1-SNAPSHOT.jar org/apache/dummy/foo/dummy2/1.5/TEST-dummy2-1.5.jar
org/apache/dummy/bar/dummy3/2.0/TEST-dummy3-2.0.jar
[windows-jdk9] [INFO] Building jar: f:\jenkins\jenkins-slave\workspace\n-archiver_MSHARED-668-test-WG4DQP6EJS2N73J3VGM2JH6SMRRHF477RDRLQRWF4WAHIMWMG5OA\m\target\test\dummy.jar
[windows-jdk9] Class-Path:
[windows-jdk9] org/apache/dummy/dummy1/1.1-SNAPSHOT/TEST-dummy1-1.1-SNAPSHOT.jar org/apache/dummy/foo/dummy2/1.5/TEST-dummy2-1.5.jar
org/apache/dummy/bar/dummy3/2.0/TEST-dummy3-2.0.jar
[windows-jdk9] [INFO] Building jar: f:\jenkins\jenkins-slave\workspace\n-archiver_MSHARED-668-test-WG4DQP6EJS2N73J3VGM2JH6SMRRHF477RDRLQRWF4WAHIMWMG5OA\m\target\test\dummy.jar
[windows-jdk9] [INFO] Building jar: f:\jenkins\jenkins-slave\workspace\n-archiver_MSHARED-668-test-WG4DQP6EJS2N73J3VGM2JH6SMRRHF477RDRLQRWF4WAHIMWMG5OA\m\target\test\dummy.jar
[windows-jdk9] [INFO] Building jar: f:\jenkins\jenkins-slave\workspace\n-archiver_MSHARED-668-test-WG4DQP6EJS2N73J3VGM2JH6SMRRHF477RDRLQRWF4WAHIMWMG5OA\m\target\test\dummy.jar
[windows-jdk9] Class-Path:
[windows-jdk9] org/apache/dummy/dummy1/1.1-SNAPSHOT/TEST-dummy1-1.1-20081022.112233-1.jar
org/apache/dummy/foo/dummy2/1.5/TEST-dummy2-1.5.jar org/apache/dummy/bar/dummy3/2.0/TEST-dummy3-2.0.jar
[windows-jdk9] [INFO] Building jar: f:\jenkins\jenkins-slave\workspace\n-archiver_MSHARED-668-test-WG4DQP6EJS2N73J3VGM2JH6SMRRHF477RDRLQRWF4WAHIMWMG5OA\m\target\test\dummy.jar
[windows-jdk9] Class-Path:
[windows-jdk9] org/apache/dummy/dummy1/1.1-SNAPSHOT/TEST-dummy1-1.1-20081022.112233-1.jar
org/apache/dummy/foo/dummy2/1.5/TEST-dummy2-1.5.jar org/apache/dummy/bar/dummy3/2.0/TEST-dummy3-2.0.jar
[windows-jdk9] Class-Path:
[windows-jdk9] org/apache/dummy/dummy1/1.1-SNAPSHOT/dummy1-1.1-20081022.112233-1.jar org/apache/dummy/foo/dummy2/1.5/dummy2-1.5.jar
org/apache/dummy/bar/dummy3/2.0/dummy3-2.0.jar
[windows-jdk9] [INFO] Building jar: f:\jenkins\jenkins-slave\workspace\n-archiver_MSHARED-668-test-WG4DQP6EJS2N73J3VGM2JH6SMRRHF477RDRLQRWF4WAHIMWMG5OA\m\target\test\dummy.jar
[windows-jdk9] Class-Path:
[windows-jdk9] org/apache/dummy/dummy1/1.1-SNAPSHOT/dummy1-1.1-20081022.112233-1.jar org/apache/dummy/foo/dummy2/1.5/dummy2-1.5.jar
org/apache/dummy/bar/dummy3/2.0/dummy3-2.0.jar
[windows-jdk9] [INFO] Building jar: f:\jenkins\jenkins-slave\workspace\n-archiver_MSHARED-668-test-WG4DQP6EJS2N73J3VGM2JH6SMRRHF477RDRLQRWF4WAHIMWMG5OA\m\target\test\dummy.jar
[windows-jdk9] Class-Path:
[windows-jdk9] lib/org/apache/dummy/dummy1/1.0.1/dummy1-1.0.1.jar lib/org/apache/dummy/foo/dummy2/1.5/dummy2-1.5.jar
lib/org/apache/dummy/bar/dummy3/2.0/dummy3-2.0.jar
[windows-jdk9] [INFO] Building jar: f:\jenkins\jenkins-slave\workspace\n-archiver_MSHARED-668-test-WG4DQP6EJS2N73J3VGM2JH6SMRRHF477RDRLQRWF4WAHIMWMG5OA\m\target\test\dummy-custom-layout-repo-non-unique.jar
[windows-jdk9] Class-Path:
[windows-jdk9] lib/org/apache/dummy/dummy1/1.0.1/dummy1-1.0.1.jar lib/org/apache/dummy/foo/dummy2/1.5/dummy2-1.5.jar
lib/org/apache/dummy/bar/dummy3/2.0/dummy3-2.0.jar
[windows-jdk9] [INFO] Building jar: f:\jenkins\jenkins-slave\workspace\n-archiver_MSHARED-668-test-WG4DQP6EJS2N73J3VGM2JH6SMRRHF477RDRLQRWF4WAHIMWMG5OA\m\target\test\dummy.jar
[windows-jdk9] Class-Path:
[windows-jdk9] ./lib/dummy.dot-1.5.jar ./lib/dummy1-1.1-20081022.112233-1.jar ./lib/dummy2-1.5.jar
./lib/dummy3-2.0.jar
[windows-jdk9] [INFO] Building jar: f:\jenkins\jenkins-slave\workspace\n-archiver_MSHARED-668-test-WG4DQP6EJS2N73J3VGM2JH6SMRRHF477RDRLQRWF4WAHIMWMG5OA\m\target\test\dummyWithDashes.jar
[windows-jdk9] Class-Path:
[windows-jdk9] ./lib/dummy.dot-1.5.jar ./lib/dummy1-1.1-20081022.112233-1.jar ./lib/dummy2-1.5.jar
./lib/dummy3-2.0.jar
[windows-jdk9] [INFO] Building jar: f:\jenkins\jenkins-slave\workspace\n-archiver_MSHARED-668-test-WG4DQP6EJS2N73J3VGM2JH6SMRRHF477RDRLQRWF4WAHIMWMG5OA\m\target\test\dummy.jar
[windows-jdk9] Class-Path:
[windows-jdk9] dummy1-1.0.jar dummy2-1.5.jar dummy3-2.0.jar
[windows-jdk9] [INFO] Building jar: f:\jenkins\jenkins-slave\workspace\n-archiver_MSHARED-668-test-WG4DQP6EJS2N73J3VGM2JH6SMRRHF477RDRLQRWF4WAHIMWMG5OA\m\target\test\dummy.jar
[windows-jdk9] Class-Path:
[windows-jdk9] lib/dummy1-1.0.jar lib/dummy2-1.5.jar lib/dummy3-2.0.jar
[windows-jdk9] [INFO] Building jar: f:\jenkins\jenkins-slave\workspace\n-archiver_MSHARED-668-test-WG4DQP6EJS2N73J3VGM2JH6SMRRHF477RDRLQRWF4WAHIMWMG5OA\m\target\test\dummy-custom-layout-simple.jar
[windows-jdk9] Class-Path:
[windows-jdk9] lib/dummy1-1.0.jar lib/dummy2-1.5.jar lib/dummy3-2.0.jar
[windows-jdk9] Class-Path:
[windows-jdk9] lib/org/apache/dummy/dummy1/1.0.1/dummy1-1.0.jar lib/org/apache/dummy/foo/dummy2/1.5/dummy2-1.5.jar
lib/org/apache/dummy/bar/dummy3/2.0/dummy3-2.0.jar
[windows-jdk9] [INFO] Building jar: f:\jenkins\jenkins-slave\workspace\n-archiver_MSHARED-668-test-WG4DQP6EJS2N73J3VGM2JH6SMRRHF477RDRLQRWF4WAHIMWMG5OA\m\target\test\dummy-custom-layout-repo.jar
[windows-jdk9] Class-Path:
[windows-jdk9] lib/org/apache/dummy/dummy1/1.0.1/dummy1-1.0.jar lib/org/apache/dummy/foo/dummy2/1.5/dummy2-1.5.jar
lib/org/apache/dummy/bar/dummy3/2.0/dummy3-2.0.jar
[windows-jdk9] Class-Path:
[windows-jdk9] org/apache/dummy/dummy1/1.0.1/dummy1-1.0.jar org/apache/dummy/foo/dummy2/1.5/dummy2-1.5.jar
org/apache/dummy/bar/dummy3/2.0/dummy3-2.0.jar
[windows-jdk9] [INFO] Building jar: f:\jenkins\jenkins-slave\workspace\n-archiver_MSHARED-668-test-WG4DQP6EJS2N73J3VGM2JH6SMRRHF477RDRLQRWF4WAHIMWMG5OA\m\target\test\dummy.jar
[windows-jdk9] Class-Path:
[windows-jdk9] org/apache/dummy/dummy1/1.0.1/dummy1-1.0.jar org/apache/dummy/foo/dummy2/1.5/dummy2-1.5.jar
org/apache/dummy/bar/dummy3/2.0/dummy3-2.0.jar
[windows-jdk9] Class-Path:
[windows-jdk9] lib/dummy1-1.0.1.jar lib/dummy2-1.5.jar lib/dummy3-2.0.jar
[windows-jdk9] [INFO] Building jar: f:\jenkins\jenkins-slave\workspace\n-archiver_MSHARED-668-test-WG4DQP6EJS2N73J3VGM2JH6SMRRHF477RDRLQRWF4WAHIMWMG5OA\m\target\test\dummy-custom-layout-simple-non-unique.jar
[windows-jdk9] Class-Path:
[windows-jdk9] lib/dummy1-1.0.1.jar lib/dummy2-1.5.jar lib/dummy3-2.0.jar
[windows-jdk9] Class-Path:
[windows-jdk9] maven-archiver-test-7059192138652570873.jar
[windows-jdk9] [INFO] Building jar: f:\jenkins\jenkins-slave\workspace\n-archiver_MSHARED-668-test-WG4DQP6EJS2N73J3VGM2JH6SMRRHF477RDRLQRWF4WAHIMWMG5OA\m\target\test\dummy.jar
[windows-jdk9] [INFO] Building jar: f:\jenkins\jenkins-slave\workspace\n-archiver_MSHARED-668-test-WG4DQP6EJS2N73J3VGM2JH6SMRRHF477RDRLQRWF4WAHIMWMG5OA\m\target\test\dummy.jar
[windows-jdk9] Class-Path:
[windows-jdk9] dummy1-1.1-20081022.112233-1.jar dummy2-1.5.jar dummy3-2.0.jar
[windows-jdk9] [INFO] Building jar: f:\jenkins\jenkins-slave\workspace\n-archiver_MSHARED-668-test-WG4DQP6EJS2N73J3VGM2JH6SMRRHF477RDRLQRWF4WAHIMWMG5OA\m\target\test\dummy.jar
[windows-jdk9] [INFO] Tests run: 27, Failures: 0, Errors: 0, Skipped: 0, Time elapsed: 0.691
s - in org.apache.maven.archiver.MavenArchiverTest
[windows-jdk9] [INFO] 
[windows-jdk9] [INFO] Results:
[windows-jdk9] [INFO] 
[windows-jdk9] [INFO] Tests run: 34, Failures: 0, Errors: 0, Skipped: 0
[windows-jdk9] [INFO] 
[windows-jdk9] [INFO] 
[windows-jdk9] [INFO] --- maven-jar-plugin:3.0.2:jar (default-jar) @ maven-archiver ---
[windows-jdk9] [INFO] Building jar: f:\jenkins\jenkins-slave\workspace\n-archiver_MSHARED-668-test-WG4DQP6EJS2N73J3VGM2JH6SMRRHF477RDRLQRWF4WAHIMWMG5OA\m\target\maven-archiver-3.2.1-SNAPSHOT.jar
[windows-jdk9] [INFO] 
[windows-jdk9] [INFO] --- maven-site-plugin:3.7:attach-descriptor (attach-descriptor) @ maven-archiver
---
[windows-jdk10] [INFO] [jenkins-event-spy] Generate F:\jenkins\jenkins-slave\workspace\n-archiver_MSHARED-668-test-WG4DQP6EJS2N73J3VGM2JH6SMRRHF477RDRLQRWF4WAHIMWMG5OA@tmp\withMaven26e86bc2\maven-spy-20180621-180426-88711218606060874430428.log.tmp
...
[windows-jdk10] [INFO] Scanning for projects...
[windows-jdk10] [INFO] 
[windows-jdk10] [INFO] ------------------------------------------------------------------------
[windows-jdk10] [INFO] Building Apache Maven Archiver 3.2.1-SNAPSHOT
[windows-jdk10] [INFO] ------------------------------------------------------------------------
[windows-jdk10] [INFO] 
[windows-jdk10] [INFO] --- maven-clean-plugin:3.0.0:clean (default-clean) @ maven-archiver
---
[windows-jdk10] [INFO] 
[windows-jdk10] [INFO] --- maven-enforcer-plugin:1.4.1:enforce (enforce-maven-version) @ maven-archiver
---
[windows-jdk10] [INFO] 
[windows-jdk10] [INFO] --- maven-enforcer-plugin:1.4.1:enforce (enforce-bytecode-version)
@ maven-archiver ---
[windows-jdk9] [INFO] Skipping because packaging 'jar' is not pom.
[windows-jdk9] [INFO] 
[windows-jdk9] [INFO] --- maven-checkstyle-plugin:3.0.0:check (checkstyle-check) @ maven-archiver
---
[windows-jdk9] [INFO] Downloading: https://repo.maven.apache.org/maven2/javax/xml/bind/jaxb-api/2.3.0/jaxb-api-2.3.0.pom
[windows-jdk9] [INFO] Downloaded: https://repo.maven.apache.org/maven2/javax/xml/bind/jaxb-api/2.3.0/jaxb-api-2.3.0.pom
(23 kB at 62 kB/s)
[windows-jdk9] [INFO] Downloading: https://repo.maven.apache.org/maven2/javax/xml/bind/jaxb-api-parent/2.3.0/jaxb-api-parent-2.3.0.pom
[windows-jdk9] [INFO] Downloaded: https://repo.maven.apache.org/maven2/javax/xml/bind/jaxb-api-parent/2.3.0/jaxb-api-parent-2.3.0.pom
(5.6 kB at 470 kB/s)
[windows-jdk9] [INFO] Downloading: https://repo.maven.apache.org/maven2/net/java/jvnet-parent/5/jvnet-parent-5.pom
[windows-jdk9] [INFO] Downloaded: https://repo.maven.apache.org/maven2/net/java/jvnet-parent/5/jvnet-parent-5.pom
(8.9 kB at 633 kB/s)
[windows-jdk9] [INFO] Downloading: https://repo.maven.apache.org/maven2/javax/xml/bind/jaxb-api/2.3.0/jaxb-api-2.3.0.jar
[windows-jdk9] [INFO] Downloaded: https://repo.maven.apache.org/maven2/javax/xml/bind/jaxb-api/2.3.0/jaxb-api-2.3.0.jar
(126 kB at 4.5 MB/s)
[windows-jdk10] [INFO] 
[windows-jdk10] [INFO] --- maven-enforcer-plugin:1.4.1:enforce (ban-known-bad-maven-versions)
@ maven-archiver ---
[windows-jdk10] [INFO] 
[windows-jdk10] [INFO] --- apache-rat-plugin:0.12:check (rat-check) @ maven-archiver ---
[windows-jdk9] [INFO] There is 1 error reported by Checkstyle 6.18 with config/maven_checks.xml
ruleset.
[windows-jdk9] [INFO] Ignored 1 error, 0 violation remaining.
[windows-jdk9] [INFO] ------------------------------------------------------------------------
[windows-jdk9] [INFO] BUILD SUCCESS
[windows-jdk9] [INFO] ------------------------------------------------------------------------
[windows-jdk9] [INFO] Total time: 12.281 s
[windows-jdk9] [INFO] Finished at: 2018-06-21T18:04:30Z
[windows-jdk9] [INFO] Final Memory: 35M/118M
[windows-jdk9] [INFO] ------------------------------------------------------------------------
[windows-jdk9] [WARNING] The requested profile "run-its" could not be activated because it
does not exist.
[windows-jdk9] [INFO] [jenkins-event-spy] Generated F:\jenkins\jenkins-slave\workspace\n-archiver_MSHARED-668-test-WG4DQP6EJS2N73J3VGM2JH6SMRRHF477RDRLQRWF4WAHIMWMG5OA@tmp\withMaven5b5b516d\maven-spy-20180621-180418-19211309556607021094985.log
[Pipeline] [windows-jdk9] }
[Pipeline] [windows-jdk9] // dir
[Pipeline] [windows-jdk9] }
[windows-jdk9] [withMaven] junitPublisher - Archive test results for Maven artifact org.apache.maven:maven-archiver:3.2.1-SNAPSHOT
generated by maven-surefire-plugin:test (default-test): m\target\surefire-reports\*.xml
[windows-jdk9] Recording test results
[Pipeline] [windows-jdk9] // withMaven
[Pipeline] [windows-jdk9] }
[Pipeline] [windows-jdk9] // stage
[Pipeline] [windows-jdk9] }
[windows-jdk10] [INFO] Enabled default license matchers.
[windows-jdk10] [INFO] Will parse SCM ignores for exclusions...
[windows-jdk10] [INFO] Parsing exclusions from f:\jenkins\jenkins-slave\workspace\n-archiver_MSHARED-668-test-WG4DQP6EJS2N73J3VGM2JH6SMRRHF477RDRLQRWF4WAHIMWMG5OA\m\.gitignore
[windows-jdk10] [INFO] Finished adding exclusions from SCM ignore files.
[windows-jdk10] [INFO] 71 implicit excludes (use -debug for more details).
[windows-jdk10] [INFO] Exclude: .repository/**
[windows-jdk10] [INFO] Exclude: .maven/spy.log
[windows-jdk10] [INFO] Exclude: dependency-reduced-pom.xml
[windows-jdk10] [INFO] Exclude: .java-version
[windows-jdk10] [INFO] 27 resources included (use -debug for more details)
[Pipeline] [windows-jdk9] // node
[Pipeline] [windows-jdk9] }
[windows-jdk10] [INFO] Rat check: Summary over all files. Unapproved: 0, unknown: 0, generated:
0, approved: 22 licenses.
[windows-jdk10] [INFO] 
[windows-jdk10] [INFO] --- maven-remote-resources-plugin:1.5:process (process-resource-bundles)
@ maven-archiver ---
[windows-jdk10] [INFO] 
[windows-jdk10] [INFO] --- maven-resources-plugin:3.0.2:resources (default-resources) @ maven-archiver
---
[windows-jdk10] [INFO] Using 'UTF-8' encoding to copy filtered resources.
[windows-jdk10] [INFO] skip non existing resourceDirectory f:\jenkins\jenkins-slave\workspace\n-archiver_MSHARED-668-test-WG4DQP6EJS2N73J3VGM2JH6SMRRHF477RDRLQRWF4WAHIMWMG5OA\m\src\main\resources
[windows-jdk10] [INFO] Copying 3 resources
[windows-jdk10] [INFO] 
[windows-jdk10] [INFO] --- maven-compiler-plugin:3.7.0:compile (default-compile) @ maven-archiver
---
[windows-jdk10] [INFO] Changes detected - recompiling the module!
[windows-jdk10] [INFO] Compiling 5 source files to f:\jenkins\jenkins-slave\workspace\n-archiver_MSHARED-668-test-WG4DQP6EJS2N73J3VGM2JH6SMRRHF477RDRLQRWF4WAHIMWMG5OA\m\target\classes
[windows-jdk10] [INFO] 
[windows-jdk10] [INFO] --- maven-resources-plugin:3.0.2:testResources (default-testResources)
@ maven-archiver ---
[windows-jdk10] [INFO] Using 'UTF-8' encoding to copy filtered resources.
[windows-jdk10] [INFO] Copying 7 resources
[windows-jdk10] [INFO] Copying 3 resources
[windows-jdk10] [INFO] 
[windows-jdk10] [INFO] --- maven-compiler-plugin:3.7.0:testCompile (default-testCompile) @
maven-archiver ---
[windows-jdk10] [INFO] Changes detected - recompiling the module!
[windows-jdk10] [INFO] Compiling 4 source files to f:\jenkins\jenkins-slave\workspace\n-archiver_MSHARED-668-test-WG4DQP6EJS2N73J3VGM2JH6SMRRHF477RDRLQRWF4WAHIMWMG5OA\m\target\test-classes
[windows-jdk10] [INFO] /f:/jenkins/jenkins-slave/workspace/n-archiver_MSHARED-668-test-WG4DQP6EJS2N73J3VGM2JH6SMRRHF477RDRLQRWF4WAHIMWMG5OA/m/src/test/java/org/apache/maven/archiver/MockArtifact.java:
Some input files use or override a deprecated API.
[windows-jdk10] [INFO] /f:/jenkins/jenkins-slave/workspace/n-archiver_MSHARED-668-test-WG4DQP6EJS2N73J3VGM2JH6SMRRHF477RDRLQRWF4WAHIMWMG5OA/m/src/test/java/org/apache/maven/archiver/MockArtifact.java:
Recompile with -Xlint:deprecation for details.
[windows-jdk10] [INFO] 
[windows-jdk10] [INFO] --- maven-surefire-plugin:2.20.1:test (default-test) @ maven-archiver
---
[windows-jdk10] [INFO] ------------------------------------------------------------------------
[windows-jdk10] [INFO] BUILD FAILURE
[windows-jdk10] [INFO] ------------------------------------------------------------------------
[windows-jdk10] [INFO] Total time: 8.640 s
[windows-jdk10] [INFO] Finished at: 2018-06-21T18:04:35Z
[windows-jdk10] [INFO] Final Memory: 24M/90M
[windows-jdk10] [INFO] ------------------------------------------------------------------------
[windows-jdk10] [WARNING] The requested profile "run-its" could not be activated because it
does not exist.
[windows-jdk10] [INFO] [jenkins-event-spy] Generated F:\jenkins\jenkins-slave\workspace\n-archiver_MSHARED-668-test-WG4DQP6EJS2N73J3VGM2JH6SMRRHF477RDRLQRWF4WAHIMWMG5OA@tmp\withMaven26e86bc2\maven-spy-20180621-180426-88711218606060874430428.log
[windows-jdk10] [ERROR] Failed to execute goal org.apache.maven.plugins:maven-surefire-plugin:2.20.1:test
(default-test) on project maven-archiver: Execution default-test of goal org.apache.maven.plugins:maven-surefire-plugin:2.20.1:test
failed. NullPointerException -> [Help 1]
[windows-jdk10] [ERROR] 
[windows-jdk10] [ERROR] To see the full stack trace of the errors, re-run Maven with the -e
switch.
[windows-jdk10] [ERROR] Re-run Maven using the -X switch to enable full debug logging.
[windows-jdk10] [ERROR] 
[windows-jdk10] [ERROR] For more information about the errors and possible solutions, please
read the following articles:
[windows-jdk10] [ERROR] [Help 1] http://cwiki.apache.org/confluence/display/MAVEN/PluginExecutionException
[Pipeline] [windows-jdk10] }
[Pipeline] [windows-jdk10] // dir
[Pipeline] [windows-jdk10] }
[windows-jdk10] [withMaven] junitPublisher - Archive test results for Maven artifact org.apache.maven:maven-archiver:3.2.1-SNAPSHOT
generated by maven-surefire-plugin:test (default-test): m\target\surefire-reports\*.xml
[windows-jdk10] Recording test results
[windows-jdk10] None of the test reports contained any result
[Pipeline] [windows-jdk10] // withMaven
[Pipeline] [windows-jdk10] echo
[windows-jdk10] [FAIL FAST] This is the first failure and likely root cause
[Pipeline] [windows-jdk10] }
[Pipeline] [windows-jdk10] // stage
[Pipeline] [windows-jdk10] }
[Pipeline] [windows-jdk10] // node
[Pipeline] [windows-jdk10] }
[windows-jdk10] Failed in branch windows-jdk10
[Pipeline] [linux-jdk7] // node
[Pipeline] [linux-jdk8] // node
[Pipeline] [linux-jdk9] // node
[Pipeline] [linux-jdk10] // node
[Pipeline] [linux-jdk7] }
[linux-jdk7] Failed in branch linux-jdk7
[Pipeline] [linux-jdk8] }
[linux-jdk8] Failed in branch linux-jdk8
[Pipeline] [linux-jdk9] }
[linux-jdk9] Failed in branch linux-jdk9
[Pipeline] [linux-jdk10] }
[linux-jdk10] Failed in branch linux-jdk10
[Pipeline] // parallel
[Pipeline] echo
***** FAST FAILURE *****

Fast failure triggered by windows-jdk10

***** FAST FAILURE *****
[Pipeline] stage
[Pipeline] { (Notifications)
[Pipeline] echo
Build result: FAILURE
[Pipeline] jiraIssueSelector
Mime
  • Unnamed multipart/mixed (inline, None, 0 bytes)
View raw message