maven-notifications mailing list archives

Site index · List index
Message view « Date » · « Thread »
Top « Date » · « Thread »
From Apache Jenkins Server <jenk...@builds.apache.org>
Subject Build failed in Jenkins: Maven TLP » maven-enforcer » master #18
Date Fri, 11 May 2018 13:10:38 GMT
See https://builds.apache.org/job/maven-box/job/maven-enforcer/job/master/18/

Changes:

* Add JDK 10 (latest)
* Change JDK10 on Windows to 'JDK 10 b46 (Windows Only)'
* Add Java 11-ea
* Add JDK 10 to the jdk default
* auto deploy if we are currently on master branch
* revert as it seems to fail on jenkins asf
* revert this one as well
* [MNGSITE-328] use sha1 checksum instead of md5

No tests ran.

Build log:
[...truncated 1.06 MB...]
[windows-jdk9] [INFO] Will parse SCM ignores for exclusions...
[windows-jdk9] [INFO] Finished adding exclusions from SCM ignore files.
[windows-jdk9] [INFO] 61 implicit excludes (use -debug for more details).
[windows-jdk9] [INFO] Exclude: .repository/**
[windows-jdk9] [INFO] Exclude: .maven/spy.log
[windows-jdk9] [INFO] Exclude: dependency-reduced-pom.xml
[windows-jdk9] [INFO] Exclude: .java-version
[windows-jdk9] [INFO] 129 resources included (use -debug for more details)
[windows-jdk7] Sending interrupt signal to process
[windows-jdk9] [INFO] Rat check: Summary over all files. Unapproved: 0, unknown: 0, generated:
0, approved: 123 licenses.
[windows-jdk9] [INFO] 
[windows-jdk9] [INFO] --- maven-remote-resources-plugin:1.5:process (process-resource-bundles)
@ enforcer-rules ---
[windows-jdk7] [INFO] Downloading: https://repo.maven.apache.org/maven2/org/apache/maven/doxia/doxia-modules/1.7/doxia-modules-1.7.pom
[windows-jdk7] [INFO] Downloaded: https://repo.maven.apache.org/maven2/org/apache/maven/doxia/doxia-modules/1.7/doxia-modules-1.7.pom
(2.6 kB at 32 kB/s)
[windows-jdk7] [INFO] Downloading: https://repo.maven.apache.org/maven2/org/codehaus/groovy/groovy-all/2.4.8/groovy-all-2.4.8.pom
[windows-jdk7] [INFO] Downloaded: https://repo.maven.apache.org/maven2/org/codehaus/groovy/groovy-all/2.4.8/groovy-all-2.4.8.pom
(21 kB at 56 kB/s)
[windows-jdk8] [INFO] Tests run: 8, Failures: 0, Errors: 0, Skipped: 0, Time elapsed: 4.405
s - in org.apache.maven.plugins.enforcer.BanDistributionManagementTest
[windows-jdk8] [INFO] Running org.apache.maven.plugins.enforcer.ReactorModuleConvergenceTest
[windows-jdk8] [INFO] Tests run: 9, Failures: 0, Errors: 0, Skipped: 0, Time elapsed: 0.397
s - in org.apache.maven.plugins.enforcer.ReactorModuleConvergenceTest
[windows-jdk8] [INFO] Running org.apache.maven.plugins.enforcer.RequireActiveProfileTest
[windows-jdk8] [INFO] Tests run: 9, Failures: 0, Errors: 0, Skipped: 0, Time elapsed: 0.001
s - in org.apache.maven.plugins.enforcer.RequireActiveProfileTest
[windows-jdk8] [INFO] Running org.apache.maven.plugins.enforcer.RequirePrerequisiteTest
[windows-jdk8] [INFO] Tests run: 9, Failures: 0, Errors: 0, Skipped: 0, Time elapsed: 0.345
s - in org.apache.maven.plugins.enforcer.RequirePrerequisiteTest
[windows-jdk8] [INFO] Running org.apache.maven.plugins.enforcer.TestAbstractVersionEnforcer
[windows-jdk8] [debug] Detected test Version: 2.0.5 is allowed in the range [2.0.5,).
[windows-jdk8] [debug] Detected test Version: 2.0.5 is allowed in the range [2.0.4,).
[windows-jdk8] [debug] Detected test Version: 2.0.5 is allowed in the range [2.0.4,2.0.5].
[windows-jdk8] [debug] Detected test Version: 2.0.5 is allowed in the range [2.0.4,2.0.6].
[windows-jdk8] [debug] Detected test Version: 2.0.5 is allowed in the range [2.0.4,2.0.6).
[windows-jdk8] [debug] Detected test Version: 2.0.5 is allowed in the range [2.0,).
[windows-jdk8] [debug] Detected test Version: 2.0.5 is allowed in the range [2.0.0,).
[windows-jdk8] [debug] Detected test Version: 2.0.5 is allowed in the range 2.0.
[windows-jdk8] [debug] Detected test Version: 2.0.5 is allowed in the range 2.0.4.
[windows-jdk8] [debug] Detected test Version: 2.0.5 is allowed in the range 2.0.5.
[windows-jdk8] [INFO] Tests run: 2, Failures: 0, Errors: 0, Skipped: 0, Time elapsed: 0.015
s - in org.apache.maven.plugins.enforcer.TestAbstractVersionEnforcer
[windows-jdk8] [INFO] Running org.apache.maven.plugins.enforcer.TestAlwaysFail
[windows-jdk8] Sending interrupt signal to process
[windows-jdk9] [INFO] 
[windows-jdk9] [INFO] --- maven-resources-plugin:3.0.2:resources (default-resources) @ enforcer-rules
---
[windows-jdk9] [INFO] Using 'UTF-8' encoding to copy filtered resources.
[windows-jdk9] [INFO] skip non existing resourceDirectory F:\jenkins\jenkins-slave\workspace\n-box_maven-enforcer_master-KHI64AG3D4VZKUKLMNAYHKONI5AIQBLJ5ZKYGGSW7DAZVXCJBFHQ@2\m\enforcer-rules\src\main\resources
[windows-jdk9] [INFO] Copying 3 resources
[windows-jdk9] [INFO] 
[windows-jdk9] [INFO] --- maven-compiler-plugin:3.7.0:compile (default-compile) @ enforcer-rules
---
[windows-jdk9] [INFO] Changes detected - recompiling the module!
[windows-jdk9] [INFO] Compiling 43 source files to F:\jenkins\jenkins-slave\workspace\n-box_maven-enforcer_master-KHI64AG3D4VZKUKLMNAYHKONI5AIQBLJ5ZKYGGSW7DAZVXCJBFHQ@2\m\enforcer-rules\target\classes
[windows-jdk9] [INFO] /F:/jenkins/jenkins-slave/workspace/n-box_maven-enforcer_master-KHI64AG3D4VZKUKLMNAYHKONI5AIQBLJ5ZKYGGSW7DAZVXCJBFHQ@2/m/enforcer-rules/src/main/java/org/apache/maven/plugins/enforcer/DependencyConvergence.java:
Some input files use or override a deprecated API.
[windows-jdk9] [INFO] /F:/jenkins/jenkins-slave/workspace/n-box_maven-enforcer_master-KHI64AG3D4VZKUKLMNAYHKONI5AIQBLJ5ZKYGGSW7DAZVXCJBFHQ@2/m/enforcer-rules/src/main/java/org/apache/maven/plugins/enforcer/DependencyConvergence.java:
Recompile with -Xlint:deprecation for details.
[windows-jdk9] [INFO] /F:/jenkins/jenkins-slave/workspace/n-box_maven-enforcer_master-KHI64AG3D4VZKUKLMNAYHKONI5AIQBLJ5ZKYGGSW7DAZVXCJBFHQ@2/m/enforcer-rules/src/main/java/org/apache/maven/plugins/enforcer/RequirePluginVersions.java:
F:\jenkins\jenkins-slave\workspace\n-box_maven-enforcer_master-KHI64AG3D4VZKUKLMNAYHKONI5AIQBLJ5ZKYGGSW7DAZVXCJBFHQ@2\m\enforcer-rules\src\main\java\org\apache\maven\plugins\enforcer\RequirePluginVersions.java
uses unchecked or unsafe operations.
[windows-jdk9] [INFO] /F:/jenkins/jenkins-slave/workspace/n-box_maven-enforcer_master-KHI64AG3D4VZKUKLMNAYHKONI5AIQBLJ5ZKYGGSW7DAZVXCJBFHQ@2/m/enforcer-rules/src/main/java/org/apache/maven/plugins/enforcer/RequirePluginVersions.java:
Recompile with -Xlint:unchecked for details.
[windows-jdk9] [INFO] 
[windows-jdk9] [INFO] --- maven-resources-plugin:3.0.2:testResources (default-testResources)
@ enforcer-rules ---
[windows-jdk9] [INFO] Using 'UTF-8' encoding to copy filtered resources.
[windows-jdk9] [INFO] Copying 11 resources
[windows-jdk9] [INFO] Copying 3 resources
[windows-jdk9] [INFO] 
[windows-jdk9] [INFO] --- maven-compiler-plugin:3.7.0:testCompile (default-testCompile) @
enforcer-rules ---
[windows-jdk9] [INFO] Changes detected - recompiling the module!
[windows-jdk9] [INFO] Compiling 34 source files to F:\jenkins\jenkins-slave\workspace\n-box_maven-enforcer_master-KHI64AG3D4VZKUKLMNAYHKONI5AIQBLJ5ZKYGGSW7DAZVXCJBFHQ@2\m\enforcer-rules\target\test-classes
[windows-jdk9] [INFO] /F:/jenkins/jenkins-slave/workspace/n-box_maven-enforcer_master-KHI64AG3D4VZKUKLMNAYHKONI5AIQBLJ5ZKYGGSW7DAZVXCJBFHQ@2/m/enforcer-rules/src/test/java/org/apache/maven/plugins/enforcer/MockPathTranslator.java:
Some input files use or override a deprecated API.
[windows-jdk9] [INFO] /F:/jenkins/jenkins-slave/workspace/n-box_maven-enforcer_master-KHI64AG3D4VZKUKLMNAYHKONI5AIQBLJ5ZKYGGSW7DAZVXCJBFHQ@2/m/enforcer-rules/src/test/java/org/apache/maven/plugins/enforcer/MockPathTranslator.java:
Recompile with -Xlint:deprecation for details.
[windows-jdk9] [INFO] /F:/jenkins/jenkins-slave/workspace/n-box_maven-enforcer_master-KHI64AG3D4VZKUKLMNAYHKONI5AIQBLJ5ZKYGGSW7DAZVXCJBFHQ@2/m/enforcer-rules/src/test/java/org/apache/maven/plugins/enforcer/MockPlexusContainer.java:
Some input files use unchecked or unsafe operations.
[windows-jdk9] [INFO] /F:/jenkins/jenkins-slave/workspace/n-box_maven-enforcer_master-KHI64AG3D4VZKUKLMNAYHKONI5AIQBLJ5ZKYGGSW7DAZVXCJBFHQ@2/m/enforcer-rules/src/test/java/org/apache/maven/plugins/enforcer/MockPlexusContainer.java:
Recompile with -Xlint:unchecked for details.
[windows-jdk9] [INFO] 
[windows-jdk9] [INFO] --- maven-surefire-plugin:2.20.1:test (default-test) @ enforcer-rules
---
[windows-jdk8] [INFO] 
[windows-jdk8] [INFO] Results:
[windows-jdk8] [INFO] 
[windows-jdk8] [INFO] Tests run: 37, Failures: 0, Errors: 0, Skipped: 0
[windows-jdk8] [INFO] 
[windows-jdk8] [ERROR] There are test failures.
[windows-jdk8] 
[windows-jdk8] Please refer to F:\jenkins\jenkins-slave\workspace\n-box_maven-enforcer_master-KHI64AG3D4VZKUKLMNAYHKONI5AIQBLJ5ZKYGGSW7DAZVXCJBFHQ\m\enforcer-rules\target\surefire-reports
for the individual test results.
[windows-jdk8] Please refer to dump files (if any exist) [date]-jvmRun[N].dump, [date].dumpstream
and [date]-jvmRun[N].dumpstream.
[windows-jdk8] The forked VM terminated without properly saying goodbye. VM crash or System.exit
called?
[windows-jdk8] Command was cmd.exe /X /C "f:\jenkins\tools\java\latest1.8\jre\bin\java -jar
C:\Users\jenkins\AppData\Local\Temp\1\surefire1075368789496600820\surefirebooter1478390905874929344.jar
C:\Users\jenkins\AppData\Local\Temp\1\surefire1075368789496600820 2018-05-11T13-10-09_926-jvmRun1
surefire8561961692738180446tmp surefire_06224551379835285749tmp"
[windows-jdk8] Error occurred in starting fork, check output in log
[windows-jdk8] Process Exit Code: -1
[windows-jdk8] Crashed tests:
[windows-jdk8] org.apache.maven.plugins.enforcer.TestAlwaysFail
[windows-jdk8] org.apache.maven.surefire.booter.SurefireBooterForkException: The forked VM
terminated without properly saying goodbye. VM crash or System.exit called?
[windows-jdk8] Command was cmd.exe /X /C "f:\jenkins\tools\java\latest1.8\jre\bin\java -jar
C:\Users\jenkins\AppData\Local\Temp\1\surefire1075368789496600820\surefirebooter1478390905874929344.jar
C:\Users\jenkins\AppData\Local\Temp\1\surefire1075368789496600820 2018-05-11T13-10-09_926-jvmRun1
surefire8561961692738180446tmp surefire_06224551379835285749tmp"
[windows-jdk8] Error occurred in starting fork, check output in log
[windows-jdk8] Process Exit Code: -1
[windows-jdk8] Crashed tests:
[windows-jdk8] org.apache.maven.plugins.enforcer.TestAlwaysFail
[windows-jdk8] 	at org.apache.maven.plugin.surefire.booterclient.ForkStarter.fork(ForkStarter.java:686)
[windows-jdk8] 	at org.apache.maven.plugin.surefire.booterclient.ForkStarter.fork(ForkStarter.java:535)
[windows-jdk8] 	at org.apache.maven.plugin.surefire.booterclient.ForkStarter.run(ForkStarter.java:280)
[windows-jdk8] 	at org.apache.maven.plugin.surefire.booterclient.ForkStarter.run(ForkStarter.java:245)
[windows-jdk8] 	at org.apache.maven.plugin.surefire.AbstractSurefireMojo.executeProvider(AbstractSurefireMojo.java:1124)
[windows-jdk8] 	at org.apache.maven.plugin.surefire.AbstractSurefireMojo.executeAfterPreconditionsChecked(AbstractSurefireMojo.java:954)
[windows-jdk8] 	at org.apache.maven.plugin.surefire.AbstractSurefireMojo.execute(AbstractSurefireMojo.java:832)
[windows-jdk8] 	at org.apache.maven.plugin.DefaultBuildPluginManager.executeMojo(DefaultBuildPluginManager.java:134)
[windows-jdk8] 	at org.apache.maven.lifecycle.internal.MojoExecutor.execute(MojoExecutor.java:208)
[windows-jdk8] 	at org.apache.maven.lifecycle.internal.MojoExecutor.execute(MojoExecutor.java:154)
[windows-jdk8] 	at org.apache.maven.lifecycle.internal.MojoExecutor.execute(MojoExecutor.java:146)
[windows-jdk8] 	at org.apache.maven.lifecycle.internal.LifecycleModuleBuilder.buildProject(LifecycleModuleBuilder.java:117)
[windows-jdk8] 	at org.apache.maven.lifecycle.internal.LifecycleModuleBuilder.buildProject(LifecycleModuleBuilder.java:81)
[windows-jdk8] 	at org.apache.maven.lifecycle.internal.builder.singlethreaded.SingleThreadedBuilder.build(SingleThreadedBuilder.java:51)
[windows-jdk8] 	at org.apache.maven.lifecycle.internal.LifecycleStarter.execute(LifecycleStarter.java:128)
[windows-jdk8] 	at org.apache.maven.DefaultMaven.doExecute(DefaultMaven.java:309)
[windows-jdk8] 	at org.apache.maven.DefaultMaven.doExecute(DefaultMaven.java:194)
[windows-jdk8] 	at org.apache.maven.DefaultMaven.execute(DefaultMaven.java:107)
[windows-jdk8] 	at org.apache.maven.cli.MavenCli.execute(MavenCli.java:993)
[windows-jdk8] 	at org.apache.maven.cli.MavenCli.doMain(MavenCli.java:345)
[windows-jdk8] 	at org.apache.maven.cli.MavenCli.main(MavenCli.java:191)
[windows-jdk8] 	at sun.reflect.NativeMethodAccessorImpl.invoke0(Native Method)
[windows-jdk8] 	at sun.reflect.NativeMethodAccessorImpl.invoke(NativeMethodAccessorImpl.java:62)
[windows-jdk8] 	at sun.reflect.DelegatingMethodAccessorImpl.invoke(DelegatingMethodAccessorImpl.java:43)
[windows-jdk8] 	at java.lang.reflect.Method.invoke(Method.java:498)
[windows-jdk8] 	at org.codehaus.plexus.classworlds.launcher.Launcher.launchEnhanced(Launcher.java:289)
[windows-jdk8] 	at org.codehaus.plexus.classworlds.launcher.Launcher.launch(Launcher.java:229)
[windows-jdk8] 	at org.codehaus.plexus.classworlds.launcher.Launcher.mainWithExitCode(Launcher.java:415)
[windows-jdk8] 	at org.codehaus.plexus.classworlds.launcher.Launcher.main(Launcher.java:356)
[windows-jdk8] 
[windows-jdk9] [INFO] Downloading: https://repo.maven.apache.org/maven2/org/apache/maven/surefire/surefire-junit4/2.20.1/surefire-junit4-2.20.1.pom
[windows-jdk9] [INFO] Downloaded: https://repo.maven.apache.org/maven2/org/apache/maven/surefire/surefire-junit4/2.20.1/surefire-junit4-2.20.1.pom
(3.3 kB at 121 kB/s)
[windows-jdk9] [INFO] Downloading: https://repo.maven.apache.org/maven2/org/apache/maven/surefire/surefire-providers/2.20.1/surefire-providers-2.20.1.pom
[windows-jdk9] [INFO] Downloaded: https://repo.maven.apache.org/maven2/org/apache/maven/surefire/surefire-providers/2.20.1/surefire-providers-2.20.1.pom
(2.6 kB at 294 kB/s)
[windows-jdk9] [INFO] Downloading: https://repo.maven.apache.org/maven2/org/apache/maven/surefire/surefire-junit4/2.20.1/surefire-junit4-2.20.1.jar
[windows-jdk9] [INFO] Downloaded: https://repo.maven.apache.org/maven2/org/apache/maven/surefire/surefire-junit4/2.20.1/surefire-junit4-2.20.1.jar
(82 kB at 2.2 MB/s)
[windows-jdk9] [INFO] 
[windows-jdk9] [INFO] -------------------------------------------------------
[windows-jdk9] [INFO]  T E S T S
[windows-jdk9] [INFO] -------------------------------------------------------
[windows-jdk9] Sending interrupt signal to process
[Pipeline] [linux-jdk7] // node
[Pipeline] [linux-jdk8] // node
[Pipeline] [linux-jdk9] // node
[Pipeline] [linux-jdk10] // node
[Pipeline] [linux-jdk7] }
[linux-jdk7] Failed in branch linux-jdk7
[Pipeline] [linux-jdk8] }
[linux-jdk8] Failed in branch linux-jdk8
[Pipeline] [linux-jdk9] }
[linux-jdk9] Failed in branch linux-jdk9
[Pipeline] [linux-jdk10] }
[linux-jdk10] Failed in branch linux-jdk10
[Pipeline] [windows-jdk7] }
[Pipeline] [windows-jdk7] // dir
[windows-jdk9] [INFO] 
[windows-jdk9] [INFO] Results:
[windows-jdk9] [INFO] 
[windows-jdk9] [INFO] Tests run: 0, Failures: 0, Errors: 0, Skipped: 0
[windows-jdk9] [INFO] 
[windows-jdk9] [ERROR] There are test failures.
[windows-jdk9] 
[windows-jdk9] Please refer to F:\jenkins\jenkins-slave\workspace\n-box_maven-enforcer_master-KHI64AG3D4VZKUKLMNAYHKONI5AIQBLJ5ZKYGGSW7DAZVXCJBFHQ@2\m\enforcer-rules\target\surefire-reports
for the individual test results.
[windows-jdk9] Please refer to dump files (if any exist) [date]-jvmRun[N].dump, [date].dumpstream
and [date]-jvmRun[N].dumpstream.
[windows-jdk9] The forked VM terminated without properly saying goodbye. VM crash or System.exit
called?
[windows-jdk9] Command was cmd.exe /X /C "f:\jenkins\tools\java\latest9\bin\java --add-modules
java.se.ee -jar C:\Users\jenkins\AppData\Local\Temp\1\surefire12550738970839779047\surefirebooter8433702378114578545.jar
C:\Users\jenkins\AppData\Local\Temp\1\surefire12550738970839779047 2018-05-11T13-10-18_330-jvmRun1
surefire5819219643941624686tmp surefire_017954567669747413415tmp"
[windows-jdk9] Error occurred in starting fork, check output in log
[windows-jdk9] Process Exit Code: -1
[windows-jdk9] org.apache.maven.surefire.booter.SurefireBooterForkException: The forked VM
terminated without properly saying goodbye. VM crash or System.exit called?
[windows-jdk9] Command was cmd.exe /X /C "f:\jenkins\tools\java\latest9\bin\java --add-modules
java.se.ee -jar C:\Users\jenkins\AppData\Local\Temp\1\surefire12550738970839779047\surefirebooter8433702378114578545.jar
C:\Users\jenkins\AppData\Local\Temp\1\surefire12550738970839779047 2018-05-11T13-10-18_330-jvmRun1
surefire5819219643941624686tmp surefire_017954567669747413415tmp"
[windows-jdk9] Error occurred in starting fork, check output in log
[windows-jdk9] Process Exit Code: -1
[windows-jdk9] 	at org.apache.maven.plugin.surefire.booterclient.ForkStarter.fork(ForkStarter.java:686)
[windows-jdk9] 	at org.apache.maven.plugin.surefire.booterclient.ForkStarter.fork(ForkStarter.java:535)
[windows-jdk9] 	at org.apache.maven.plugin.surefire.booterclient.ForkStarter.run(ForkStarter.java:280)
[windows-jdk9] 	at org.apache.maven.plugin.surefire.booterclient.ForkStarter.run(ForkStarter.java:245)
[windows-jdk9] 	at org.apache.maven.plugin.surefire.AbstractSurefireMojo.executeProvider(AbstractSurefireMojo.java:1124)
[windows-jdk9] 	at org.apache.maven.plugin.surefire.AbstractSurefireMojo.executeAfterPreconditionsChecked(AbstractSurefireMojo.java:954)
[windows-jdk9] 	at org.apache.maven.plugin.surefire.AbstractSurefireMojo.execute(AbstractSurefireMojo.java:832)
[windows-jdk9] 	at org.apache.maven.plugin.DefaultBuildPluginManager.executeMojo(DefaultBuildPluginManager.java:134)
[windows-jdk9] 	at org.apache.maven.lifecycle.internal.MojoExecutor.execute(MojoExecutor.java:208)
[windows-jdk9] 	at org.apache.maven.lifecycle.internal.MojoExecutor.execute(MojoExecutor.java:154)
[windows-jdk9] 	at org.apache.maven.lifecycle.internal.MojoExecutor.execute(MojoExecutor.java:146)
[windows-jdk9] 	at org.apache.maven.lifecycle.internal.LifecycleModuleBuilder.buildProject(LifecycleModuleBuilder.java:117)
[windows-jdk9] 	at org.apache.maven.lifecycle.internal.LifecycleModuleBuilder.buildProject(LifecycleModuleBuilder.java:81)
[windows-jdk9] 	at org.apache.maven.lifecycle.internal.builder.singlethreaded.SingleThreadedBuilder.build(SingleThreadedBuilder.java:51)
[windows-jdk9] 	at org.apache.maven.lifecycle.internal.LifecycleStarter.execute(LifecycleStarter.java:128)
[windows-jdk9] 	at org.apache.maven.DefaultMaven.doExecute(DefaultMaven.java:309)
[windows-jdk9] 	at org.apache.maven.DefaultMaven.doExecute(DefaultMaven.java:194)
[windows-jdk9] 	at org.apache.maven.DefaultMaven.execute(DefaultMaven.java:107)
[windows-jdk9] 	at org.apache.maven.cli.MavenCli.execute(MavenCli.java:993)
[windows-jdk9] 	at org.apache.maven.cli.MavenCli.doMain(MavenCli.java:345)
[windows-jdk9] 	at org.apache.maven.cli.MavenCli.main(MavenCli.java:191)
[windows-jdk9] 	at java.base/jdk.internal.reflect.NativeMethodAccessorImpl.invoke0(Native
Method)
[windows-jdk9] 	at java.base/jdk.internal.reflect.NativeMethodAccessorImpl.invoke(NativeMethodAccessorImpl.java:62)
[windows-jdk9] 	at java.base/jdk.internal.reflect.DelegatingMethodAccessorImpl.invoke(DelegatingMethodAccessorImpl.java:43)
[windows-jdk9] 	at java.base/java.lang.reflect.Method.invoke(Method.java:564)
[windows-jdk9] 	at org.codehaus.plexus.classworlds.launcher.Launcher.launchEnhanced(Launcher.java:289)
[windows-jdk9] 	at org.codehaus.plexus.classworlds.launcher.Launcher.launch(Launcher.java:229)
[windows-jdk9] 	at org.codehaus.plexus.classworlds.launcher.Launcher.mainWithExitCode(Launcher.java:415)
[windows-jdk9] 	at org.codehaus.plexus.classworlds.launcher.Launcher.main(Launcher.java:356)
[windows-jdk9] 
[windows-jdk9] [INFO] 
[windows-jdk9] [INFO] --- maven-jar-plugin:3.0.2:jar (default-jar) @ enforcer-rules ---
[windows-jdk9] [INFO] Building jar: F:\jenkins\jenkins-slave\workspace\n-box_maven-enforcer_master-KHI64AG3D4VZKUKLMNAYHKONI5AIQBLJ5ZKYGGSW7DAZVXCJBFHQ@2\m\enforcer-rules\target\enforcer-rules-3.0.0-SNAPSHOT.jar
[windows-jdk9] [INFO] 
[windows-jdk9] [INFO] --- maven-site-plugin:3.7:attach-descriptor (attach-descriptor) @ enforcer-rules
---
[windows-jdk9] [INFO] Skipping because packaging 'jar' is not pom.
[windows-jdk9] [INFO] 
[windows-jdk9] [INFO] --- maven-jar-plugin:3.0.2:test-jar (default) @ enforcer-rules ---
[windows-jdk9] [INFO] Building jar: F:\jenkins\jenkins-slave\workspace\n-box_maven-enforcer_master-KHI64AG3D4VZKUKLMNAYHKONI5AIQBLJ5ZKYGGSW7DAZVXCJBFHQ@2\m\enforcer-rules\target\enforcer-rules-3.0.0-SNAPSHOT-tests.jar
[windows-jdk9] [INFO] 
[windows-jdk9] [INFO] --- maven-checkstyle-plugin:3.0.0:check (checkstyle-check) @ enforcer-rules
---
[Pipeline] [windows-jdk7] }
[windows-jdk7] [withMaven] One or multiple Maven executions have been ignored by the Jenkins
Pipeline Maven Plugin because they have been interrupted before completion (1). See Pipeline
Maven Plugin FAQ for more details.
[Pipeline] [windows-jdk7] // withMaven
[Pipeline] [windows-jdk7] echo
[windows-jdk7] [FAIL FAST] windows-jdk10 had first failure, ignoring script returned exit
code -1
[Pipeline] [windows-jdk7] }
[Pipeline] [windows-jdk7] // stage
[Pipeline] [windows-jdk7] }
[Pipeline] [windows-jdk7] // node
[Pipeline] [windows-jdk7] }
[windows-jdk8] After 10s process did not stop
[Pipeline] [windows-jdk8] }
[Pipeline] [windows-jdk8] // dir
[Pipeline] [windows-jdk8] }
[windows-jdk8] [withMaven] One or multiple Maven executions have been ignored by the Jenkins
Pipeline Maven Plugin because they have been interrupted before completion (1). See Pipeline
Maven Plugin FAQ for more details.
[Pipeline] [windows-jdk8] // withMaven
[Pipeline] [windows-jdk8] echo
[windows-jdk8] [FAIL FAST] windows-jdk10 had first failure, ignoring null
[Pipeline] [windows-jdk8] }
[Pipeline] [windows-jdk8] // stage
[Pipeline] [windows-jdk8] }
[Pipeline] [windows-jdk8] // node
[Pipeline] [windows-jdk8] }
[windows-jdk9] After 10s process did not stop
[Pipeline] [windows-jdk9] }
[Pipeline] [windows-jdk9] // dir
[Pipeline] [windows-jdk9] }
[windows-jdk9] [withMaven] One or multiple Maven executions have been ignored by the Jenkins
Pipeline Maven Plugin because they have been interrupted before completion (1). See Pipeline
Maven Plugin FAQ for more details.
[Pipeline] [windows-jdk9] // withMaven
[Pipeline] [windows-jdk9] echo
[windows-jdk9] [FAIL FAST] windows-jdk10 had first failure, ignoring null
[Pipeline] [windows-jdk9] }
[Pipeline] [windows-jdk9] // stage
[Pipeline] [windows-jdk9] }
[Pipeline] [windows-jdk9] // node
[Pipeline] [windows-jdk9] }
[Pipeline] // parallel
[Pipeline] echo
***** FAST FAILURE *****

Fast failure triggered by windows-jdk10

***** FAST FAILURE *****
[Pipeline] stage
[Pipeline] { (Notifications)
[Pipeline] echo
Build result: FAILURE
[Pipeline] jiraIssueSelector
[Pipeline] jiraComment
[Pipeline] emailext
Mime
  • Unnamed multipart/mixed (inline, None, 0 bytes)
View raw message