maven-notifications mailing list archives

Site index · List index
Message view « Date » · « Thread »
Top « Date » · « Thread »
From Apache Jenkins Server <jenk...@builds.apache.org>
Subject Build failed in Jenkins: Maven TLP » maven-archiver » MSHARED-726 #1
Date Sun, 06 May 2018 12:49:29 GMT
See https://builds.apache.org/job/maven-box/job/maven-archiver/job/MSHARED-726/1/

No changes.

1 tests failed.
FAILED:  org.apache.maven.archiver.MavenArchiverTest.testRecreation

Error Message:
expected:<1525610956000> but was:<1525610896000>

Stack Trace:
java.lang.AssertionError: expected:<1525610956000> but was:<1525610896000>
	at org.apache.maven.archiver.MavenArchiverTest.testRecreation(MavenArchiverTest.java:248)




Build log:
[...truncated 546.04 KB...]
[linux-jdk9] [INFO] Exclude: .java-version
[linux-jdk9] [INFO] 27 resources included (use -debug for more details)
[linux-jdk10] fatal: bad object 005a4ef5e07c06395b8f1eaf1aedd68b97aa8446
[Pipeline] [linux-jdk10] }
[Pipeline] [linux-jdk10] // dir
[Pipeline] [linux-jdk10] }
[Pipeline] [linux-jdk10] // stage
[Pipeline] [linux-jdk10] stage
[Pipeline] [linux-jdk10] { (Build linux-jdk10)
[Pipeline] [linux-jdk10] withMaven
[linux-jdk10] [withMaven] Options: [org.jenkinsci.plugins.pipeline.maven.publishers.GeneratedArtifactsPublisher[disabled=true],
org.jenkinsci.plugins.pipeline.maven.publishers.JunitTestsPublisher[disabled=false], org.jenkinsci.plugins.pipeline.maven.publishers.FindbugsAnalysisPublisher[disabled=true],
org.jenkinsci.plugins.pipeline.maven.publishers.TasksScannerPublisher[disabled=true], org.jenkinsci.plugins.pipeline.maven.publishers.DependenciesFingerprintPublisher[disabled=false,
scopes=[compile, provided, runtime], versions={snapshot:true, release:false}], org.jenkinsci.plugins.pipeline.maven.publishers.InvokerRunsPublisher[disabled=false],
org.jenkinsci.plugins.pipeline.maven.publishers.PipelineGraphPublisher[disabled=false, scopes=[compile,
provided, runtime], versions={snapshot:true, release:false}, skipDownstreamTriggers=false,
lifecycleThreshold=deploy, ignoreUpstreamTriggers=false]]
[linux-jdk10] [withMaven] Available options: 
[linux-jdk10] [withMaven] using JDK installation JDK 10 (latest)
[linux-jdk10] [withMaven] using Maven installation 'Maven 3.5.2'
[Pipeline] [linux-jdk10] {
[Pipeline] [linux-jdk10] dir
[linux-jdk10] Running in /home/jenkins/jenkins-slave/workspace/_maven-archiver_MSHARED-726-QYZEZMMZOOJLVTLFVZWUJYRKQVG2JQWD4KFGLLDI5RYA7EO46BIA/m
[Pipeline] [linux-jdk10] {
[linux-jdk9] [INFO] Rat check: Summary over all files. Unapproved: 0, unknown: 0, generated:
0, approved: 22 licenses.
[linux-jdk9] [INFO] 
[linux-jdk9] [INFO] --- maven-remote-resources-plugin:1.5:process (process-resource-bundles)
@ maven-archiver ---
[linux-jdk9] [INFO] 
[linux-jdk9] [INFO] --- maven-resources-plugin:3.0.2:resources (default-resources) @ maven-archiver
---
[linux-jdk9] [INFO] Using 'UTF-8' encoding to copy filtered resources.
[linux-jdk9] [INFO] skip non existing resourceDirectory /home/jenkins/jenkins-slave/workspace/_maven-archiver_MSHARED-726-QYZEZMMZOOJLVTLFVZWUJYRKQVG2JQWD4KFGLLDI5RYA7EO46BIA/m/src/main/resources
[linux-jdk9] [INFO] Copying 3 resources
[linux-jdk9] [INFO] 
[linux-jdk9] [INFO] --- maven-compiler-plugin:3.7.0:compile (default-compile) @ maven-archiver
---
[linux-jdk9] [INFO] Changes detected - recompiling the module!
[linux-jdk9] [INFO] Compiling 5 source files to /home/jenkins/jenkins-slave/workspace/_maven-archiver_MSHARED-726-QYZEZMMZOOJLVTLFVZWUJYRKQVG2JQWD4KFGLLDI5RYA7EO46BIA/m/target/classes
[Pipeline] [linux-jdk10] isUnix
[Pipeline] [linux-jdk10] sh
[linux-jdk9] [INFO] 
[linux-jdk9] [INFO] --- maven-resources-plugin:3.0.2:testResources (default-testResources)
@ maven-archiver ---
[linux-jdk9] [INFO] Using 'UTF-8' encoding to copy filtered resources.
[linux-jdk9] [INFO] Copying 7 resources
[linux-jdk9] [INFO] Copying 3 resources
[linux-jdk9] [INFO] 
[linux-jdk9] [INFO] --- maven-compiler-plugin:3.7.0:testCompile (default-testCompile) @ maven-archiver
---
[linux-jdk9] [INFO] Changes detected - recompiling the module!
[linux-jdk9] [INFO] Compiling 4 source files to /home/jenkins/jenkins-slave/workspace/_maven-archiver_MSHARED-726-QYZEZMMZOOJLVTLFVZWUJYRKQVG2JQWD4KFGLLDI5RYA7EO46BIA/m/target/test-classes
[linux-jdk10] [m] Running shell script
[linux-jdk10] + mvn -P+run-its -Dmaven.test.failure.ignore=true -Dfindbugs.failOnError=false
-Dfindbugs.skip=true clean verify
[linux-jdk10] ----- withMaven Wrapper script -----
[linux-jdk10] Picked up JAVA_TOOL_OPTIONS: -Dmaven.ext.class.path="/home/jenkins/jenkins-slave/workspace/_maven-archiver_MSHARED-726-QYZEZMMZOOJLVTLFVZWUJYRKQVG2JQWD4KFGLLDI5RYA7EO46BIA@tmp/withMaven4dc14a31/pipeline-maven-spy.jar"
-Dorg.jenkinsci.plugins.pipeline.maven.reportsFolder="/home/jenkins/jenkins-slave/workspace/_maven-archiver_MSHARED-726-QYZEZMMZOOJLVTLFVZWUJYRKQVG2JQWD4KFGLLDI5RYA7EO46BIA@tmp/withMaven4dc14a31"

[linux-jdk10] Apache Maven 3.5.2 (138edd61fd100ec658bfa2d307c43b76940a5d7d; 2017-10-18T07:58:13Z)
[linux-jdk10] Maven home: /home/jenkins/tools/maven/apache-maven-3.5.2
[linux-jdk10] Java version: 10, vendor: Oracle Corporation
[linux-jdk10] Java home: /usr/local/asfpackages/java/jdk-10_46
[linux-jdk10] Default locale: en_US, platform encoding: ISO-8859-1
[linux-jdk10] OS name: "linux", version: "4.4.0-112-generic", arch: "amd64", family: "unix"
[linux-jdk9] [INFO] /home/jenkins/jenkins-slave/workspace/_maven-archiver_MSHARED-726-QYZEZMMZOOJLVTLFVZWUJYRKQVG2JQWD4KFGLLDI5RYA7EO46BIA/m/src/test/java/org/apache/maven/archiver/MockArtifact.java:
Some input files use or override a deprecated API.
[linux-jdk9] [INFO] /home/jenkins/jenkins-slave/workspace/_maven-archiver_MSHARED-726-QYZEZMMZOOJLVTLFVZWUJYRKQVG2JQWD4KFGLLDI5RYA7EO46BIA/m/src/test/java/org/apache/maven/archiver/MockArtifact.java:
Recompile with -Xlint:deprecation for details.
[linux-jdk9] [INFO] 
[linux-jdk9] [INFO] --- maven-surefire-plugin:2.20.1:test (default-test) @ maven-archiver
---
[linux-jdk9] [INFO] 
[linux-jdk9] [INFO] -------------------------------------------------------
[linux-jdk9] [INFO]  T E S T S
[linux-jdk9] [INFO] -------------------------------------------------------
[linux-jdk9] [INFO] Running org.apache.maven.archiver.MavenArchiverTest
[linux-jdk9] [INFO] Building jar: /home/jenkins/jenkins-slave/workspace/_maven-archiver_MSHARED-726-QYZEZMMZOOJLVTLFVZWUJYRKQVG2JQWD4KFGLLDI5RYA7EO46BIA/m/target/test/dummy.jar
[linux-jdk9] [INFO] Building jar: /home/jenkins/jenkins-slave/workspace/_maven-archiver_MSHARED-726-QYZEZMMZOOJLVTLFVZWUJYRKQVG2JQWD4KFGLLDI5RYA7EO46BIA/m/target/test/dummy.jar
[linux-jdk9] [INFO] Building jar: /home/jenkins/jenkins-slave/workspace/_maven-archiver_MSHARED-726-QYZEZMMZOOJLVTLFVZWUJYRKQVG2JQWD4KFGLLDI5RYA7EO46BIA/m/target/test/dummy-defaults.jar
[linux-jdk9] [INFO] Building jar: /home/jenkins/jenkins-slave/workspace/_maven-archiver_MSHARED-726-QYZEZMMZOOJLVTLFVZWUJYRKQVG2JQWD4KFGLLDI5RYA7EO46BIA/m/target/test/dummy-explicit-simple.jar
[linux-jdk9] [INFO] Building jar: /home/jenkins/jenkins-slave/workspace/_maven-archiver_MSHARED-726-QYZEZMMZOOJLVTLFVZWUJYRKQVG2JQWD4KFGLLDI5RYA7EO46BIA/m/target/test/dummy.jar
[linux-jdk9] [INFO] Building jar: /home/jenkins/jenkins-slave/workspace/_maven-archiver_MSHARED-726-QYZEZMMZOOJLVTLFVZWUJYRKQVG2JQWD4KFGLLDI5RYA7EO46BIA/m/target/test/dummy.jar
[linux-jdk9] [INFO] Building jar: /home/jenkins/jenkins-slave/workspace/_maven-archiver_MSHARED-726-QYZEZMMZOOJLVTLFVZWUJYRKQVG2JQWD4KFGLLDI5RYA7EO46BIA/m/target/test/dummy.jar
[linux-jdk9] [INFO] Building jar: /home/jenkins/jenkins-slave/workspace/_maven-archiver_MSHARED-726-QYZEZMMZOOJLVTLFVZWUJYRKQVG2JQWD4KFGLLDI5RYA7EO46BIA/m/target/test/dummy.jar
[linux-jdk9] [INFO] Building jar: /home/jenkins/jenkins-slave/workspace/_maven-archiver_MSHARED-726-QYZEZMMZOOJLVTLFVZWUJYRKQVG2JQWD4KFGLLDI5RYA7EO46BIA/m/target/test/dummy.jar
[linux-jdk9] [INFO] Building jar: /home/jenkins/jenkins-slave/workspace/_maven-archiver_MSHARED-726-QYZEZMMZOOJLVTLFVZWUJYRKQVG2JQWD4KFGLLDI5RYA7EO46BIA/m/target/test/dummy.jar
[linux-jdk9] [INFO] Building jar: /home/jenkins/jenkins-slave/workspace/_maven-archiver_MSHARED-726-QYZEZMMZOOJLVTLFVZWUJYRKQVG2JQWD4KFGLLDI5RYA7EO46BIA/m/target/test/dummy.jar
[linux-jdk9] [INFO] Building jar: /home/jenkins/jenkins-slave/workspace/_maven-archiver_MSHARED-726-QYZEZMMZOOJLVTLFVZWUJYRKQVG2JQWD4KFGLLDI5RYA7EO46BIA/m/target/test/dummy.jar
[linux-jdk9] [INFO] Building jar: /home/jenkins/jenkins-slave/workspace/_maven-archiver_MSHARED-726-QYZEZMMZOOJLVTLFVZWUJYRKQVG2JQWD4KFGLLDI5RYA7EO46BIA/m/target/test/dummy.jar
[linux-jdk9] [INFO] Building jar: /home/jenkins/jenkins-slave/workspace/_maven-archiver_MSHARED-726-QYZEZMMZOOJLVTLFVZWUJYRKQVG2JQWD4KFGLLDI5RYA7EO46BIA/m/target/test/dummy-custom-layout-repo-non-unique.jar
[linux-jdk9] [INFO] Building jar: /home/jenkins/jenkins-slave/workspace/_maven-archiver_MSHARED-726-QYZEZMMZOOJLVTLFVZWUJYRKQVG2JQWD4KFGLLDI5RYA7EO46BIA/m/target/test/dummy.jar
[linux-jdk9] [INFO] Building jar: /home/jenkins/jenkins-slave/workspace/_maven-archiver_MSHARED-726-QYZEZMMZOOJLVTLFVZWUJYRKQVG2JQWD4KFGLLDI5RYA7EO46BIA/m/target/test/dummyWithDashes.jar
[linux-jdk9] [INFO] Building jar: /home/jenkins/jenkins-slave/workspace/_maven-archiver_MSHARED-726-QYZEZMMZOOJLVTLFVZWUJYRKQVG2JQWD4KFGLLDI5RYA7EO46BIA/m/target/test/dummy.jar
[linux-jdk9] [INFO] Building jar: /home/jenkins/jenkins-slave/workspace/_maven-archiver_MSHARED-726-QYZEZMMZOOJLVTLFVZWUJYRKQVG2JQWD4KFGLLDI5RYA7EO46BIA/m/target/test/dummy.jar
[linux-jdk9] [INFO] Building jar: /home/jenkins/jenkins-slave/workspace/_maven-archiver_MSHARED-726-QYZEZMMZOOJLVTLFVZWUJYRKQVG2JQWD4KFGLLDI5RYA7EO46BIA/m/target/test/dummy-custom-layout-simple.jar
[linux-jdk9] [INFO] Building jar: /home/jenkins/jenkins-slave/workspace/_maven-archiver_MSHARED-726-QYZEZMMZOOJLVTLFVZWUJYRKQVG2JQWD4KFGLLDI5RYA7EO46BIA/m/target/test/dummy-custom-layout-repo.jar
[linux-jdk9] [INFO] Building jar: /home/jenkins/jenkins-slave/workspace/_maven-archiver_MSHARED-726-QYZEZMMZOOJLVTLFVZWUJYRKQVG2JQWD4KFGLLDI5RYA7EO46BIA/m/target/test/dummy.jar
[linux-jdk9] [INFO] Building jar: /home/jenkins/jenkins-slave/workspace/_maven-archiver_MSHARED-726-QYZEZMMZOOJLVTLFVZWUJYRKQVG2JQWD4KFGLLDI5RYA7EO46BIA/m/target/test/dummy-custom-layout-simple-non-unique.jar
[linux-jdk9] [INFO] Building jar: /home/jenkins/jenkins-slave/workspace/_maven-archiver_MSHARED-726-QYZEZMMZOOJLVTLFVZWUJYRKQVG2JQWD4KFGLLDI5RYA7EO46BIA/m/target/test/dummy.jar
[linux-jdk9] [INFO] Building jar: /home/jenkins/jenkins-slave/workspace/_maven-archiver_MSHARED-726-QYZEZMMZOOJLVTLFVZWUJYRKQVG2JQWD4KFGLLDI5RYA7EO46BIA/m/target/test/dummy.jar
[linux-jdk9] [INFO] Building jar: /home/jenkins/jenkins-slave/workspace/_maven-archiver_MSHARED-726-QYZEZMMZOOJLVTLFVZWUJYRKQVG2JQWD4KFGLLDI5RYA7EO46BIA/m/target/test/dummy.jar
[linux-jdk9] [ERROR] Tests run: 27, Failures: 1, Errors: 0, Skipped: 0, Time elapsed: 0.43
s <<< FAILURE! - in org.apache.maven.archiver.MavenArchiverTest
[linux-jdk9] [ERROR] testRecreation(org.apache.maven.archiver.MavenArchiverTest)  Time elapsed:
0.188 s  <<< FAILURE!
[linux-jdk9] java.lang.AssertionError: expected:<1525610956000> but was:<1525610896000>
[linux-jdk9] 	at org.apache.maven.archiver.MavenArchiverTest.testRecreation(MavenArchiverTest.java:248)
[linux-jdk9] 
[linux-jdk9] [INFO] Running org.apache.maven.archiver.MavenArchiveConfigurationTest
[linux-jdk9] [INFO] Tests run: 3, Failures: 0, Errors: 0, Skipped: 0, Time elapsed: 0.017
s - in org.apache.maven.archiver.MavenArchiveConfigurationTest
[linux-jdk9] [INFO] Running org.apache.maven.archiver.ManifestConfigurationTest
[linux-jdk9] [INFO] Tests run: 4, Failures: 0, Errors: 0, Skipped: 0, Time elapsed: 0 s -
in org.apache.maven.archiver.ManifestConfigurationTest
[linux-jdk9] [INFO] 
[linux-jdk9] [INFO] Results:
[linux-jdk9] [INFO] 
[linux-jdk9] [ERROR] Failures: 
[linux-jdk9] [ERROR]   MavenArchiverTest.testRecreation:248 expected:<1525610956000>
but was:<1525610896000>
[linux-jdk9] [INFO] 
[linux-jdk9] [ERROR] Tests run: 34, Failures: 1, Errors: 0, Skipped: 0
[linux-jdk9] [INFO] 
[linux-jdk9] [ERROR] There are test failures.
[linux-jdk9] 
[linux-jdk9] Please refer to /home/jenkins/jenkins-slave/workspace/_maven-archiver_MSHARED-726-QYZEZMMZOOJLVTLFVZWUJYRKQVG2JQWD4KFGLLDI5RYA7EO46BIA/m/target/surefire-reports
for the individual test results.
[linux-jdk9] Please refer to dump files (if any exist) [date]-jvmRun[N].dump, [date].dumpstream
and [date]-jvmRun[N].dumpstream.
[linux-jdk9] [INFO] 
[linux-jdk9] [INFO] --- maven-jar-plugin:3.0.2:jar (default-jar) @ maven-archiver ---
[linux-jdk9] [INFO] Building jar: /home/jenkins/jenkins-slave/workspace/_maven-archiver_MSHARED-726-QYZEZMMZOOJLVTLFVZWUJYRKQVG2JQWD4KFGLLDI5RYA7EO46BIA/m/target/maven-archiver-3.2.1-SNAPSHOT.jar
[linux-jdk9] [INFO] 
[linux-jdk9] [INFO] --- maven-site-plugin:3.7:attach-descriptor (attach-descriptor) @ maven-archiver
---
[linux-jdk10] [INFO] [jenkins-event-spy] Generate /home/jenkins/jenkins-slave/workspace/_maven-archiver_MSHARED-726-QYZEZMMZOOJLVTLFVZWUJYRKQVG2JQWD4KFGLLDI5RYA7EO46BIA@tmp/withMaven4dc14a31/maven-spy-20180506-124916-5546888705264383216150.log.tmp
...
[linux-jdk10] [INFO] Scanning for projects...
[linux-jdk10] [INFO] 
[linux-jdk10] [INFO] ------------------------------------------------------------------------
[linux-jdk10] [INFO] Building Apache Maven Archiver 3.2.1-SNAPSHOT
[linux-jdk10] [INFO] ------------------------------------------------------------------------
[linux-jdk9] [INFO] Skipping because packaging 'jar' is not pom.
[linux-jdk9] [INFO] 
[linux-jdk9] [INFO] --- maven-checkstyle-plugin:3.0.0:check (checkstyle-check) @ maven-archiver
---
[linux-jdk9] [INFO] Downloading from central: https://repo.maven.apache.org/maven2/javax/xml/bind/jaxb-api/2.3.0/jaxb-api-2.3.0.pom
[linux-jdk10] [INFO] 
[linux-jdk10] [INFO] --- maven-clean-plugin:3.0.0:clean (default-clean) @ maven-archiver ---
[linux-jdk10] [INFO] 
[linux-jdk10] [INFO] --- maven-enforcer-plugin:1.4.1:enforce (enforce-maven-version) @ maven-archiver
---
[linux-jdk10] [INFO] 
[linux-jdk10] [INFO] --- maven-enforcer-plugin:1.4.1:enforce (enforce-bytecode-version) @
maven-archiver ---
[linux-jdk9] [INFO] Downloaded from central: https://repo.maven.apache.org/maven2/javax/xml/bind/jaxb-api/2.3.0/jaxb-api-2.3.0.pom
(23 kB at 75 kB/s)
[linux-jdk9] [INFO] Downloading from central: https://repo.maven.apache.org/maven2/javax/xml/bind/jaxb-api-parent/2.3.0/jaxb-api-parent-2.3.0.pom
[linux-jdk9] [INFO] Downloaded from central: https://repo.maven.apache.org/maven2/javax/xml/bind/jaxb-api-parent/2.3.0/jaxb-api-parent-2.3.0.pom
(5.6 kB at 352 kB/s)
[linux-jdk9] [INFO] Downloading from central: https://repo.maven.apache.org/maven2/net/java/jvnet-parent/5/jvnet-parent-5.pom
[linux-jdk9] [INFO] Downloaded from central: https://repo.maven.apache.org/maven2/net/java/jvnet-parent/5/jvnet-parent-5.pom
(8.9 kB at 591 kB/s)
[linux-jdk9] [INFO] Downloading from central: https://repo.maven.apache.org/maven2/javax/xml/bind/jaxb-api/2.3.0/jaxb-api-2.3.0.jar
[linux-jdk9] [INFO] Downloaded from central: https://repo.maven.apache.org/maven2/javax/xml/bind/jaxb-api/2.3.0/jaxb-api-2.3.0.jar
(126 kB at 3.5 MB/s)
[linux-jdk10] [INFO] 
[linux-jdk10] [INFO] --- maven-enforcer-plugin:1.4.1:enforce (ban-known-bad-maven-versions)
@ maven-archiver ---
[linux-jdk10] [INFO] 
[linux-jdk10] [INFO] --- apache-rat-plugin:0.12:check (rat-check) @ maven-archiver ---
[linux-jdk10] [INFO] Enabled default license matchers.
[linux-jdk10] [INFO] Will parse SCM ignores for exclusions...
[linux-jdk10] [INFO] Parsing exclusions from /home/jenkins/jenkins-slave/workspace/_maven-archiver_MSHARED-726-QYZEZMMZOOJLVTLFVZWUJYRKQVG2JQWD4KFGLLDI5RYA7EO46BIA/m/.gitignore
[linux-jdk10] [INFO] Finished adding exclusions from SCM ignore files.
[linux-jdk10] [INFO] 71 implicit excludes (use -debug for more details).
[linux-jdk10] [INFO] Exclude: .repository/**
[linux-jdk10] [INFO] Exclude: .maven/spy.log
[linux-jdk10] [INFO] Exclude: dependency-reduced-pom.xml
[linux-jdk10] [INFO] Exclude: .java-version
[linux-jdk10] [INFO] 27 resources included (use -debug for more details)
[linux-jdk10] [INFO] Rat check: Summary over all files. Unapproved: 0, unknown: 0, generated:
0, approved: 22 licenses.
[linux-jdk9] [INFO] ------------------------------------------------------------------------
[linux-jdk9] [INFO] BUILD SUCCESS
[linux-jdk9] [INFO] ------------------------------------------------------------------------
[linux-jdk9] [INFO] Total time: 10.065 s
[linux-jdk9] [INFO] Finished at: 2018-05-06T12:49:19Z
[linux-jdk9] [INFO] Final Memory: 35M/116M
[linux-jdk9] [INFO] ------------------------------------------------------------------------
[linux-jdk9] [WARNING] The requested profile "run-its" could not be activated because it does
not exist.
[linux-jdk9] [INFO] [jenkins-event-spy] Generated /home/jenkins/jenkins-slave/workspace/_maven-archiver_MSHARED-726-QYZEZMMZOOJLVTLFVZWUJYRKQVG2JQWD4KFGLLDI5RYA7EO46BIA@tmp/withMaven60efa73f/maven-spy-20180506-124909-64617631818555811946299.log
[linux-jdk10] [INFO] 
[linux-jdk10] [INFO] --- maven-remote-resources-plugin:1.5:process (process-resource-bundles)
@ maven-archiver ---
[Pipeline] [linux-jdk9] }
[Pipeline] [linux-jdk9] // dir
[linux-jdk10] [INFO] 
[linux-jdk10] [INFO] --- maven-resources-plugin:3.0.2:resources (default-resources) @ maven-archiver
---
[linux-jdk10] [INFO] Using 'UTF-8' encoding to copy filtered resources.
[linux-jdk10] [INFO] skip non existing resourceDirectory /home/jenkins/jenkins-slave/workspace/_maven-archiver_MSHARED-726-QYZEZMMZOOJLVTLFVZWUJYRKQVG2JQWD4KFGLLDI5RYA7EO46BIA/m/src/main/resources
[linux-jdk10] [INFO] Copying 3 resources
[linux-jdk10] [INFO] 
[linux-jdk10] [INFO] --- maven-compiler-plugin:3.7.0:compile (default-compile) @ maven-archiver
---
[linux-jdk10] [INFO] Changes detected - recompiling the module!
[linux-jdk10] [INFO] Compiling 5 source files to /home/jenkins/jenkins-slave/workspace/_maven-archiver_MSHARED-726-QYZEZMMZOOJLVTLFVZWUJYRKQVG2JQWD4KFGLLDI5RYA7EO46BIA/m/target/classes
[linux-jdk10] [INFO] 
[linux-jdk10] [INFO] --- maven-resources-plugin:3.0.2:testResources (default-testResources)
@ maven-archiver ---
[linux-jdk10] [INFO] Using 'UTF-8' encoding to copy filtered resources.
[linux-jdk10] [INFO] Copying 7 resources
[linux-jdk10] [INFO] Copying 3 resources
[linux-jdk10] [INFO] 
[linux-jdk10] [INFO] --- maven-compiler-plugin:3.7.0:testCompile (default-testCompile) @ maven-archiver
---
[linux-jdk10] [INFO] Changes detected - recompiling the module!
[linux-jdk10] [INFO] Compiling 4 source files to /home/jenkins/jenkins-slave/workspace/_maven-archiver_MSHARED-726-QYZEZMMZOOJLVTLFVZWUJYRKQVG2JQWD4KFGLLDI5RYA7EO46BIA/m/target/test-classes
[linux-jdk10] [INFO] /home/jenkins/jenkins-slave/workspace/_maven-archiver_MSHARED-726-QYZEZMMZOOJLVTLFVZWUJYRKQVG2JQWD4KFGLLDI5RYA7EO46BIA/m/src/test/java/org/apache/maven/archiver/MockArtifact.java:
Some input files use or override a deprecated API.
[linux-jdk10] [INFO] /home/jenkins/jenkins-slave/workspace/_maven-archiver_MSHARED-726-QYZEZMMZOOJLVTLFVZWUJYRKQVG2JQWD4KFGLLDI5RYA7EO46BIA/m/src/test/java/org/apache/maven/archiver/MockArtifact.java:
Recompile with -Xlint:deprecation for details.
[linux-jdk10] [INFO] 
[linux-jdk10] [INFO] --- maven-surefire-plugin:2.20.1:test (default-test) @ maven-archiver
---
[linux-jdk10] [INFO] ------------------------------------------------------------------------
[linux-jdk10] [INFO] BUILD FAILURE
[linux-jdk10] [INFO] ------------------------------------------------------------------------
[linux-jdk10] [INFO] Total time: 7.039 s
[linux-jdk10] [INFO] Finished at: 2018-05-06T12:49:23Z
[linux-jdk10] [INFO] Final Memory: 27M/228M
[linux-jdk10] [INFO] ------------------------------------------------------------------------
[linux-jdk10] [WARNING] The requested profile "run-its" could not be activated because it
does not exist.
[linux-jdk10] [INFO] [jenkins-event-spy] Generated /home/jenkins/jenkins-slave/workspace/_maven-archiver_MSHARED-726-QYZEZMMZOOJLVTLFVZWUJYRKQVG2JQWD4KFGLLDI5RYA7EO46BIA@tmp/withMaven4dc14a31/maven-spy-20180506-124916-5546888705264383216150.log
[linux-jdk10] [ERROR] Failed to execute goal org.apache.maven.plugins:maven-surefire-plugin:2.20.1:test
(default-test) on project maven-archiver: Execution default-test of goal org.apache.maven.plugins:maven-surefire-plugin:2.20.1:test
failed. NullPointerException -> [Help 1]
[linux-jdk10] [ERROR] 
[linux-jdk10] [ERROR] To see the full stack trace of the errors, re-run Maven with the -e
switch.
[linux-jdk10] [ERROR] Re-run Maven using the -X switch to enable full debug logging.
[linux-jdk10] [ERROR] 
[linux-jdk10] [ERROR] For more information about the errors and possible solutions, please
read the following articles:
[linux-jdk10] [ERROR] [Help 1] http://cwiki.apache.org/confluence/display/MAVEN/PluginExecutionException
[Pipeline] [linux-jdk9] }
[linux-jdk9] [withMaven] junitPublisher - Archive test results for Maven artifact org.apache.maven:maven-archiver:3.2.1-SNAPSHOT
generated by maven-surefire-plugin:test (default-test): m/target/surefire-reports/*.xml
[linux-jdk9] Recording test results
[Pipeline] [linux-jdk9] // withMaven
[Pipeline] [linux-jdk9] }
[Pipeline] [linux-jdk10] }
[Pipeline] [linux-jdk9] // stage
[Pipeline] [linux-jdk10] // dir
[Pipeline] [linux-jdk9] }
[Pipeline] [linux-jdk10] }
[linux-jdk10] [withMaven] junitPublisher - Archive test results for Maven artifact org.apache.maven:maven-archiver:3.2.1-SNAPSHOT
generated by maven-surefire-plugin:test (default-test): m/target/surefire-reports/*.xml
[linux-jdk10] Recording test results
[linux-jdk10] None of the test reports contained any result
[Pipeline] [linux-jdk9] // node
[Pipeline] [linux-jdk10] // withMaven
[Pipeline] [linux-jdk9] }
[Pipeline] [linux-jdk10] echo
[linux-jdk10] [FAIL FAST] This is the first failure and likely root cause
[Pipeline] [linux-jdk10] }
[Pipeline] [linux-jdk10] // stage
[Pipeline] [linux-jdk10] }
[Pipeline] [linux-jdk10] // node
[Pipeline] [linux-jdk10] }
[linux-jdk10] Failed in branch linux-jdk10
[Pipeline] [windows-jdk7] // node
[Pipeline] [windows-jdk8] // node
[Pipeline] [windows-jdk9] // node
[Pipeline] [windows-jdk10] // node
[Pipeline] [windows-jdk7] }
[windows-jdk7] Failed in branch windows-jdk7
[Pipeline] [windows-jdk8] }
[windows-jdk8] Failed in branch windows-jdk8
[Pipeline] [windows-jdk9] }
[windows-jdk9] Failed in branch windows-jdk9
[Pipeline] [windows-jdk10] }
[windows-jdk10] Failed in branch windows-jdk10
[Pipeline] // parallel
[Pipeline] echo
***** FAST FAILURE *****

Fast failure triggered by linux-jdk10

***** FAST FAILURE *****
[Pipeline] stage
[Pipeline] { (Notifications)
[Pipeline] echo
Build result: FAILURE
[Pipeline] jiraIssueSelector
[Pipeline] emailext
Mime
  • Unnamed multipart/mixed (inline, None, 0 bytes)
View raw message