maven-notifications mailing list archives

Site index · List index
Message view « Date » · « Thread »
Top « Date » · « Thread »
From Apache Jenkins Server <jenk...@builds.apache.org>
Subject Build failed in Jenkins: Maven TLP » maven-ejb-plugin » MNGSITE-332 #1
Date Tue, 10 Apr 2018 18:52:00 GMT
See https://builds.apache.org/job/maven-box/job/maven-ejb-plugin/job/MNGSITE-332/1/

No changes.

All tests passed

Build log:
[...truncated 920.93 KB...]
[linux-jdk8] [INFO] Building EJB client /home/jenkins/jenkins-slave/workspace/aven-ejb-plugin_MNGSITE-332-6SJUICANGV64TGRHQWCZGDFLJ2FBELQYH7QNUEAJABIWXQJ4C7AQ/m/target/test-classes/unit/test-dir/main-excludes/target/testJar-client.jar
[linux-jdk8] [INFO] Building jar: /home/jenkins/jenkins-slave/workspace/aven-ejb-plugin_MNGSITE-332-6SJUICANGV64TGRHQWCZGDFLJ2FBELQYH7QNUEAJABIWXQJ4C7AQ/m/target/test-classes/unit/test-dir/main-excludes/target/testJar-client.jar
[linux-jdk8] [INFO] Building EJB testJar with EJB version 2.1
[linux-jdk8] [INFO] Building jar: /home/jenkins/jenkins-slave/workspace/aven-ejb-plugin_MNGSITE-332-6SJUICANGV64TGRHQWCZGDFLJ2FBELQYH7QNUEAJABIWXQJ4C7AQ/m/target/test-classes/unit/test-dir/classified-noclient/target/testJar-classified.jar
[linux-jdk8] [INFO] Building EJB testJar with EJB version 2.1
[linux-jdk8] [INFO] Building jar: /home/jenkins/jenkins-slave/workspace/aven-ejb-plugin_MNGSITE-332-6SJUICANGV64TGRHQWCZGDFLJ2FBELQYH7QNUEAJABIWXQJ4C7AQ/m/target/test-classes/unit/test-dir/default-noclient/target/testJar.jar
[linux-jdk8] [INFO] Building EJB testJar with EJB version 2.1
[linux-jdk8] [INFO] Building jar: /home/jenkins/jenkins-slave/workspace/aven-ejb-plugin_MNGSITE-332-6SJUICANGV64TGRHQWCZGDFLJ2FBELQYH7QNUEAJABIWXQJ4C7AQ/m/target/test-classes/unit/test-dir/includes-excludes-client/target/testJar.jar
[linux-jdk8] [INFO] Building EJB client /home/jenkins/jenkins-slave/workspace/aven-ejb-plugin_MNGSITE-332-6SJUICANGV64TGRHQWCZGDFLJ2FBELQYH7QNUEAJABIWXQJ4C7AQ/m/target/test-classes/unit/test-dir/includes-excludes-client/target/testJar-client.jar
[linux-jdk8] [INFO] Building jar: /home/jenkins/jenkins-slave/workspace/aven-ejb-plugin_MNGSITE-332-6SJUICANGV64TGRHQWCZGDFLJ2FBELQYH7QNUEAJABIWXQJ4C7AQ/m/target/test-classes/unit/test-dir/includes-excludes-client/target/testJar-client.jar
[linux-jdk8] [INFO] Building EJB testJar with EJB version 3.0
[linux-jdk8] [INFO] Building jar: /home/jenkins/jenkins-slave/workspace/aven-ejb-plugin_MNGSITE-332-6SJUICANGV64TGRHQWCZGDFLJ2FBELQYH7QNUEAJABIWXQJ4C7AQ/m/target/test-classes/unit/test-dir/compliance-descriptor-3/target/testJar.jar
[linux-jdk8] [INFO] Building EJB testJar with EJB version 2.1
[linux-jdk8] [INFO] Building jar: /home/jenkins/jenkins-slave/workspace/aven-ejb-plugin_MNGSITE-332-6SJUICANGV64TGRHQWCZGDFLJ2FBELQYH7QNUEAJABIWXQJ4C7AQ/m/target/test-classes/unit/test-dir/default-client/target/testJar.jar
[linux-jdk8] [INFO] Building EJB client /home/jenkins/jenkins-slave/workspace/aven-ejb-plugin_MNGSITE-332-6SJUICANGV64TGRHQWCZGDFLJ2FBELQYH7QNUEAJABIWXQJ4C7AQ/m/target/test-classes/unit/test-dir/default-client/target/testJar-client.jar
[linux-jdk8] [INFO] Building jar: /home/jenkins/jenkins-slave/workspace/aven-ejb-plugin_MNGSITE-332-6SJUICANGV64TGRHQWCZGDFLJ2FBELQYH7QNUEAJABIWXQJ4C7AQ/m/target/test-classes/unit/test-dir/default-client/target/testJar-client.jar
[linux-jdk8] [INFO] Tests run: 15, Failures: 0, Errors: 0, Skipped: 0, Time elapsed: 2.086
s - in org.apache.maven.plugins.ejb.EjbMojoTest
[linux-jdk8] [INFO] Running org.apache.maven.plugins.ejb.EjbHelperTest
[linux-jdk8] [INFO] Tests run: 10, Failures: 0, Errors: 0, Skipped: 0, Time elapsed: 0.031
s - in org.apache.maven.plugins.ejb.EjbHelperTest
[linux-jdk8] [INFO] Running org.apache.maven.plugins.ejb.IncludesExcludesTest
[linux-jdk8] [INFO] Tests run: 5, Failures: 0, Errors: 0, Skipped: 0, Time elapsed: 0 s -
in org.apache.maven.plugins.ejb.IncludesExcludesTest
[linux-jdk8] [INFO] 
[linux-jdk8] [INFO] Results:
[linux-jdk8] [INFO] 
[linux-jdk8] [INFO] Tests run: 30, Failures: 0, Errors: 0, Skipped: 0
[linux-jdk8] [INFO] 
[linux-jdk8] [INFO] 
[linux-jdk8] [INFO] --- maven-jar-plugin:3.0.2:jar (default-jar) @ maven-ejb-plugin ---
[windows-jdk10] Checking out Revision 27cfea7a7ecaf0c3b9f3d91276a16815403896d3 (MNGSITE-332)
[windows-jdk10]  > git config core.sparsecheckout # timeout=10
[windows-jdk10]  > git checkout -f 27cfea7a7ecaf0c3b9f3d91276a16815403896d3
[windows-jdk10] Commit message: "- Changed download templates of plugins not to reference
.md5 anymore"
[windows-jdk10] Cleaning workspace
[windows-jdk10]  > git rev-parse --verify HEAD # timeout=10
[windows-jdk10] Resetting working tree
[windows-jdk10]  > git reset --hard # timeout=10
[windows-jdk10]  > git clean -fdx # timeout=10
[linux-jdk8] [INFO] Building jar: /home/jenkins/jenkins-slave/workspace/aven-ejb-plugin_MNGSITE-332-6SJUICANGV64TGRHQWCZGDFLJ2FBELQYH7QNUEAJABIWXQJ4C7AQ/m/target/maven-ejb-plugin-3.0.1-SNAPSHOT.jar
[linux-jdk8] [INFO] 
[linux-jdk8] [INFO] --- maven-plugin-plugin:3.5.1:addPluginArtifactMetadata (default-addPluginArtifactMetadata)
@ maven-ejb-plugin ---
[linux-jdk8] [INFO] 
[linux-jdk8] [INFO] --- maven-site-plugin:3.7:attach-descriptor (attach-descriptor) @ maven-ejb-plugin
---
[linux-jdk8] [INFO] Skipping because packaging 'maven-plugin' is not pom.
[linux-jdk8] [INFO] 
[linux-jdk8] [INFO] --- maven-invoker-plugin:3.0.1:install (integration-test) @ maven-ejb-plugin
---
[windows-jdk10] fatal: bad object 090e7ee9c188397dc0a755b7eb60600eb6c2c0c9
[Pipeline] [windows-jdk10] }
[Pipeline] [windows-jdk10] // dir
[Pipeline] [windows-jdk10] }
[Pipeline] [windows-jdk10] // stage
[Pipeline] [windows-jdk10] stage
[Pipeline] [windows-jdk10] { (Build windows-jdk10)
[linux-jdk8] [INFO] Installing /home/jenkins/jenkins-slave/workspace/aven-ejb-plugin_MNGSITE-332-6SJUICANGV64TGRHQWCZGDFLJ2FBELQYH7QNUEAJABIWXQJ4C7AQ/m/pom.xml
to /home/jenkins/jenkins-slave/workspace/aven-ejb-plugin_MNGSITE-332-6SJUICANGV64TGRHQWCZGDFLJ2FBELQYH7QNUEAJABIWXQJ4C7AQ/m/target/local-repo/org/apache/maven/plugins/maven-ejb-plugin/3.0.1-SNAPSHOT/maven-ejb-plugin-3.0.1-SNAPSHOT.pom
[linux-jdk8] [INFO] Installing /home/jenkins/jenkins-slave/workspace/aven-ejb-plugin_MNGSITE-332-6SJUICANGV64TGRHQWCZGDFLJ2FBELQYH7QNUEAJABIWXQJ4C7AQ/m/target/maven-ejb-plugin-3.0.1-SNAPSHOT.jar
to /home/jenkins/jenkins-slave/workspace/aven-ejb-plugin_MNGSITE-332-6SJUICANGV64TGRHQWCZGDFLJ2FBELQYH7QNUEAJABIWXQJ4C7AQ/m/target/local-repo/org/apache/maven/plugins/maven-ejb-plugin/3.0.1-SNAPSHOT/maven-ejb-plugin-3.0.1-SNAPSHOT.jar
[linux-jdk8] [INFO] 
[linux-jdk8] [INFO] --- maven-invoker-plugin:3.0.1:integration-test (integration-test) @ maven-ejb-plugin
---
[linux-jdk8] [INFO] Running Setup Jobs
[linux-jdk8] [INFO] Building: setup/pom.xml
[Pipeline] [windows-jdk10] withMaven
[windows-jdk10] [withMaven] Options: [org.jenkinsci.plugins.pipeline.maven.publishers.GeneratedArtifactsPublisher[disabled=true],
org.jenkinsci.plugins.pipeline.maven.publishers.JunitTestsPublisher[disabled=false], org.jenkinsci.plugins.pipeline.maven.publishers.FindbugsAnalysisPublisher[disabled=true],
org.jenkinsci.plugins.pipeline.maven.publishers.TasksScannerPublisher[disabled=true], org.jenkinsci.plugins.pipeline.maven.publishers.DependenciesFingerprintPublisher[disabled=false,
scopes=[compile, provided, runtime], versions={snapshot:true, release:false}], org.jenkinsci.plugins.pipeline.maven.publishers.InvokerRunsPublisher[disabled=false],
org.jenkinsci.plugins.pipeline.maven.publishers.PipelineGraphPublisher[disabled=false, scopes=[compile,
provided, runtime], versions={snapshot:true, release:false}, skipDownstreamTriggers=false,
lifecycleThreshold=deploy, ignoreUpstreamTriggers=false]]
[windows-jdk10] [withMaven] Available options: 
[windows-jdk10] [withMaven] using JDK installation JDK 10 b46 (Windows Only)
[windows-jdk10] [withMaven] using Maven installation 'Maven 3.5.0 (Windows)'
[Pipeline] [windows-jdk10] {
[Pipeline] [windows-jdk10] dir
[windows-jdk10] Running in f:\jenkins\jenkins-slave\workspace\aven-ejb-plugin_MNGSITE-332-6SJUICANGV64TGRHQWCZGDFLJ2FBELQYH7QNUEAJABIWXQJ4C7AQ\m
[Pipeline] [windows-jdk10] {
[Pipeline] [windows-jdk10] isUnix
[Pipeline] [windows-jdk10] bat
[windows-jdk10] [m] Running batch script
[windows-jdk10] 
[windows-jdk10] f:\jenkins\jenkins-slave\workspace\aven-ejb-plugin_MNGSITE-332-6SJUICANGV64TGRHQWCZGDFLJ2FBELQYH7QNUEAJABIWXQJ4C7AQ\m>mvn
-P+run-its -Dmaven.test.failure.ignore=true -Dfindbugs.failOnError=false -Dfindbugs.skip=true
clean verify 
[windows-jdk10] ----- withMaven Wrapper script -----
[windows-jdk10] Picked up JAVA_TOOL_OPTIONS: -Dmaven.ext.class.path="f:\jenkins\jenkins-slave\workspace\aven-ejb-plugin_MNGSITE-332-6SJUICANGV64TGRHQWCZGDFLJ2FBELQYH7QNUEAJABIWXQJ4C7AQ@tmp\withMaven0690e3ec\pipeline-maven-spy.jar"
-Dorg.jenkinsci.plugins.pipeline.maven.reportsFolder="f:\jenkins\jenkins-slave\workspace\aven-ejb-plugin_MNGSITE-332-6SJUICANGV64TGRHQWCZGDFLJ2FBELQYH7QNUEAJABIWXQJ4C7AQ@tmp\withMaven0690e3ec"

[windows-jdk10] Apache Maven 3.5.0 (ff8f5e7444045639af65f6095c62210b5713f426; 2017-04-03T19:39:06Z)
[windows-jdk10] Maven home: F:\jenkins\tools\maven\apache-maven-3.5.0\bin\..
[windows-jdk10] Java version: 10, vendor: Oracle Corporation
[windows-jdk10] Java home: F:\jenkins\tools\java\jdk10_46
[windows-jdk10] Default locale: en_US, platform encoding: Cp1252
[windows-jdk10] OS name: "windows server 2012 r2", version: "6.3", arch: "amd64", family:
"windows"
[linux-jdk8] [INFO]           setup/pom.xml .................................... SUCCESS (3.4
s)
[linux-jdk8] [INFO] Building: exclude-ejb-jar-xml/pom.xml
[windows-jdk10] [INFO] [jenkins-event-spy] Generate F:\jenkins\jenkins-slave\workspace\aven-ejb-plugin_MNGSITE-332-6SJUICANGV64TGRHQWCZGDFLJ2FBELQYH7QNUEAJABIWXQJ4C7AQ@tmp\withMaven0690e3ec\maven-spy-20180410-185137-1232010716484205671454.log.tmp
...
[windows-jdk10] [INFO] Scanning for projects...
[windows-jdk10] [INFO] 
[windows-jdk10] [INFO] ------------------------------------------------------------------------
[windows-jdk10] [INFO] Building Apache Maven EJB Plugin 3.0.1-SNAPSHOT
[windows-jdk10] [INFO] ------------------------------------------------------------------------
[windows-jdk10] [INFO] 
[windows-jdk10] [INFO] --- maven-clean-plugin:3.0.0:clean (default-clean) @ maven-ejb-plugin
---
[windows-jdk10] [INFO] 
[windows-jdk10] [INFO] --- maven-enforcer-plugin:1.4.1:enforce (enforce-maven-version) @ maven-ejb-plugin
---
[windows-jdk9] [INFO] run post-build script verify.bsh
[windows-jdk9] [INFO]           mejb-34-not-filtered\pom.xml ..................... SUCCESS
(7.5 s)
[windows-jdk9] [INFO] Building: MEJB-72\pom.xml
[windows-jdk10] [INFO] 
[windows-jdk10] [INFO] --- maven-enforcer-plugin:1.4.1:enforce (enforce-bytecode-version)
@ maven-ejb-plugin ---
[windows-jdk10] [INFO] 
[windows-jdk10] [INFO] --- maven-enforcer-plugin:1.4.1:enforce (ban-known-bad-maven-versions)
@ maven-ejb-plugin ---
[windows-jdk10] [INFO] 
[windows-jdk10] [INFO] --- maven-enforcer-plugin:1.4.1:enforce (ensure-no-container-api) @
maven-ejb-plugin ---
[windows-jdk10] [INFO] 
[windows-jdk10] [INFO] --- apache-rat-plugin:0.12:check (rat-check) @ maven-ejb-plugin ---
[windows-jdk10] [INFO] Enabled default license matchers.
[windows-jdk10] [INFO] Will parse SCM ignores for exclusions...
[windows-jdk10] [INFO] Parsing exclusions from f:\jenkins\jenkins-slave\workspace\aven-ejb-plugin_MNGSITE-332-6SJUICANGV64TGRHQWCZGDFLJ2FBELQYH7QNUEAJABIWXQJ4C7AQ\m\.gitignore
[windows-jdk10] [INFO] Finished adding exclusions from SCM ignore files.
[windows-jdk10] [INFO] 71 implicit excludes (use -debug for more details).
[windows-jdk10] [INFO] Exclude: .repository/**
[windows-jdk10] [INFO] Exclude: .maven/spy.log
[windows-jdk10] [INFO] Exclude: dependency-reduced-pom.xml
[windows-jdk10] [INFO] Exclude: .java-version
[windows-jdk10] [INFO] 60 resources included (use -debug for more details)
[windows-jdk10] [INFO] Rat check: Summary over all files. Unapproved: 0, unknown: 0, generated:
0, approved: 60 licenses.
[windows-jdk10] [INFO] 
[windows-jdk10] [INFO] --- maven-plugin-plugin:3.5.1:helpmojo (generate-helpmojo) @ maven-ejb-plugin
---
[windows-jdk10] [INFO] Downloading: https://repo.maven.apache.org/maven2/org/ow2/asm/asm/6.0_ALPHA/asm-6.0_ALPHA.pom
[windows-jdk10] [INFO] Downloaded: https://repo.maven.apache.org/maven2/org/ow2/asm/asm/6.0_ALPHA/asm-6.0_ALPHA.pom
(1.9 kB at 5.4 kB/s)
[windows-jdk10] [INFO] Downloading: https://repo.maven.apache.org/maven2/org/ow2/asm/asm-parent/6.0_ALPHA/asm-parent-6.0_ALPHA.pom
[windows-jdk10] [INFO] Downloaded: https://repo.maven.apache.org/maven2/org/ow2/asm/asm-parent/6.0_ALPHA/asm-parent-6.0_ALPHA.pom
(5.5 kB at 344 kB/s)
[windows-jdk10] [INFO] Downloading: https://repo.maven.apache.org/maven2/org/ow2/asm/asm-commons/6.0_ALPHA/asm-commons-6.0_ALPHA.pom
[windows-jdk10] [INFO] Downloaded: https://repo.maven.apache.org/maven2/org/ow2/asm/asm-commons/6.0_ALPHA/asm-commons-6.0_ALPHA.pom
(2.1 kB at 123 kB/s)
[windows-jdk10] [INFO] Downloading: https://repo.maven.apache.org/maven2/org/ow2/asm/asm-tree/6.0_ALPHA/asm-tree-6.0_ALPHA.pom
[windows-jdk10] [INFO] Downloaded: https://repo.maven.apache.org/maven2/org/ow2/asm/asm-tree/6.0_ALPHA/asm-tree-6.0_ALPHA.pom
(2.1 kB at 130 kB/s)
[windows-jdk10] [INFO] Downloading: https://repo.maven.apache.org/maven2/org/ow2/asm/asm-commons/6.0_ALPHA/asm-commons-6.0_ALPHA.jar
[windows-jdk10] [INFO] Downloading: https://repo.maven.apache.org/maven2/org/ow2/asm/asm/6.0_ALPHA/asm-6.0_ALPHA.jar
[windows-jdk10] [INFO] Downloading: https://repo.maven.apache.org/maven2/org/ow2/asm/asm-tree/6.0_ALPHA/asm-tree-6.0_ALPHA.jar
[windows-jdk10] [INFO] Downloaded: https://repo.maven.apache.org/maven2/org/ow2/asm/asm/6.0_ALPHA/asm-6.0_ALPHA.jar
(56 kB at 1.1 MB/s)
[windows-jdk10] [INFO] Downloaded: https://repo.maven.apache.org/maven2/org/ow2/asm/asm-commons/6.0_ALPHA/asm-commons-6.0_ALPHA.jar
(49 kB at 934 kB/s)
[windows-jdk10] [INFO] Downloaded: https://repo.maven.apache.org/maven2/org/ow2/asm/asm-tree/6.0_ALPHA/asm-tree-6.0_ALPHA.jar
(32 kB at 397 kB/s)
[windows-jdk10] [INFO] Using 'UTF-8' encoding to read mojo source files.
[windows-jdk10] [INFO] java-javadoc mojo extractor found 0 mojo descriptor.
[windows-jdk10] [INFO] java-annotations mojo extractor found 0 mojo descriptor.
[windows-jdk10] [INFO] 
[windows-jdk10] [INFO] --- maven-remote-resources-plugin:1.5:process (process-resource-bundles)
@ maven-ejb-plugin ---
[windows-jdk10] [INFO] 
[windows-jdk10] [INFO] --- maven-resources-plugin:3.0.2:resources (default-resources) @ maven-ejb-plugin
---
[windows-jdk10] [INFO] Using 'UTF-8' encoding to copy filtered resources.
[windows-jdk10] [INFO] Copying 1 resource
[linux-jdk8] [INFO] run post-build script verify.bsh
[linux-jdk8] [INFO]           exclude-ejb-jar-xml/pom.xml ...................... SUCCESS (5.5
s)
[linux-jdk8] [INFO] Building: mejb-34-not-filtered/pom.xml
[windows-jdk10] [INFO] Copying 3 resources
[windows-jdk10] [INFO] 
[windows-jdk10] [INFO] --- maven-compiler-plugin:3.7.0:compile (default-compile) @ maven-ejb-plugin
---
[windows-jdk10] [INFO] Changes detected - recompiling the module!
[windows-jdk10] [INFO] Compiling 4 source files to f:\jenkins\jenkins-slave\workspace\aven-ejb-plugin_MNGSITE-332-6SJUICANGV64TGRHQWCZGDFLJ2FBELQYH7QNUEAJABIWXQJ4C7AQ\m\target\classes
[windows-jdk10] [INFO] 
[windows-jdk10] [INFO] --- maven-plugin-plugin:3.5.1:descriptor (default-descriptor) @ maven-ejb-plugin
---
[windows-jdk10] [INFO] Using 'UTF-8' encoding to read mojo source files.
[windows-jdk10] [INFO] java-javadoc mojo extractor found 0 mojo descriptor.
[windows-jdk10] [INFO] java-annotations mojo extractor found 2 mojo descriptors.
[windows-jdk10] [INFO] 
[windows-jdk10] [INFO] --- maven-resources-plugin:3.0.2:testResources (default-testResources)
@ maven-ejb-plugin ---
[windows-jdk10] [INFO] Using 'UTF-8' encoding to copy filtered resources.
[windows-jdk10] [INFO] Copying 1 resource
[windows-jdk10] [INFO] Copying 3 resources
[windows-jdk10] [INFO] 
[windows-jdk10] [INFO] --- maven-compiler-plugin:3.7.0:testCompile (default-testCompile) @
maven-ejb-plugin ---
[windows-jdk10] [INFO] Changes detected - recompiling the module!
[windows-jdk10] [INFO] Compiling 9 source files to f:\jenkins\jenkins-slave\workspace\aven-ejb-plugin_MNGSITE-332-6SJUICANGV64TGRHQWCZGDFLJ2FBELQYH7QNUEAJABIWXQJ4C7AQ\m\target\test-classes
[windows-jdk10] [INFO] /f:/jenkins/jenkins-slave/workspace/aven-ejb-plugin_MNGSITE-332-6SJUICANGV64TGRHQWCZGDFLJ2FBELQYH7QNUEAJABIWXQJ4C7AQ/m/src/test/java/org/apache/maven/plugins/ejb/stub/ArtifactStub.java:
f:\jenkins\jenkins-slave\workspace\aven-ejb-plugin_MNGSITE-332-6SJUICANGV64TGRHQWCZGDFLJ2FBELQYH7QNUEAJABIWXQJ4C7AQ\m\src\test\java\org\apache\maven\plugins\ejb\stub\ArtifactStub.java
uses or overrides a deprecated API.
[windows-jdk10] [INFO] /f:/jenkins/jenkins-slave/workspace/aven-ejb-plugin_MNGSITE-332-6SJUICANGV64TGRHQWCZGDFLJ2FBELQYH7QNUEAJABIWXQJ4C7AQ/m/src/test/java/org/apache/maven/plugins/ejb/stub/ArtifactStub.java:
Recompile with -Xlint:deprecation for details.
[windows-jdk10] [INFO] 
[windows-jdk10] [INFO] --- maven-surefire-plugin:2.20.1:test (default-test) @ maven-ejb-plugin
---
[windows-jdk10] [INFO] ------------------------------------------------------------------------
[windows-jdk10] [INFO] BUILD FAILURE
[windows-jdk10] [INFO] ------------------------------------------------------------------------
[windows-jdk10] [INFO] Total time: 8.738 s
[windows-jdk10] [INFO] Finished at: 2018-04-10T18:51:46Z
[windows-jdk10] [INFO] Final Memory: 33M/117M
[windows-jdk10] [INFO] ------------------------------------------------------------------------
[windows-jdk10] [INFO] [jenkins-event-spy] Generated F:\jenkins\jenkins-slave\workspace\aven-ejb-plugin_MNGSITE-332-6SJUICANGV64TGRHQWCZGDFLJ2FBELQYH7QNUEAJABIWXQJ4C7AQ@tmp\withMaven0690e3ec\maven-spy-20180410-185137-1232010716484205671454.log
[windows-jdk10] [ERROR] Failed to execute goal org.apache.maven.plugins:maven-surefire-plugin:2.20.1:test
(default-test) on project maven-ejb-plugin: Execution default-test of goal org.apache.maven.plugins:maven-surefire-plugin:2.20.1:test
failed. NullPointerException -> [Help 1]
[windows-jdk10] [ERROR] 
[windows-jdk10] [ERROR] To see the full stack trace of the errors, re-run Maven with the -e
switch.
[windows-jdk10] [ERROR] Re-run Maven using the -X switch to enable full debug logging.
[windows-jdk10] [ERROR] 
[windows-jdk10] [ERROR] For more information about the errors and possible solutions, please
read the following articles:
[windows-jdk10] [ERROR] [Help 1] http://cwiki.apache.org/confluence/display/MAVEN/PluginExecutionException
[Pipeline] [windows-jdk10] }
[Pipeline] [windows-jdk10] // dir
[Pipeline] [windows-jdk10] }
[windows-jdk10] [withMaven] junitPublisher - Archive test results for Maven artifact org.apache.maven.plugins:maven-ejb-plugin:3.0.1-SNAPSHOT
generated by maven-surefire-plugin:test (default-test): m\target\surefire-reports\*.xml
[windows-jdk10] [withMaven] junitPublisher - Jenkins JUnit Attachments Plugin not found, can't
publish test attachments.Recording test results
[windows-jdk10] None of the test reports contained any result
[Pipeline] [windows-jdk10] // withMaven
[Pipeline] [windows-jdk10] echo
[windows-jdk10] [FAIL FAST] This is the first failure and likely root cause
[Pipeline] [windows-jdk10] }
[Pipeline] [windows-jdk10] // stage
[Pipeline] [windows-jdk10] }
[Pipeline] [windows-jdk10] // node
[Pipeline] [windows-jdk10] }
[linux-jdk8] Sending interrupt signal to process
[windows-jdk10] Failed in branch windows-jdk10
[linux-jdk8] [INFO] run post-build script verify.bsh
[linux-jdk8] [INFO]           mejb-34-not-filtered/pom.xml ..................... SUCCESS (3.9
s)
[linux-jdk8] [INFO] Building: reactor/pom.xml
[linux-jdk8] [INFO] run post-build script verify.bsh
[linux-jdk8] [INFO]           reactor/pom.xml .................................. FAILED (0.6
s)
[linux-jdk8] [INFO]   The post-build script did not succeed. Missing /home/jenkins/jenkins-slave/workspace/aven-ejb-plugin_MNGSITE-332-6SJUICANGV64TGRHQWCZGDFLJ2FBELQYH7QNUEAJABIWXQJ4C7AQ/m/target/it/reactor/sub/target/sub-1.0.jar
[linux-jdk8] [INFO] Building: mejb-34-filtered/pom.xml
[windows-jdk9] Sending interrupt signal to process
[linux-jdk8] Terminated
[Pipeline] [linux-jdk9] // node
[Pipeline] [linux-jdk10] // node
[Pipeline] [linux-jdk9] }
[linux-jdk9] Failed in branch linux-jdk9
[Pipeline] [linux-jdk10] }
[linux-jdk10] Failed in branch linux-jdk10
[Pipeline] [linux-jdk8] }
[Pipeline] [linux-jdk8] // dir
[Pipeline] [linux-jdk8] }
[linux-jdk8] [withMaven] One or multiple Maven executions have been ignored by the Jenkins
Pipeline Maven Plugin because they have been interrupted before completion (1). See Pipeline
Maven Plugin FAQ for more details.
[Pipeline] [linux-jdk8] // withMaven
[Pipeline] [linux-jdk8] echo
[linux-jdk8] [FAIL FAST] windows-jdk10 had first failure, ignoring script returned exit code
143
[Pipeline] [linux-jdk8] }
[Pipeline] [linux-jdk8] // stage
[Pipeline] [linux-jdk8] }
[Pipeline] [linux-jdk8] // node
[Pipeline] [linux-jdk8] }
[windows-jdk9] After 10s process did not stop
[Pipeline] [windows-jdk9] }
[Pipeline] [windows-jdk9] // dir
[Pipeline] [windows-jdk9] }
[windows-jdk9] [withMaven] One or multiple Maven executions have been ignored by the Jenkins
Pipeline Maven Plugin because they have been interrupted before completion (1). See Pipeline
Maven Plugin FAQ for more details.
[Pipeline] [windows-jdk9] // withMaven
[Pipeline] [windows-jdk9] echo
[windows-jdk9] [FAIL FAST] windows-jdk10 had first failure, ignoring null
[Pipeline] [windows-jdk9] }
[Pipeline] [windows-jdk9] // stage
[Pipeline] [windows-jdk9] }
[Pipeline] [windows-jdk9] // node
[Pipeline] [windows-jdk9] }
[Pipeline] // parallel
[Pipeline] echo
***** FAST FAILURE *****

Fast failure triggered by windows-jdk10

***** FAST FAILURE *****
[Pipeline] stage
[Pipeline] { (Notifications)
[Pipeline] echo
Build result: FAILURE
[Pipeline] jiraIssueSelector
[Pipeline] emailext
Mime
  • Unnamed multipart/mixed (inline, None, 0 bytes)
View raw message