maven-notifications mailing list archives

Site index · List index
Message view « Date » · « Thread »
Top « Date » · « Thread »
From Apache Jenkins Server <jenk...@builds.apache.org>
Subject Build failed in Jenkins: Maven TLP » maven-project-info-reports-plugin » MPIR-366 #16
Date Fri, 13 Apr 2018 11:25:29 GMT
See https://builds.apache.org/job/maven-box/job/maven-project-info-reports-plugin/job/MPIR-366/16/

Changes:

* [MPIR-366] Drop Maven 2 support
* [MPIR-366] Drop Maven 2 support
* [MPIR-366] Drop Maven 2 support
* [MPIR-366] Drop Maven 2 support

All tests passed

Build log:
[...truncated 190.70 KB...]
[windows-jdk8] [INFO] ..SUCCESS (3.2 s)
[windows-jdk8] [INFO] Building: MPIR-251\pom.xml
[windows-jdk10] [INFO] ..FAILED (9.4 s)
[windows-jdk10] [INFO]   The build exited with code 1. See f:\jenkins\jenkins-slave\workspace\nfo-reports-plugin_MPIR-366-S464FI4ATSVOULE3N7MCKV5FYYG6GVHDD7OLISMYBGUEPLQM2UNA@2\m\target\it\git\build.log
for details.
[windows-jdk10] [INFO] Building: java-version\pom.xml
[windows-jdk10] [INFO] run script verify.groovy
[windows-jdk10] WARNING: An illegal reflective access operation has occurred
[windows-jdk10] WARNING: Illegal reflective access by org.codehaus.groovy.reflection.CachedClass$3$1
(file:/f:/jenkins/jenkins-slave/workspace/nfo-reports-plugin_MPIR-366-S464FI4ATSVOULE3N7MCKV5FYYG6GVHDD7OLISMYBGUEPLQM2UNA@2/.repository/org/codehaus/groovy/groovy/2.0.1/groovy-2.0.1.jar)
to method java.lang.Object.finalize()
[windows-jdk10] WARNING: Please consider reporting this to the maintainers of org.codehaus.groovy.reflection.CachedClass$3$1
[windows-jdk10] WARNING: Use --illegal-access=warn to enable warnings of further illegal reflective
access operations
[windows-jdk10] WARNING: All illegal access operations will be denied in a future release
[windows-jdk10] [INFO] ..SUCCESS (8.4 s)
[windows-jdk10] [INFO] Building: minimal-pom\pom.xml
[windows-jdk8] [INFO] run script verify.groovy
[windows-jdk8] [INFO] ..SUCCESS (8.9 s)
[windows-jdk8] [INFO] Building: MPIR-300\pom.xml
[windows-jdk8] [INFO] run script verify.groovy
[windows-jdk8] [INFO] ..SUCCESS (3.4 s)
[windows-jdk8] [INFO] Building: MPIR-349\parent\pom.xml
[windows-jdk10] [INFO] ..FAILED (7.4 s)
[windows-jdk10] [INFO]   The build exited with code 1. See f:\jenkins\jenkins-slave\workspace\nfo-reports-plugin_MPIR-366-S464FI4ATSVOULE3N7MCKV5FYYG6GVHDD7OLISMYBGUEPLQM2UNA@2\m\target\it\minimal-pom\build.log
for details.
[windows-jdk10] [INFO] Building: mpir-229\pom.xml
[windows-jdk8] [INFO] run script verify.groovy
[windows-jdk8] [INFO] ..SUCCESS (6.1 s)
[windows-jdk8] [INFO] Building: multi-module\pom.xml
[windows-jdk7] [INFO] run script verify.bsh
[windows-jdk7] [INFO] ..SUCCESS (63.6 s)
[windows-jdk7] [INFO] Building: git\pom.xml
[windows-jdk7] [INFO] ..SUCCESS (7.9 s)
[windows-jdk7] [INFO] Building: java-version\pom.xml
[windows-jdk10] [INFO] ..FAILED (7.9 s)
[windows-jdk10] [INFO]   The build exited with code 1. See f:\jenkins\jenkins-slave\workspace\nfo-reports-plugin_MPIR-366-S464FI4ATSVOULE3N7MCKV5FYYG6GVHDD7OLISMYBGUEPLQM2UNA@2\m\target\it\mpir-229\build.log
for details.
[windows-jdk10] [INFO] Building: MPIR-242\pom.xml
[windows-jdk7] [INFO] run script verify.groovy
[windows-jdk7] [INFO] ..SUCCESS (7.3 s)
[windows-jdk7] [INFO] Building: minimal-pom\pom.xml
[windows-jdk10] [INFO] ..FAILED (7.1 s)
[windows-jdk10] [INFO]   The build exited with code 1. See f:\jenkins\jenkins-slave\workspace\nfo-reports-plugin_MPIR-366-S464FI4ATSVOULE3N7MCKV5FYYG6GVHDD7OLISMYBGUEPLQM2UNA@2\m\target\it\MPIR-242\build.log
for details.
[windows-jdk10] [INFO] Building: MPIR-251\pom.xml
[windows-jdk8] [INFO] run script verify.groovy
[windows-jdk8] [INFO] ..SUCCESS (14.3 s)
[windows-jdk8] [INFO] 
[windows-jdk8] [INFO] --- maven-checkstyle-plugin:2.15:check (checkstyle-check) @ maven-project-info-reports-plugin
---
[windows-jdk8] [INFO] There are 10 errors reported by Checkstyle 6.1.1 with config/maven_checks.xml
ruleset.
[windows-jdk8] [INFO] Ignored 10 errors, 0 violation remaining.
[windows-jdk8] [INFO] 
[windows-jdk8] [INFO] --- maven-jarsigner-plugin:1.3.2:verify (verify) @ maven-project-info-reports-plugin
---
[windows-jdk8] [WARNING] Picked up JAVA_TOOL_OPTIONS: -Dmaven.ext.class.path="f:\jenkins\jenkins-slave\workspace\nfo-reports-plugin_MPIR-366-S464FI4ATSVOULE3N7MCKV5FYYG6GVHDD7OLISMYBGUEPLQM2UNA@tmp\withMaven04f0b473\pipeline-maven-spy.jar"
-Dorg.jenkinsci.plugins.pipeline.maven.reportsFolder="f:\jenkins\jenkins-slave\workspace\nfo-reports-plugin_MPIR-366-S464FI4ATSVOULE3N7MCKV5FYYG6GVHDD7OLISMYBGUEPLQM2UNA@tmp\withMaven04f0b473"

[windows-jdk8] [INFO] 1 archive(s) processed
[windows-jdk8] [INFO] 
[windows-jdk8] [INFO] --- maven-invoker-plugin:2.0.0:verify (integration-test) @ maven-project-info-reports-plugin
---
[windows-jdk8] [INFO] -------------------------------------------------
[windows-jdk8] [INFO] Build Summary:
[windows-jdk8] [INFO]   Passed: 11, Failed: 0, Errors: 0, Skipped: 0
[windows-jdk8] [INFO] -------------------------------------------------
[windows-jdk8] [INFO] ------------------------------------------------------------------------
[windows-jdk8] [INFO] BUILD SUCCESS
[windows-jdk8] [INFO] ------------------------------------------------------------------------
[windows-jdk8] [INFO] Total time: 02:15 min
[windows-jdk8] [INFO] Finished at: 2018-04-13T11:24:13Z
[windows-jdk8] [INFO] Final Memory: 57M/834M
[windows-jdk8] [INFO] ------------------------------------------------------------------------
[windows-jdk8] [INFO] [jenkins-event-spy] Generated F:\jenkins\jenkins-slave\workspace\nfo-reports-plugin_MPIR-366-S464FI4ATSVOULE3N7MCKV5FYYG6GVHDD7OLISMYBGUEPLQM2UNA@tmp\withMaven04f0b473\maven-spy-20180413-112158-5363034362552047268025.log
[windows-jdk8] Picked up JAVA_TOOL_OPTIONS: -Dmaven.ext.class.path="f:\jenkins\jenkins-slave\workspace\nfo-reports-plugin_MPIR-366-S464FI4ATSVOULE3N7MCKV5FYYG6GVHDD7OLISMYBGUEPLQM2UNA@tmp\withMaven04f0b473\pipeline-maven-spy.jar"
-Dorg.jenkinsci.plugins.pipeline.maven.reportsFolder="f:\jenkins\jenkins-slave\workspace\nfo-reports-plugin_MPIR-366-S464FI4ATSVOULE3N7MCKV5FYYG6GVHDD7OLISMYBGUEPLQM2UNA@tmp\withMaven04f0b473"

[Pipeline] [windows-jdk8] }
[Pipeline] [windows-jdk8] // dir
[windows-jdk10] [INFO] run script verify.groovy
[windows-jdk10] [INFO] ..SUCCESS (12.7 s)
[windows-jdk10] [INFO] Building: MPIR-300\pom.xml
[windows-jdk7] [INFO] run script verify.bsh
[windows-jdk7] [INFO] ..SUCCESS (15.3 s)
[windows-jdk7] [INFO] Building: mpir-229\pom.xml
[windows-jdk10] [INFO] run script verify.groovy
[windows-jdk10] [INFO] ..SUCCESS (6.6 s)
[windows-jdk10] [INFO] Building: MPIR-349\parent\pom.xml
[windows-jdk7] [INFO] run script verify.groovy
[windows-jdk7] [INFO] ..SUCCESS (8.0 s)
[windows-jdk7] [INFO] Building: MPIR-242\pom.xml
[Pipeline] [windows-jdk8] }
[windows-jdk8] [withMaven] junitPublisher - Archive test results for Maven artifact org.apache.maven.plugins:maven-project-info-reports-plugin:2.10-SNAPSHOT
generated by maven-surefire-plugin:test (default-test): m\target\surefire-reports\*.xml
[windows-jdk8] [withMaven] junitPublisher - Jenkins JUnit Attachments Plugin not found, can't
publish test attachments.Recording test results
[windows-jdk8] [withMaven] junitPublisher - Archive test results for Maven artifact org.apache.maven.plugins.project-info-reports.its:dep:1.0-SNAPSHOT
generated by maven-surefire-plugin:test (default-test): m\target\it\multi-module\dep\target\surefire-reports\*.xml
[windows-jdk8] [withMaven] junitPublisher - Jenkins JUnit Attachments Plugin not found, can't
publish test attachments.Recording test results
[windows-jdk8] None of the test reports contained any result
[windows-jdk8] [withMaven] junitPublisher - Archive test results for Maven artifact org.apache.maven.plugins.project-info-reports.its:main:1.0-SNAPSHOT
generated by maven-surefire-plugin:test (default-test): m\target\it\multi-module\main\target\surefire-reports\*.xml
[windows-jdk8] [withMaven] junitPublisher - Jenkins JUnit Attachments Plugin not found, can't
publish test attachments.Recording test results
[windows-jdk8] None of the test reports contained any result
[Pipeline] [windows-jdk8] // withMaven
[Pipeline] [windows-jdk8] }
[Pipeline] [windows-jdk8] // stage
[Pipeline] [windows-jdk8] }
[Pipeline] [windows-jdk8] // node
[Pipeline] [windows-jdk8] }
[windows-jdk9] [INFO] run script verify.bsh
[windows-jdk9] [INFO] ..SUCCESS (78.0 s)
[windows-jdk9] [INFO] Building: git\pom.xml
[windows-jdk9] [INFO] ..SUCCESS (10.7 s)
[windows-jdk9] [INFO] Building: java-version\pom.xml
[windows-jdk7] [INFO] run script verify.groovy
[windows-jdk7] [INFO] ..SUCCESS (7.6 s)
[windows-jdk7] [INFO] Building: MPIR-251\pom.xml
[windows-jdk9] [INFO] run script verify.groovy
[windows-jdk9] [INFO] ..SUCCESS (8.5 s)
[windows-jdk9] [INFO] Building: minimal-pom\pom.xml
[windows-jdk10] [INFO] run script verify.groovy
[windows-jdk10] [INFO] ..SUCCESS (16.1 s)
[windows-jdk10] [INFO] Building: multi-module\pom.xml
[windows-jdk7] [INFO] run script verify.groovy
[windows-jdk7] [INFO] ..SUCCESS (13.4 s)
[windows-jdk7] [INFO] Building: MPIR-300\pom.xml
[windows-jdk7] [INFO] run script verify.groovy
[windows-jdk7] [INFO] ..SUCCESS (7.5 s)
[windows-jdk7] [INFO] Building: MPIR-349\parent\pom.xml
[windows-jdk9] [INFO] run script verify.bsh
[windows-jdk9] [INFO] ..SUCCESS (21.4 s)
[windows-jdk9] [INFO] Building: mpir-229\pom.xml
[windows-jdk10] [INFO] ..FAILED (26.7 s)
[windows-jdk10] [INFO]   The build exited with code 1. See f:\jenkins\jenkins-slave\workspace\nfo-reports-plugin_MPIR-366-S464FI4ATSVOULE3N7MCKV5FYYG6GVHDD7OLISMYBGUEPLQM2UNA@2\m\target\it\multi-module\build.log
for details.
[windows-jdk10] [INFO] 
[windows-jdk10] [INFO] --- maven-checkstyle-plugin:2.15:check (checkstyle-check) @ maven-project-info-reports-plugin
---
[windows-jdk10] [INFO] There are 10 errors reported by Checkstyle 6.1.1 with config/maven_checks.xml
ruleset.
[windows-jdk10] [INFO] Ignored 10 errors, 0 violation remaining.
[windows-jdk10] [INFO] 
[windows-jdk10] [INFO] --- maven-jarsigner-plugin:1.3.2:verify (verify) @ maven-project-info-reports-plugin
---
[windows-jdk10] [WARNING] Picked up JAVA_TOOL_OPTIONS: -Dmaven.ext.class.path="f:\jenkins\jenkins-slave\workspace\nfo-reports-plugin_MPIR-366-S464FI4ATSVOULE3N7MCKV5FYYG6GVHDD7OLISMYBGUEPLQM2UNA@2@tmp\withMavenbede9e9d\pipeline-maven-spy.jar"
-Dorg.jenkinsci.plugins.pipeline.maven.reportsFolder="f:\jenkins\jenkins-slave\workspace\nfo-reports-plugin_MPIR-366-S464FI4ATSVOULE3N7MCKV5FYYG6GVHDD7OLISMYBGUEPLQM2UNA@2@tmp\withMavenbede9e9d"

[windows-jdk7] [INFO] run script verify.groovy
[windows-jdk7] [INFO] ..SUCCESS (13.7 s)
[windows-jdk7] [INFO] Building: multi-module\pom.xml
[windows-jdk10] [INFO] 1 archive(s) processed
[windows-jdk10] [INFO] 
[windows-jdk10] [INFO] --- maven-invoker-plugin:2.0.0:verify (integration-test) @ maven-project-info-reports-plugin
---
[windows-jdk10] [INFO] -------------------------------------------------
[windows-jdk10] [INFO] Build Summary:
[windows-jdk10] [INFO]   Passed: 4, Failed: 7, Errors: 0, Skipped: 0
[windows-jdk10] [INFO] -------------------------------------------------
[windows-jdk10] [ERROR] The following builds failed:
[windows-jdk10] [ERROR] *  dependencies-java-1.7-and-1.8\pom.xml
[windows-jdk10] [ERROR] *  full-pom\pom.xml
[windows-jdk10] [ERROR] *  git\pom.xml
[windows-jdk10] [ERROR] *  minimal-pom\pom.xml
[windows-jdk10] [ERROR] *  mpir-229\pom.xml
[windows-jdk10] [ERROR] *  MPIR-242\pom.xml
[windows-jdk10] [ERROR] *  multi-module\pom.xml
[windows-jdk10] [INFO] -------------------------------------------------
[windows-jdk10] [INFO] ------------------------------------------------------------------------
[windows-jdk10] [INFO] BUILD FAILURE
[windows-jdk10] [INFO] ------------------------------------------------------------------------
[windows-jdk10] [INFO] Total time: 03:18 min
[windows-jdk10] [INFO] Finished at: 2018-04-13T11:25:16Z
[windows-jdk10] [INFO] Final Memory: 46M/157M
[windows-jdk10] [INFO] ------------------------------------------------------------------------
[windows-jdk10] [INFO] [jenkins-event-spy] Generated F:\jenkins\jenkins-slave\workspace\nfo-reports-plugin_MPIR-366-S464FI4ATSVOULE3N7MCKV5FYYG6GVHDD7OLISMYBGUEPLQM2UNA@2@tmp\withMavenbede9e9d\maven-spy-20180413-112158-2696568582629414114562.log
[windows-jdk10] [ERROR] Failed to execute goal org.apache.maven.plugins:maven-invoker-plugin:2.0.0:verify
(integration-test) on project maven-project-info-reports-plugin: 7 builds failed. See console
output above for details. -> [Help 1]
[windows-jdk10] [ERROR] 
[windows-jdk10] [ERROR] To see the full stack trace of the errors, re-run Maven with the -e
switch.
[windows-jdk10] [ERROR] Re-run Maven using the -X switch to enable full debug logging.
[windows-jdk10] [ERROR] 
[windows-jdk10] [ERROR] For more information about the errors and possible solutions, please
read the following articles:
[windows-jdk10] [ERROR] [Help 1] http://cwiki.apache.org/confluence/display/MAVEN/MojoFailureException
[Pipeline] [windows-jdk10] }
[Pipeline] [windows-jdk10] // dir
[windows-jdk9] [INFO] run script verify.groovy
[windows-jdk9] [INFO] ..SUCCESS (9.5 s)
[windows-jdk9] [INFO] Building: MPIR-242\pom.xml
[Pipeline] [windows-jdk10] }
[windows-jdk10] [withMaven] junitPublisher - Archive test results for Maven artifact org.apache.maven.plugins:maven-project-info-reports-plugin:2.10-SNAPSHOT
generated by maven-surefire-plugin:test (default-test): m\target\surefire-reports\*.xml
[windows-jdk10] [withMaven] junitPublisher - Jenkins JUnit Attachments Plugin not found, can't
publish test attachments.Recording test results
[windows-jdk10] [withMaven] junitPublisher - Archive test results for Maven artifact org.apache.maven.plugins.project-info-reports.its:dep:1.0-SNAPSHOT
generated by maven-surefire-plugin:test (default-test): m\target\it\multi-module\dep\target\surefire-reports\*.xml
[windows-jdk10] [withMaven] junitPublisher - Jenkins JUnit Attachments Plugin not found, can't
publish test attachments.Recording test results
[windows-jdk10] None of the test reports contained any result
[windows-jdk10] [withMaven] junitPublisher - Archive test results for Maven artifact org.apache.maven.plugins.project-info-reports.its:main:1.0-SNAPSHOT
generated by maven-surefire-plugin:test (default-test): m\target\it\multi-module\main\target\surefire-reports\*.xml
[windows-jdk10] [withMaven] junitPublisher - Jenkins JUnit Attachments Plugin not found, can't
publish test attachments.Recording test results
[windows-jdk10] None of the test reports contained any result
[Pipeline] [windows-jdk10] // withMaven
[Pipeline] [windows-jdk10] echo
[windows-jdk10] [FAIL FAST] This is the first failure and likely root cause
[Pipeline] [windows-jdk10] }
[Pipeline] [windows-jdk10] // stage
[Pipeline] [windows-jdk10] }
[Pipeline] [windows-jdk10] // node
[Pipeline] [windows-jdk10] }
[windows-jdk10] Failed in branch windows-jdk10
[windows-jdk7] Sending interrupt signal to process
[windows-jdk7] [INFO] ..FAILED (6.2 s)
[windows-jdk7] [INFO]   The build exited with code -1. See f:\jenkins\jenkins-slave\workspace\nfo-reports-plugin_MPIR-366-S464FI4ATSVOULE3N7MCKV5FYYG6GVHDD7OLISMYBGUEPLQM2UNA\m\target\it\multi-module\build.log
for details.
[windows-jdk7] [INFO] 
[windows-jdk7] [INFO] --- maven-checkstyle-plugin:2.15:check (checkstyle-check) @ maven-project-info-reports-plugin
---
[windows-jdk7] [INFO] Downloading: https://repo.maven.apache.org/maven2/org/apache/maven/shared/maven-shared-resources/2/maven-shared-resources-2.pom
[windows-jdk7] [INFO] Downloaded: https://repo.maven.apache.org/maven2/org/apache/maven/shared/maven-shared-resources/2/maven-shared-resources-2.pom
(3.0 kB at 269 kB/s)
[windows-jdk7] [INFO] Downloading: https://repo.maven.apache.org/maven2/org/codehaus/plexus/plexus-utils/3.0.10/plexus-utils-3.0.10.pom
[windows-jdk7] [INFO] Downloaded: https://repo.maven.apache.org/maven2/org/codehaus/plexus/plexus-utils/3.0.10/plexus-utils-3.0.10.pom
(3.1 kB at 393 kB/s)
[windows-jdk9] Sending interrupt signal to process
[Pipeline] [linux-jdk7] // node
[Pipeline] [linux-jdk8] // node
[Pipeline] [linux-jdk9] // node
[Pipeline] [linux-jdk10] // node
[Pipeline] [linux-jdk7] }
[linux-jdk7] Failed in branch linux-jdk7
[Pipeline] [linux-jdk8] }
[linux-jdk8] Failed in branch linux-jdk8
[Pipeline] [linux-jdk9] }
[linux-jdk9] Failed in branch linux-jdk9
[Pipeline] [linux-jdk10] }
[linux-jdk10] Failed in branch linux-jdk10
[Pipeline] [windows-jdk7] }
[Pipeline] [windows-jdk7] // dir
[windows-jdk9] [INFO] run script verify.groovy
[windows-jdk9] [INFO] ..FAILED (3.7 s)
[windows-jdk9] [INFO]   The post-build script did not succeed. assert licensePage.exists()
[windows-jdk9]        |           |
[windows-jdk9]        |           false
[windows-jdk9]        f:\jenkins\jenkins-slave\workspace\nfo-reports-plugin_MPIR-366-S464FI4ATSVOULE3N7MCKV5FYYG6GVHDD7OLISMYBGUEPLQM2UNA\m\target\it\MPIR-242\target\site\license.html
[windows-jdk9] [INFO] Building: MPIR-251\pom.xml
[Pipeline] [windows-jdk7] }
[windows-jdk7] [withMaven] One or multiple Maven executions have been ignored by the Jenkins
Pipeline Maven Plugin because they have been interrupted before completion (2). See Pipeline
Maven Plugin FAQ for more details.
[Pipeline] [windows-jdk7] // withMaven
[Pipeline] [windows-jdk7] echo
[windows-jdk7] [FAIL FAST] windows-jdk10 had first failure, ignoring script returned exit
code -1
[Pipeline] [windows-jdk7] }
[Pipeline] [windows-jdk9] }
[Pipeline] [windows-jdk7] // stage
[Pipeline] [windows-jdk9] // dir
[Pipeline] [windows-jdk7] }
[Pipeline] [windows-jdk9] }
[windows-jdk9] [withMaven] One or multiple Maven executions have been ignored by the Jenkins
Pipeline Maven Plugin because they have been interrupted before completion (2). See Pipeline
Maven Plugin FAQ for more details.
[Pipeline] [windows-jdk7] // node
[Pipeline] [windows-jdk9] // withMaven
[Pipeline] [windows-jdk7] }
[Pipeline] [windows-jdk9] echo
[windows-jdk9] [FAIL FAST] windows-jdk10 had first failure, ignoring script returned exit
code -1
[Pipeline] [windows-jdk9] }
[Pipeline] [windows-jdk9] // stage
[Pipeline] [windows-jdk9] }
[Pipeline] [windows-jdk9] // node
[Pipeline] [windows-jdk9] }
[Pipeline] // parallel
[Pipeline] echo
***** FAST FAILURE *****

Fast failure triggered by windows-jdk10

***** FAST FAILURE *****
[Pipeline] stage
[Pipeline] { (Notifications)
[Pipeline] echo
Build result: FAILURE
[Pipeline] jiraIssueSelector
[Pipeline] jiraComment
[Pipeline] emailext
Mime
  • Unnamed multipart/mixed (inline, None, 0 bytes)
View raw message