maven-notifications mailing list archives

Site index · List index
Message view « Date » · « Thread »
Top « Date » · « Thread »
From Apache Jenkins Server <jenk...@builds.apache.org>
Subject Build failed in Jenkins: Maven TLP » maven-pdf-plugin » master #14
Date Wed, 25 Apr 2018 15:42:26 GMT
See https://builds.apache.org/job/maven-box/job/maven-pdf-plugin/job/master/14/

Changes:

* fixed typo
* formatting cleanup
* [MPDF-88] upgraded Doxia Sitetools to 1.8.1
* fixed typo
* formatting cleanup
* [MPDF-88] upgraded Doxia Sitetools to 1.8.1
* fixed typo
* formatting cleanup
* [MPDF-88] upgraded Doxia Sitetools to 1.8.1

No tests ran.

Build log:
[...truncated 120.54 KB...]
[windows-jdk8] [INFO] Using 'UTF-8' encoding to copy filtered resources.
[windows-jdk8] [INFO] Copying 14 resources
[windows-jdk8] [INFO] Copying 3 resources
[windows-jdk8] [INFO] 
[windows-jdk8] [INFO] --- maven-compiler-plugin:3.7.0:testCompile (default-testCompile) @
maven-pdf-plugin ---
[windows-jdk8] [INFO] Changes detected - recompiling the module!
[windows-jdk8] [INFO] Compiling 8 source files to f:\jenkins\jenkins-slave\workspace\box_maven-pdf-plugin_master-FPCFJFGXNRRHGLAILVNFYWPL2XYTEX5DLUMGNQ6QU547MZNTAW3Q@2\m\target\test-classes
[windows-jdk7] [INFO] 
[windows-jdk7] [INFO] -------------------------------------------------------
[windows-jdk7] [INFO]  T E S T S
[windows-jdk7] [INFO] -------------------------------------------------------
[windows-jdk8] [INFO] /f:/jenkins/jenkins-slave/workspace/box_maven-pdf-plugin_master-FPCFJFGXNRRHGLAILVNFYWPL2XYTEX5DLUMGNQ6QU547MZNTAW3Q@2/m/src/test/java/org/apache/maven/plugins/pdf/stubs/ModelBuilderMavenProjectStub.java:
f:\jenkins\jenkins-slave\workspace\box_maven-pdf-plugin_master-FPCFJFGXNRRHGLAILVNFYWPL2XYTEX5DLUMGNQ6QU547MZNTAW3Q@2\m\src\test\java\org\apache\maven\plugins\pdf\stubs\ModelBuilderMavenProjectStub.java
uses unchecked or unsafe operations.
[windows-jdk8] [INFO] /f:/jenkins/jenkins-slave/workspace/box_maven-pdf-plugin_master-FPCFJFGXNRRHGLAILVNFYWPL2XYTEX5DLUMGNQ6QU547MZNTAW3Q@2/m/src/test/java/org/apache/maven/plugins/pdf/stubs/ModelBuilderMavenProjectStub.java:
Recompile with -Xlint:unchecked for details.
[windows-jdk8] [INFO] 
[windows-jdk8] [INFO] --- maven-surefire-plugin:2.20.1:test (default-test) @ maven-pdf-plugin
---
[windows-jdk10] [INFO] 
[windows-jdk10] [INFO] --- maven-enforcer-plugin:1.4.1:enforce (ban-known-bad-maven-versions)
@ maven-pdf-plugin ---
[windows-jdk10] [INFO] 
[windows-jdk10] [INFO] --- maven-enforcer-plugin:1.4.1:enforce (ensure-no-container-api) @
maven-pdf-plugin ---
[windows-jdk10] [INFO] 
[windows-jdk10] [INFO] --- apache-rat-plugin:0.12:check (rat-check) @ maven-pdf-plugin ---
[windows-jdk7] [INFO] Running org.apache.maven.plugins.pdf.DateBeanTest
[windows-jdk7] [INFO] Tests run: 1, Failures: 0, Errors: 0, Skipped: 0, Time elapsed: 0.082
s - in org.apache.maven.plugins.pdf.DateBeanTest
[windows-jdk7] [INFO] Running org.apache.maven.plugins.pdf.DocumentDescriptorReaderTest
[windows-jdk7] [INFO] Tests run: 2, Failures: 0, Errors: 0, Skipped: 0, Time elapsed: 0.617
s - in org.apache.maven.plugins.pdf.DocumentDescriptorReaderTest
[windows-jdk7] [INFO] Running org.apache.maven.plugins.pdf.DocumentModelBuilderTest
[windows-jdk8] [INFO] 
[windows-jdk8] [INFO] -------------------------------------------------------
[windows-jdk8] [INFO]  T E S T S
[windows-jdk8] [INFO] -------------------------------------------------------
[windows-jdk8] [INFO] Running org.apache.maven.plugins.pdf.DateBeanTest
[windows-jdk10] [INFO] Enabled default license matchers.
[windows-jdk10] [INFO] Will parse SCM ignores for exclusions...
[windows-jdk10] [INFO] Parsing exclusions from f:\jenkins\jenkins-slave\workspace\box_maven-pdf-plugin_master-FPCFJFGXNRRHGLAILVNFYWPL2XYTEX5DLUMGNQ6QU547MZNTAW3Q@2\m\.gitignore
[windows-jdk10] [INFO] Finished adding exclusions from SCM ignore files.
[windows-jdk10] [INFO] 71 implicit excludes (use -debug for more details).
[windows-jdk10] [INFO] Exclude: .repository/**
[windows-jdk10] [INFO] Exclude: .maven/spy.log
[windows-jdk10] [INFO] Exclude: dependency-reduced-pom.xml
[windows-jdk10] [INFO] Exclude: .java-version
[windows-jdk10] [INFO] 73 resources included (use -debug for more details)
[windows-jdk10] [INFO] Rat check: Summary over all files. Unapproved: 0, unknown: 0, generated:
0, approved: 73 licenses.
[windows-jdk10] [INFO] 
[windows-jdk10] [INFO] --- maven-plugin-plugin:3.5.1:helpmojo (generate-helpmojo) @ maven-pdf-plugin
---
[windows-jdk8] [INFO] Tests run: 1, Failures: 0, Errors: 0, Skipped: 0, Time elapsed: 0.007
s - in org.apache.maven.plugins.pdf.DateBeanTest
[windows-jdk8] [INFO] Running org.apache.maven.plugins.pdf.DocumentDescriptorReaderTest
[windows-jdk8] [INFO] Tests run: 2, Failures: 0, Errors: 0, Skipped: 0, Time elapsed: 0.52
s - in org.apache.maven.plugins.pdf.DocumentDescriptorReaderTest
[windows-jdk8] [INFO] Running org.apache.maven.plugins.pdf.DocumentModelBuilderTest
[windows-jdk8] [INFO] Tests run: 3, Failures: 0, Errors: 0, Skipped: 0, Time elapsed: 0.125
s - in org.apache.maven.plugins.pdf.DocumentModelBuilderTest
[windows-jdk8] [INFO] Running org.apache.maven.plugins.pdf.PdfMojoTest
[windows-jdk8] [INFO] Tests run: 3, Failures: 0, Errors: 0, Skipped: 0, Time elapsed: 0.138
s - in org.apache.maven.plugins.pdf.PdfMojoTest
[windows-jdk8] [INFO] 
[windows-jdk8] [INFO] Results:
[windows-jdk8] [INFO] 
[windows-jdk8] [INFO] Tests run: 9, Failures: 0, Errors: 0, Skipped: 0
[windows-jdk8] [INFO] 
[windows-jdk8] [INFO] 
[windows-jdk8] [INFO] --- maven-jar-plugin:3.0.2:jar (default-jar) @ maven-pdf-plugin ---
[windows-jdk8] [INFO] Building jar: f:\jenkins\jenkins-slave\workspace\box_maven-pdf-plugin_master-FPCFJFGXNRRHGLAILVNFYWPL2XYTEX5DLUMGNQ6QU547MZNTAW3Q@2\m\target\maven-pdf-plugin-1.5-SNAPSHOT.jar
[windows-jdk8] [INFO] 
[windows-jdk8] [INFO] --- maven-plugin-plugin:3.5.1:addPluginArtifactMetadata (default-addPluginArtifactMetadata)
@ maven-pdf-plugin ---
[windows-jdk8] [INFO] 
[windows-jdk8] [INFO] --- maven-site-plugin:3.7:attach-descriptor (attach-descriptor) @ maven-pdf-plugin
---
[windows-jdk7] [INFO] Tests run: 3, Failures: 0, Errors: 0, Skipped: 0, Time elapsed: 0.437
s - in org.apache.maven.plugins.pdf.DocumentModelBuilderTest
[windows-jdk7] [INFO] Running org.apache.maven.plugins.pdf.PdfMojoTest
[windows-jdk7] [INFO] Tests run: 3, Failures: 0, Errors: 0, Skipped: 0, Time elapsed: 0.113
s - in org.apache.maven.plugins.pdf.PdfMojoTest
[windows-jdk7] [INFO] 
[windows-jdk7] [INFO] Results:
[windows-jdk7] [INFO] 
[windows-jdk7] [INFO] Tests run: 9, Failures: 0, Errors: 0, Skipped: 0
[windows-jdk7] [INFO] 
[windows-jdk7] [INFO] 
[windows-jdk7] [INFO] --- maven-jar-plugin:3.0.2:jar (default-jar) @ maven-pdf-plugin ---
[windows-jdk7] [INFO] Building jar: f:\jenkins\jenkins-slave\workspace\box_maven-pdf-plugin_master-FPCFJFGXNRRHGLAILVNFYWPL2XYTEX5DLUMGNQ6QU547MZNTAW3Q\m\target\maven-pdf-plugin-1.5-SNAPSHOT.jar
[windows-jdk7] [INFO] 
[windows-jdk7] [INFO] --- maven-plugin-plugin:3.5.1:addPluginArtifactMetadata (default-addPluginArtifactMetadata)
@ maven-pdf-plugin ---
[windows-jdk7] [INFO] 
[windows-jdk7] [INFO] --- maven-site-plugin:3.7:attach-descriptor (attach-descriptor) @ maven-pdf-plugin
---
[windows-jdk7] [INFO] Skipping because packaging 'maven-plugin' is not pom.
[windows-jdk7] [INFO] 
[windows-jdk7] [INFO] --- maven-invoker-plugin:3.0.1:install (integration-test) @ maven-pdf-plugin
---
[windows-jdk10] [INFO] Using 'UTF-8' encoding to read mojo source files.
[windows-jdk10] [INFO] java-javadoc mojo extractor found 0 mojo descriptor.
[windows-jdk7] [INFO] Installing f:\jenkins\jenkins-slave\workspace\box_maven-pdf-plugin_master-FPCFJFGXNRRHGLAILVNFYWPL2XYTEX5DLUMGNQ6QU547MZNTAW3Q\m\pom.xml
to f:\jenkins\jenkins-slave\workspace\box_maven-pdf-plugin_master-FPCFJFGXNRRHGLAILVNFYWPL2XYTEX5DLUMGNQ6QU547MZNTAW3Q\m\target\local-repo\org\apache\maven\plugins\maven-pdf-plugin\1.5-SNAPSHOT\maven-pdf-plugin-1.5-SNAPSHOT.pom
[windows-jdk7] [INFO] Installing f:\jenkins\jenkins-slave\workspace\box_maven-pdf-plugin_master-FPCFJFGXNRRHGLAILVNFYWPL2XYTEX5DLUMGNQ6QU547MZNTAW3Q\m\target\maven-pdf-plugin-1.5-SNAPSHOT.jar
to f:\jenkins\jenkins-slave\workspace\box_maven-pdf-plugin_master-FPCFJFGXNRRHGLAILVNFYWPL2XYTEX5DLUMGNQ6QU547MZNTAW3Q\m\target\local-repo\org\apache\maven\plugins\maven-pdf-plugin\1.5-SNAPSHOT\maven-pdf-plugin-1.5-SNAPSHOT.jar
[windows-jdk7] [INFO] 
[windows-jdk7] [INFO] --- maven-invoker-plugin:3.0.1:integration-test (integration-test) @
maven-pdf-plugin ---
[windows-jdk7] [INFO] Running Setup Jobs
[windows-jdk7] [INFO] Building: descriptor\pom.xml
[windows-jdk8] [INFO] Skipping because packaging 'maven-plugin' is not pom.
[windows-jdk8] [INFO] 
[windows-jdk8] [INFO] --- maven-invoker-plugin:3.0.1:install (integration-test) @ maven-pdf-plugin
---
[windows-jdk8] [INFO] Installing f:\jenkins\jenkins-slave\workspace\box_maven-pdf-plugin_master-FPCFJFGXNRRHGLAILVNFYWPL2XYTEX5DLUMGNQ6QU547MZNTAW3Q@2\m\pom.xml
to f:\jenkins\jenkins-slave\workspace\box_maven-pdf-plugin_master-FPCFJFGXNRRHGLAILVNFYWPL2XYTEX5DLUMGNQ6QU547MZNTAW3Q@2\m\target\local-repo\org\apache\maven\plugins\maven-pdf-plugin\1.5-SNAPSHOT\maven-pdf-plugin-1.5-SNAPSHOT.pom
[windows-jdk8] [INFO] Installing f:\jenkins\jenkins-slave\workspace\box_maven-pdf-plugin_master-FPCFJFGXNRRHGLAILVNFYWPL2XYTEX5DLUMGNQ6QU547MZNTAW3Q@2\m\target\maven-pdf-plugin-1.5-SNAPSHOT.jar
to f:\jenkins\jenkins-slave\workspace\box_maven-pdf-plugin_master-FPCFJFGXNRRHGLAILVNFYWPL2XYTEX5DLUMGNQ6QU547MZNTAW3Q@2\m\target\local-repo\org\apache\maven\plugins\maven-pdf-plugin\1.5-SNAPSHOT\maven-pdf-plugin-1.5-SNAPSHOT.jar
[windows-jdk8] [INFO] 
[windows-jdk8] [INFO] --- maven-invoker-plugin:3.0.1:integration-test (integration-test) @
maven-pdf-plugin ---
[windows-jdk8] [INFO] Running Setup Jobs
[windows-jdk8] [INFO] Building: descriptor\pom.xml
[windows-jdk10] [INFO] java-annotations mojo extractor found 0 mojo descriptor.
[windows-jdk10] [INFO] 
[windows-jdk10] [INFO] --- maven-remote-resources-plugin:1.5:process (process-resource-bundles)
@ maven-pdf-plugin ---
[windows-jdk10] [INFO] 
[windows-jdk10] [INFO] --- maven-resources-plugin:3.0.2:resources (default-resources) @ maven-pdf-plugin
---
[windows-jdk10] [INFO] Using 'UTF-8' encoding to copy filtered resources.
[windows-jdk10] [INFO] Copying 7 resources
[windows-jdk10] [INFO] Copying 3 resources
[windows-jdk10] [INFO] 
[windows-jdk10] [INFO] --- maven-compiler-plugin:3.7.0:compile (default-compile) @ maven-pdf-plugin
---
[windows-jdk10] [INFO] Changes detected - recompiling the module!
[windows-jdk10] [INFO] Compiling 5 source files to f:\jenkins\jenkins-slave\workspace\box_maven-pdf-plugin_master-FPCFJFGXNRRHGLAILVNFYWPL2XYTEX5DLUMGNQ6QU547MZNTAW3Q@2\m\target\classes
[windows-jdk10] [INFO] /f:/jenkins/jenkins-slave/workspace/box_maven-pdf-plugin_master-FPCFJFGXNRRHGLAILVNFYWPL2XYTEX5DLUMGNQ6QU547MZNTAW3Q@2/m/src/main/java/org/apache/maven/plugins/pdf/PdfMojo.java:
f:\jenkins\jenkins-slave\workspace\box_maven-pdf-plugin_master-FPCFJFGXNRRHGLAILVNFYWPL2XYTEX5DLUMGNQ6QU547MZNTAW3Q@2\m\src\main\java\org\apache\maven\plugins\pdf\PdfMojo.java
uses or overrides a deprecated API.
[windows-jdk10] [INFO] /f:/jenkins/jenkins-slave/workspace/box_maven-pdf-plugin_master-FPCFJFGXNRRHGLAILVNFYWPL2XYTEX5DLUMGNQ6QU547MZNTAW3Q@2/m/src/main/java/org/apache/maven/plugins/pdf/PdfMojo.java:
Recompile with -Xlint:deprecation for details.
[windows-jdk10] [INFO] /f:/jenkins/jenkins-slave/workspace/box_maven-pdf-plugin_master-FPCFJFGXNRRHGLAILVNFYWPL2XYTEX5DLUMGNQ6QU547MZNTAW3Q@2/m/src/main/java/org/apache/maven/plugins/pdf/PdfMojo.java:
f:\jenkins\jenkins-slave\workspace\box_maven-pdf-plugin_master-FPCFJFGXNRRHGLAILVNFYWPL2XYTEX5DLUMGNQ6QU547MZNTAW3Q@2\m\src\main\java\org\apache\maven\plugins\pdf\PdfMojo.java
uses unchecked or unsafe operations.
[windows-jdk10] [INFO] /f:/jenkins/jenkins-slave/workspace/box_maven-pdf-plugin_master-FPCFJFGXNRRHGLAILVNFYWPL2XYTEX5DLUMGNQ6QU547MZNTAW3Q@2/m/src/main/java/org/apache/maven/plugins/pdf/PdfMojo.java:
Recompile with -Xlint:unchecked for details.
[windows-jdk10] [INFO] 
[windows-jdk10] [INFO] --- maven-plugin-plugin:3.5.1:descriptor (default-descriptor) @ maven-pdf-plugin
---
[windows-jdk10] [INFO] Using 'UTF-8' encoding to read mojo source files.
[windows-jdk10] [INFO] java-javadoc mojo extractor found 0 mojo descriptor.
[windows-jdk10] [INFO] java-annotations mojo extractor found 2 mojo descriptors.
[windows-jdk10] [INFO] 
[windows-jdk10] [INFO] --- maven-resources-plugin:3.0.2:testResources (default-testResources)
@ maven-pdf-plugin ---
[windows-jdk10] [INFO] Using 'UTF-8' encoding to copy filtered resources.
[windows-jdk10] [INFO] Copying 14 resources
[windows-jdk10] [INFO] Copying 3 resources
[windows-jdk10] [INFO] 
[windows-jdk10] [INFO] --- maven-compiler-plugin:3.7.0:testCompile (default-testCompile) @
maven-pdf-plugin ---
[windows-jdk10] [INFO] Changes detected - recompiling the module!
[windows-jdk10] [INFO] Compiling 8 source files to f:\jenkins\jenkins-slave\workspace\box_maven-pdf-plugin_master-FPCFJFGXNRRHGLAILVNFYWPL2XYTEX5DLUMGNQ6QU547MZNTAW3Q@2\m\target\test-classes
[windows-jdk10] [INFO] /f:/jenkins/jenkins-slave/workspace/box_maven-pdf-plugin_master-FPCFJFGXNRRHGLAILVNFYWPL2XYTEX5DLUMGNQ6QU547MZNTAW3Q@2/m/src/test/java/org/apache/maven/plugins/pdf/stubs/ModelBuilderMavenProjectStub.java:
f:\jenkins\jenkins-slave\workspace\box_maven-pdf-plugin_master-FPCFJFGXNRRHGLAILVNFYWPL2XYTEX5DLUMGNQ6QU547MZNTAW3Q@2\m\src\test\java\org\apache\maven\plugins\pdf\stubs\ModelBuilderMavenProjectStub.java
uses unchecked or unsafe operations.
[windows-jdk10] [INFO] /f:/jenkins/jenkins-slave/workspace/box_maven-pdf-plugin_master-FPCFJFGXNRRHGLAILVNFYWPL2XYTEX5DLUMGNQ6QU547MZNTAW3Q@2/m/src/test/java/org/apache/maven/plugins/pdf/stubs/ModelBuilderMavenProjectStub.java:
Recompile with -Xlint:unchecked for details.
[windows-jdk10] [INFO] 
[windows-jdk10] [INFO] --- maven-surefire-plugin:2.20.1:test (default-test) @ maven-pdf-plugin
---
[windows-jdk10] [INFO] ------------------------------------------------------------------------
[windows-jdk10] [INFO] BUILD FAILURE
[windows-jdk10] [INFO] ------------------------------------------------------------------------
[windows-jdk10] [INFO] Total time: 27.497 s
[windows-jdk10] [INFO] Finished at: 2018-04-25T15:41:37Z
[windows-jdk10] [INFO] Final Memory: 44M/154M
[windows-jdk10] [INFO] ------------------------------------------------------------------------
[windows-jdk10] [INFO] [jenkins-event-spy] Generated F:\jenkins\jenkins-slave\workspace\box_maven-pdf-plugin_master-FPCFJFGXNRRHGLAILVNFYWPL2XYTEX5DLUMGNQ6QU547MZNTAW3Q@2@tmp\withMaven5cb30353\maven-spy-20180425-154109-7273076193208600114937.log
[windows-jdk10] [ERROR] Failed to execute goal org.apache.maven.plugins:maven-surefire-plugin:2.20.1:test
(default-test) on project maven-pdf-plugin: Execution default-test of goal org.apache.maven.plugins:maven-surefire-plugin:2.20.1:test
failed. NullPointerException -> [Help 1]
[windows-jdk10] [ERROR] 
[windows-jdk10] [ERROR] To see the full stack trace of the errors, re-run Maven with the -e
switch.
[windows-jdk10] [ERROR] Re-run Maven using the -X switch to enable full debug logging.
[windows-jdk10] [ERROR] 
[windows-jdk10] [ERROR] For more information about the errors and possible solutions, please
read the following articles:
[windows-jdk10] [ERROR] [Help 1] http://cwiki.apache.org/confluence/display/MAVEN/PluginExecutionException
[Pipeline] [windows-jdk10] }
[Pipeline] [windows-jdk10] // dir
[windows-jdk9] [INFO] run post-build script verify.groovy
[windows-jdk9] WARNING: An illegal reflective access operation has occurred
[windows-jdk9] WARNING: Illegal reflective access by org.codehaus.groovy.reflection.CachedClass
(file:/f:/jenkins/jenkins-slave/workspace/box_maven-pdf-plugin_master-FPCFJFGXNRRHGLAILVNFYWPL2XYTEX5DLUMGNQ6QU547MZNTAW3Q/.repository/org/codehaus/groovy/groovy-all/2.4.8/groovy-all-2.4.8.jar)
to method java.lang.Object.finalize()
[windows-jdk9] WARNING: Please consider reporting this to the maintainers of org.codehaus.groovy.reflection.CachedClass
[windows-jdk9] WARNING: Use --illegal-access=warn to enable warnings of further illegal reflective
access operations
[windows-jdk9] WARNING: All illegal access operations will be denied in a future release
[windows-jdk9] [INFO]           descriptor\pom.xml ............................... SUCCESS
(26.1 s)
[windows-jdk9] [INFO] Building: fop-basic\pom.xml
[windows-jdk8] [INFO] run post-build script verify.groovy
[windows-jdk8] [INFO]           descriptor\pom.xml ............................... SUCCESS
(16.2 s)
[windows-jdk8] [INFO] Building: fop-basic\pom.xml
[Pipeline] [windows-jdk10] }
[windows-jdk10] [withMaven] junitPublisher - Archive test results for Maven artifact org.apache.maven.plugins:maven-pdf-plugin:1.5-SNAPSHOT
generated by maven-surefire-plugin:test (default-test): m\target\surefire-reports\*.xml
[windows-jdk10] Recording test results
[windows-jdk10] None of the test reports contained any result
[Pipeline] [windows-jdk10] // withMaven
[Pipeline] [windows-jdk10] echo
[windows-jdk10] [FAIL FAST] This is the first failure and likely root cause
[Pipeline] [windows-jdk10] }
[windows-jdk7] [INFO] run post-build script verify.groovy
[windows-jdk7] [INFO]           descriptor\pom.xml ............................... SUCCESS
(17.7 s)
[windows-jdk7] [INFO] Building: fop-basic\pom.xml
[Pipeline] [windows-jdk10] // stage
[Pipeline] [windows-jdk10] }
[Pipeline] [windows-jdk10] // node
[Pipeline] [windows-jdk10] }
[windows-jdk10] Failed in branch windows-jdk10
[windows-jdk7] Sending interrupt signal to process
[windows-jdk9] [INFO] run post-build script verify.bsh
[windows-jdk9] [INFO]           fop-basic\pom.xml ................................ SUCCESS
(13.9 s)
[windows-jdk9] [INFO] Building: no-site\pom.xml
[windows-jdk8] Sending interrupt signal to process
[windows-jdk7] After 10s process did not stop
[windows-jdk9] Sending interrupt signal to process
[windows-jdk9] [INFO] run post-build script verify.bsh
[windows-jdk9] [INFO]           no-site\pom.xml .................................. SUCCESS
(9.7 s)
[windows-jdk9] [INFO] Building: pdf-with-reporting-section\pom.xml
[Pipeline] [linux-jdk7] // node
[Pipeline] [linux-jdk8] // node
[Pipeline] [linux-jdk9] // node
[Pipeline] [linux-jdk10] // node
[Pipeline] [linux-jdk7] }
[linux-jdk7] Failed in branch linux-jdk7
[Pipeline] [linux-jdk8] }
[linux-jdk8] Failed in branch linux-jdk8
[Pipeline] [linux-jdk9] }
[linux-jdk9] Failed in branch linux-jdk9
[Pipeline] [linux-jdk10] }
[linux-jdk10] Failed in branch linux-jdk10
[Pipeline] [windows-jdk7] }
[Pipeline] [windows-jdk7] // dir
[Pipeline] [windows-jdk9] }
[Pipeline] [windows-jdk7] }
[windows-jdk7] [withMaven] One or multiple Maven executions have been ignored by the Jenkins
Pipeline Maven Plugin because they have been interrupted before completion (1). See Pipeline
Maven Plugin FAQ for more details.
[Pipeline] [windows-jdk9] // dir
[Pipeline] [windows-jdk7] // withMaven
[Pipeline] [windows-jdk9] }
[windows-jdk9] [withMaven] One or multiple Maven executions have been ignored by the Jenkins
Pipeline Maven Plugin because they have been interrupted before completion (1). See Pipeline
Maven Plugin FAQ for more details.
[Pipeline] [windows-jdk7] echo
[windows-jdk7] [FAIL FAST] windows-jdk10 had first failure, ignoring null
[Pipeline] [windows-jdk7] }
[Pipeline] [windows-jdk9] // withMaven
[Pipeline] [windows-jdk7] // stage
[Pipeline] [windows-jdk7] }
[Pipeline] [windows-jdk9] echo
[windows-jdk9] [FAIL FAST] windows-jdk10 had first failure, ignoring script returned exit
code -1
[Pipeline] [windows-jdk9] }
[Pipeline] [windows-jdk7] // node
[Pipeline] [windows-jdk9] // stage
[Pipeline] [windows-jdk7] }
[Pipeline] [windows-jdk9] }
[Pipeline] [windows-jdk9] // node
[Pipeline] [windows-jdk9] }
[windows-jdk8] After 10s process did not stop
[Pipeline] [windows-jdk8] }
[Pipeline] [windows-jdk8] // dir
[Pipeline] [windows-jdk8] }
[windows-jdk8] [withMaven] One or multiple Maven executions have been ignored by the Jenkins
Pipeline Maven Plugin because they have been interrupted before completion (1). See Pipeline
Maven Plugin FAQ for more details.
[Pipeline] [windows-jdk8] // withMaven
[Pipeline] [windows-jdk8] echo
[windows-jdk8] [FAIL FAST] windows-jdk10 had first failure, ignoring null
[Pipeline] [windows-jdk8] }
[Pipeline] [windows-jdk8] // stage
[Pipeline] [windows-jdk8] }
[Pipeline] [windows-jdk8] // node
[Pipeline] [windows-jdk8] }
[Pipeline] // parallel
[Pipeline] echo
***** FAST FAILURE *****

Fast failure triggered by windows-jdk10

***** FAST FAILURE *****
[Pipeline] stage
[Pipeline] { (Notifications)
[Pipeline] echo
Build result: FAILURE
[Pipeline] jiraIssueSelector
[Pipeline] jiraComment
[Pipeline] emailext
Mime
  • Unnamed multipart/mixed (inline, None, 0 bytes)
View raw message