maven-notifications mailing list archives

Site index · List index
Message view « Date » · « Thread »
Top « Date » · « Thread »
From Apache Jenkins Server <jenk...@builds.apache.org>
Subject Build failed in Jenkins: Maven TLP » maven-checkstyle-plugin » MCHECKSTYLE-349 #1
Date Sat, 07 Apr 2018 15:25:31 GMT
See https://builds.apache.org/job/maven-box/job/maven-checkstyle-plugin/job/MCHECKSTYLE-349/1/

No changes.

No tests ran.

Build log:
[...truncated 1.86 MB...]
[windows-jdk7] [INFO] Downloaded: https://repo.maven.apache.org/maven2/org/apache/maven/shared/maven-artifact-transfer/0.9.1/maven-artifact-transfer-0.9.1.pom
(7.6 kB at 585 kB/s)
[windows-jdk7] [INFO] Downloading: https://repo.maven.apache.org/maven2/org/apache/maven/shared/maven-common-artifact-filters/3.0.1/maven-common-artifact-filters-3.0.1.pom
[windows-jdk7] [INFO] Downloaded: https://repo.maven.apache.org/maven2/org/apache/maven/shared/maven-common-artifact-filters/3.0.1/maven-common-artifact-filters-3.0.1.pom
(4.8 kB at 372 kB/s)
[windows-jdk7] [INFO] Downloading: https://repo.maven.apache.org/maven2/commons-codec/commons-codec/1.6/commons-codec-1.6.pom
[windows-jdk7] [INFO] Downloaded: https://repo.maven.apache.org/maven2/commons-codec/commons-codec/1.6/commons-codec-1.6.pom
(11 kB at 930 kB/s)
[windows-jdk7] [INFO] Downloading: https://repo.maven.apache.org/maven2/org/slf4j/slf4j-api/1.7.5/slf4j-api-1.7.5.pom
[windows-jdk7] [INFO] Downloaded: https://repo.maven.apache.org/maven2/org/slf4j/slf4j-api/1.7.5/slf4j-api-1.7.5.pom
(2.7 kB at 224 kB/s)
[windows-jdk7] [INFO] Downloading: https://repo.maven.apache.org/maven2/org/slf4j/slf4j-parent/1.7.5/slf4j-parent-1.7.5.pom
[windows-jdk7] [INFO] Downloaded: https://repo.maven.apache.org/maven2/org/slf4j/slf4j-parent/1.7.5/slf4j-parent-1.7.5.pom
(12 kB at 984 kB/s)
[windows-jdk7] [INFO] Downloading: https://repo.maven.apache.org/maven2/org/apache/maven/doxia/doxia-sink-api/1.7/doxia-sink-api-1.7.pom
[windows-jdk7] [INFO] Downloaded: https://repo.maven.apache.org/maven2/org/apache/maven/doxia/doxia-sink-api/1.7/doxia-sink-api-1.7.pom
(1.5 kB at 109 kB/s)
[windows-jdk7] [INFO] Downloading: https://repo.maven.apache.org/maven2/org/apache/maven/doxia/doxia/1.7/doxia-1.7.pom
[windows-jdk7] [INFO] Downloaded: https://repo.maven.apache.org/maven2/org/apache/maven/doxia/doxia/1.7/doxia-1.7.pom
(15 kB at 897 kB/s)
[windows-jdk7] [INFO] Downloading: https://repo.maven.apache.org/maven2/org/apache/maven/doxia/doxia-logging-api/1.7/doxia-logging-api-1.7.pom
[windows-jdk7] [INFO] Downloaded: https://repo.maven.apache.org/maven2/org/apache/maven/doxia/doxia-logging-api/1.7/doxia-logging-api-1.7.pom
(1.5 kB at 110 kB/s)
[windows-jdk7] [INFO] Downloading: https://repo.maven.apache.org/maven2/org/apache/maven/doxia/doxia-site-renderer/1.7.4/doxia-site-renderer-1.7.4.pom
[windows-jdk7] [INFO] Downloaded: https://repo.maven.apache.org/maven2/org/apache/maven/doxia/doxia-site-renderer/1.7.4/doxia-site-renderer-1.7.4.pom
(6.7 kB at 514 kB/s)
[windows-jdk7] [INFO] Downloading: https://repo.maven.apache.org/maven2/org/apache/maven/doxia/doxia-sitetools/1.7.4/doxia-sitetools-1.7.4.pom
[windows-jdk7] [INFO] Downloaded: https://repo.maven.apache.org/maven2/org/apache/maven/doxia/doxia-sitetools/1.7.4/doxia-sitetools-1.7.4.pom
(14 kB at 1.1 MB/s)
[windows-jdk7] [INFO] Downloading: https://repo.maven.apache.org/maven2/org/apache/maven/doxia/doxia-core/1.7/doxia-core-1.7.pom
[windows-jdk7] [INFO] Downloaded: https://repo.maven.apache.org/maven2/org/apache/maven/doxia/doxia-core/1.7/doxia-core-1.7.pom
(4.1 kB at 313 kB/s)
[windows-jdk7] [INFO] Downloading: https://repo.maven.apache.org/maven2/org/apache/maven/doxia/doxia-decoration-model/1.7.4/doxia-decoration-model-1.7.4.pom
[windows-jdk7] [INFO] Downloaded: https://repo.maven.apache.org/maven2/org/apache/maven/doxia/doxia-decoration-model/1.7.4/doxia-decoration-model-1.7.4.pom
(3.4 kB at 261 kB/s)
[windows-jdk7] [INFO] Downloading: https://repo.maven.apache.org/maven2/org/apache/maven/doxia/doxia-skin-model/1.7.4/doxia-skin-model-1.7.4.pom
[windows-jdk7] [INFO] Downloaded: https://repo.maven.apache.org/maven2/org/apache/maven/doxia/doxia-skin-model/1.7.4/doxia-skin-model-1.7.4.pom
(3.0 kB at 233 kB/s)
[windows-jdk7] [INFO] Downloading: https://repo.maven.apache.org/maven2/org/apache/maven/doxia/doxia-module-xhtml/1.7/doxia-module-xhtml-1.7.pom
[windows-jdk7] [INFO] Downloaded: https://repo.maven.apache.org/maven2/org/apache/maven/doxia/doxia-module-xhtml/1.7/doxia-module-xhtml-1.7.pom
(1.6 kB at 136 kB/s)
[windows-jdk7] [INFO] Downloading: https://repo.maven.apache.org/maven2/org/apache/maven/doxia/doxia-modules/1.7/doxia-modules-1.7.pom
[windows-jdk7] [INFO] Downloaded: https://repo.maven.apache.org/maven2/org/apache/maven/doxia/doxia-modules/1.7/doxia-modules-1.7.pom
(2.6 kB at 175 kB/s)
[windows-jdk7] [INFO] Downloading: https://repo.maven.apache.org/maven2/org/codehaus/groovy/groovy-all/2.4.8/groovy-all-2.4.8.pom
[windows-jdk7] [INFO] Downloaded: https://repo.maven.apache.org/maven2/org/codehaus/groovy/groovy-all/2.4.8/groovy-all-2.4.8.pom
(21 kB at 1.4 MB/s)
[windows-jdk7] [INFO] Downloading: https://repo.maven.apache.org/maven2/org/apache/maven/shared/maven-invoker/3.0.0/maven-invoker-3.0.0.jar
[windows-jdk7] [INFO] Downloading: https://repo.maven.apache.org/maven2/org/apache/maven/reporting/maven-reporting-impl/2.4/maven-reporting-impl-2.4.jar
[windows-jdk7] [INFO] Downloading: https://repo.maven.apache.org/maven2/commons-validator/commons-validator/1.4.1/commons-validator-1.4.1.jar
[windows-jdk7] [INFO] Downloading: https://repo.maven.apache.org/maven2/commons-beanutils/commons-beanutils/1.8.3/commons-beanutils-1.8.3.jar
[windows-jdk7] [INFO] Downloading: https://repo.maven.apache.org/maven2/commons-digester/commons-digester/1.8.1/commons-digester-1.8.1.jar
[windows-jdk7] [INFO] Downloaded: https://repo.maven.apache.org/maven2/commons-beanutils/commons-beanutils/1.8.3/commons-beanutils-1.8.3.jar
(232 kB at 12 MB/s)
[windows-jdk7] [INFO] Downloading: https://repo.maven.apache.org/maven2/commons-logging/commons-logging/1.2/commons-logging-1.2.jar
[windows-jdk7] [INFO] Downloaded: https://repo.maven.apache.org/maven2/commons-digester/commons-digester/1.8.1/commons-digester-1.8.1.jar
(146 kB at 6.1 MB/s)
[windows-jdk7] [INFO] Downloading: https://repo.maven.apache.org/maven2/org/apache/maven/shared/maven-script-interpreter/1.2/maven-script-interpreter-1.2.jar
[windows-jdk7] [INFO] Downloaded: https://repo.maven.apache.org/maven2/commons-validator/commons-validator/1.4.1/commons-validator-1.4.1.jar
(190 kB at 6.3 MB/s)
[windows-jdk7] [INFO] Downloading: https://repo.maven.apache.org/maven2/org/apache/ant/ant/1.8.1/ant-1.8.1.jar
[windows-jdk7] [INFO] Downloaded: https://repo.maven.apache.org/maven2/commons-logging/commons-logging/1.2/commons-logging-1.2.jar
(62 kB at 937 kB/s)
[windows-jdk7] [INFO] Downloading: https://repo.maven.apache.org/maven2/org/apache/maven/shared/maven-artifact-transfer/0.9.1/maven-artifact-transfer-0.9.1.jar
[windows-jdk7] [INFO] Downloaded: https://repo.maven.apache.org/maven2/org/apache/maven/reporting/maven-reporting-impl/2.4/maven-reporting-impl-2.4.jar
(20 kB at 232 kB/s)
[windows-jdk7] [INFO] Downloading: https://repo.maven.apache.org/maven2/org/apache/maven/shared/maven-common-artifact-filters/3.0.1/maven-common-artifact-filters-3.0.1.jar
[windows-jdk7] [INFO] Downloaded: https://repo.maven.apache.org/maven2/org/apache/maven/shared/maven-artifact-transfer/0.9.1/maven-artifact-transfer-0.9.1.jar
(123 kB at 1.1 MB/s)
[windows-jdk7] [INFO] Downloading: https://repo.maven.apache.org/maven2/commons-codec/commons-codec/1.6/commons-codec-1.6.jar
[windows-jdk7] [INFO] Downloaded: https://repo.maven.apache.org/maven2/org/apache/ant/ant/1.8.1/ant-1.8.1.jar
(1.5 MB at 13 MB/s)
[windows-jdk7] [INFO] Downloading: https://repo.maven.apache.org/maven2/org/slf4j/slf4j-api/1.7.5/slf4j-api-1.7.5.jar
[windows-jdk8] [INFO] There are 5 errors reported by Checkstyle 6.18 with sun_checks.xml ruleset.
[windows-jdk8] Sending interrupt signal to process
[windows-jdk9] [INFO] There are 5 errors reported by Checkstyle 6.18 with sun_checks.xml ruleset.
[windows-jdk9] [INFO] There are 5 errors reported by Checkstyle 6.18 with sun_checks.xml ruleset.
[windows-jdk7] [INFO] Downloaded: https://repo.maven.apache.org/maven2/org/apache/maven/shared/maven-invoker/3.0.0/maven-invoker-3.0.0.jar
(33 kB at 247 kB/s)
[windows-jdk7] [INFO] Downloading: https://repo.maven.apache.org/maven2/org/apache/maven/doxia/doxia-sink-api/1.7/doxia-sink-api-1.7.jar
[windows-jdk7] [INFO] Downloaded: https://repo.maven.apache.org/maven2/org/apache/maven/shared/maven-script-interpreter/1.2/maven-script-interpreter-1.2.jar
(22 kB at 163 kB/s)
[windows-jdk7] [INFO] Downloading: https://repo.maven.apache.org/maven2/org/apache/maven/doxia/doxia-logging-api/1.7/doxia-logging-api-1.7.jar
[windows-jdk7] [INFO] Downloaded: https://repo.maven.apache.org/maven2/commons-codec/commons-codec/1.6/commons-codec-1.6.jar
(233 kB at 1.7 MB/s)
[windows-jdk7] [INFO] Downloading: https://repo.maven.apache.org/maven2/org/apache/maven/doxia/doxia-site-renderer/1.7.4/doxia-site-renderer-1.7.4.jar
[windows-jdk7] [INFO] Downloaded: https://repo.maven.apache.org/maven2/org/apache/maven/shared/maven-common-artifact-filters/3.0.1/maven-common-artifact-filters-3.0.1.jar
(61 kB at 442 kB/s)
[windows-jdk7] [INFO] Downloading: https://repo.maven.apache.org/maven2/org/apache/maven/doxia/doxia-decoration-model/1.7.4/doxia-decoration-model-1.7.4.jar
[windows-jdk9] Sending interrupt signal to process
[windows-jdk9] [INFO] There are 5 errors reported by Checkstyle 6.18 with sun_checks.xml ruleset.
[windows-jdk9] [INFO] 
[windows-jdk9] [INFO] Results:
[windows-jdk9] [INFO] 
[windows-jdk9] [INFO] Tests run: 0, Failures: 0, Errors: 0, Skipped: 0
[windows-jdk9] [INFO] 
[windows-jdk9] [ERROR] There are test failures.
[windows-jdk9] 
[windows-jdk9] Please refer to f:\jenkins\jenkins-slave\workspace\tyle-plugin_MCHECKSTYLE-349-TGZYDHHJ7N5S2W33RKH3BIQLZMQGEV5MAQBLKTWMOYR2KT4XHWFQ@2\m\target\surefire-reports
for the individual test results.
[windows-jdk9] Please refer to dump files (if any exist) [date]-jvmRun[N].dump, [date].dumpstream
and [date]-jvmRun[N].dumpstream.
[windows-jdk9] The forked VM terminated without properly saying goodbye. VM crash or System.exit
called?
[windows-jdk9] Command was cmd.exe /X /C "f:\jenkins\tools\java\latest9\bin\java --add-modules
java.se.ee -jar C:\Users\jenkins\AppData\Local\Temp\1\surefire8709776304577246270\surefirebooter11473604170604148997.jar
C:\Users\jenkins\AppData\Local\Temp\1\surefire8709776304577246270 2018-04-07T15-24-56_742-jvmRun1
surefire10853024390985014308tmp surefire_013954729615639016279tmp"
[windows-jdk9] Error occurred in starting fork, check output in log
[windows-jdk9] Process Exit Code: -1
[windows-jdk9] Crashed tests:
[windows-jdk9] org.apache.maven.plugins.checkstyle.CheckstyleReportTest
[windows-jdk9] org.apache.maven.surefire.booter.SurefireBooterForkException: The forked VM
terminated without properly saying goodbye. VM crash or System.exit called?
[windows-jdk9] Command was cmd.exe /X /C "f:\jenkins\tools\java\latest9\bin\java --add-modules
java.se.ee -jar C:\Users\jenkins\AppData\Local\Temp\1\surefire8709776304577246270\surefirebooter11473604170604148997.jar
C:\Users\jenkins\AppData\Local\Temp\1\surefire8709776304577246270 2018-04-07T15-24-56_742-jvmRun1
surefire10853024390985014308tmp surefire_013954729615639016279tmp"
[windows-jdk9] Error occurred in starting fork, check output in log
[windows-jdk9] Process Exit Code: -1
[windows-jdk9] Crashed tests:
[windows-jdk9] org.apache.maven.plugins.checkstyle.CheckstyleReportTest
[windows-jdk9] 	at org.apache.maven.plugin.surefire.booterclient.ForkStarter.fork(ForkStarter.java:686)
[windows-jdk9] 	at org.apache.maven.plugin.surefire.booterclient.ForkStarter.fork(ForkStarter.java:535)
[windows-jdk9] 	at org.apache.maven.plugin.surefire.booterclient.ForkStarter.run(ForkStarter.java:280)
[windows-jdk9] 	at org.apache.maven.plugin.surefire.booterclient.ForkStarter.run(ForkStarter.java:245)
[windows-jdk9] 	at org.apache.maven.plugin.surefire.AbstractSurefireMojo.executeProvider(AbstractSurefireMojo.java:1124)
[windows-jdk9] 	at org.apache.maven.plugin.surefire.AbstractSurefireMojo.executeAfterPreconditionsChecked(AbstractSurefireMojo.java:954)
[windows-jdk9] 	at org.apache.maven.plugin.surefire.AbstractSurefireMojo.execute(AbstractSurefireMojo.java:832)
[windows-jdk9] 	at org.apache.maven.plugin.DefaultBuildPluginManager.executeMojo(DefaultBuildPluginManager.java:134)
[windows-jdk9] 	at org.apache.maven.lifecycle.internal.MojoExecutor.execute(MojoExecutor.java:208)
[windows-jdk9] 	at org.apache.maven.lifecycle.internal.MojoExecutor.execute(MojoExecutor.java:154)
[windows-jdk9] 	at org.apache.maven.lifecycle.internal.MojoExecutor.execute(MojoExecutor.java:146)
[windows-jdk9] 	at org.apache.maven.lifecycle.internal.LifecycleModuleBuilder.buildProject(LifecycleModuleBuilder.java:117)
[windows-jdk9] 	at org.apache.maven.lifecycle.internal.LifecycleModuleBuilder.buildProject(LifecycleModuleBuilder.java:81)
[windows-jdk9] 	at org.apache.maven.lifecycle.internal.builder.singlethreaded.SingleThreadedBuilder.build(SingleThreadedBuilder.java:51)
[windows-jdk9] 	at org.apache.maven.lifecycle.internal.LifecycleStarter.execute(LifecycleStarter.java:128)
[windows-jdk9] 	at org.apache.maven.DefaultMaven.doExecute(DefaultMaven.java:309)
[windows-jdk9] 	at org.apache.maven.DefaultMaven.doExecute(DefaultMaven.java:194)
[windows-jdk9] 	at org.apache.maven.DefaultMaven.execute(DefaultMaven.java:107)
[windows-jdk9] 	at org.apache.maven.cli.MavenCli.execute(MavenCli.java:993)
[windows-jdk9] 	at org.apache.maven.cli.MavenCli.doMain(MavenCli.java:345)
[windows-jdk9] 	at org.apache.maven.cli.MavenCli.main(MavenCli.java:191)
[windows-jdk9] 	at java.base/jdk.internal.reflect.NativeMethodAccessorImpl.invoke0(Native
Method)
[windows-jdk9] 	at java.base/jdk.internal.reflect.NativeMethodAccessorImpl.invoke(NativeMethodAccessorImpl.java:62)
[windows-jdk9] 	at java.base/jdk.internal.reflect.DelegatingMethodAccessorImpl.invoke(DelegatingMethodAccessorImpl.java:43)
[windows-jdk9] 	at java.base/java.lang.reflect.Method.invoke(Method.java:564)
[windows-jdk9] 	at org.codehaus.plexus.classworlds.launcher.Launcher.launchEnhanced(Launcher.java:289)
[windows-jdk9] 	at org.codehaus.plexus.classworlds.launcher.Launcher.launch(Launcher.java:229)
[windows-jdk9] 	at org.codehaus.plexus.classworlds.launcher.Launcher.mainWithExitCode(Launcher.java:415)
[windows-jdk9] 	at org.codehaus.plexus.classworlds.launcher.Launcher.main(Launcher.java:356)
[windows-jdk9] 
[windows-jdk9] [INFO] 
[windows-jdk9] [INFO] --- maven-jar-plugin:3.0.2:jar (default-jar) @ maven-checkstyle-plugin
---
[windows-jdk9] [INFO] Downloading: https://repo.maven.apache.org/maven2/org/apache/maven/maven-archiver/3.1.1/maven-archiver-3.1.1.pom
[windows-jdk9] [INFO] Downloaded: https://repo.maven.apache.org/maven2/org/apache/maven/maven-archiver/3.1.1/maven-archiver-3.1.1.pom
(4.3 kB at 435 kB/s)
[windows-jdk9] [INFO] Downloading: https://repo.maven.apache.org/maven2/org/apache/maven/shared/maven-shared-utils/3.0.1/maven-shared-utils-3.0.1.pom
[windows-jdk9] [INFO] Downloaded: https://repo.maven.apache.org/maven2/org/apache/maven/shared/maven-shared-utils/3.0.1/maven-shared-utils-3.0.1.pom
(4.6 kB at 655 kB/s)
[windows-jdk9] [INFO] Downloading: https://repo.maven.apache.org/maven2/org/codehaus/plexus/plexus-archiver/3.3/plexus-archiver-3.3.pom
[windows-jdk9] [INFO] Downloaded: https://repo.maven.apache.org/maven2/org/codehaus/plexus/plexus-archiver/3.3/plexus-archiver-3.3.pom
(5.3 kB at 761 kB/s)
[windows-jdk9] [INFO] Downloading: https://repo.maven.apache.org/maven2/org/codehaus/plexus/plexus/3.2/plexus-3.2.pom
[windows-jdk9] [INFO] Downloaded: https://repo.maven.apache.org/maven2/org/codehaus/plexus/plexus/3.2/plexus-3.2.pom
(19 kB at 2.3 MB/s)
[windows-jdk9] [INFO] Downloading: https://repo.maven.apache.org/maven2/org/codehaus/plexus/plexus-io/2.7.1/plexus-io-2.7.1.pom
[windows-jdk9] [INFO] Downloaded: https://repo.maven.apache.org/maven2/org/codehaus/plexus/plexus-io/2.7.1/plexus-io-2.7.1.pom
(4.9 kB at 615 kB/s)
[windows-jdk9] [INFO] Downloading: https://repo.maven.apache.org/maven2/org/apache/commons/commons-compress/1.11/commons-compress-1.11.pom
[windows-jdk9] [INFO] Downloaded: https://repo.maven.apache.org/maven2/org/apache/commons/commons-compress/1.11/commons-compress-1.11.pom
(13 kB at 1.8 MB/s)
[windows-jdk9] [INFO] Downloading: https://repo.maven.apache.org/maven2/org/iq80/snappy/snappy/0.4/snappy-0.4.pom
[windows-jdk9] [INFO] Downloaded: https://repo.maven.apache.org/maven2/org/iq80/snappy/snappy/0.4/snappy-0.4.pom
(15 kB at 1.6 MB/s)
[windows-jdk9] [INFO] Downloading: https://repo.maven.apache.org/maven2/org/tukaani/xz/1.5/xz-1.5.pom
[windows-jdk9] [INFO] Downloaded: https://repo.maven.apache.org/maven2/org/tukaani/xz/1.5/xz-1.5.pom
(1.9 kB at 272 kB/s)
[windows-jdk9] [INFO] Downloading: https://repo.maven.apache.org/maven2/org/codehaus/plexus/plexus-archiver/3.4/plexus-archiver-3.4.pom
[windows-jdk9] [INFO] Downloaded: https://repo.maven.apache.org/maven2/org/codehaus/plexus/plexus-archiver/3.4/plexus-archiver-3.4.pom
(5.3 kB at 666 kB/s)
[windows-jdk9] [INFO] Downloading: https://repo.maven.apache.org/maven2/org/codehaus/plexus/plexus-io/2.7.1/plexus-io-2.7.1.jar
[windows-jdk9] [INFO] Downloading: https://repo.maven.apache.org/maven2/org/codehaus/plexus/plexus-archiver/3.4/plexus-archiver-3.4.jar
[windows-jdk9] [INFO] Downloading: https://repo.maven.apache.org/maven2/org/apache/maven/maven-archiver/3.1.1/maven-archiver-3.1.1.jar
[windows-jdk9] [INFO] Downloading: https://repo.maven.apache.org/maven2/org/apache/commons/commons-compress/1.11/commons-compress-1.11.jar
[windows-jdk9] [INFO] Downloading: https://repo.maven.apache.org/maven2/org/apache/maven/shared/maven-shared-utils/3.0.1/maven-shared-utils-3.0.1.jar
[windows-jdk9] [INFO] Downloaded: https://repo.maven.apache.org/maven2/org/codehaus/plexus/plexus-io/2.7.1/plexus-io-2.7.1.jar
(86 kB at 5.7 MB/s)
[windows-jdk9] [INFO] Downloading: https://repo.maven.apache.org/maven2/org/iq80/snappy/snappy/0.4/snappy-0.4.jar
[windows-jdk9] [INFO] Downloaded: https://repo.maven.apache.org/maven2/org/apache/maven/shared/maven-shared-utils/3.0.1/maven-shared-utils-3.0.1.jar
(154 kB at 7.0 MB/s)
[windows-jdk9] [INFO] Downloading: https://repo.maven.apache.org/maven2/org/tukaani/xz/1.5/xz-1.5.jar
[windows-jdk9] [INFO] Downloaded: https://repo.maven.apache.org/maven2/org/apache/maven/maven-archiver/3.1.1/maven-archiver-3.1.1.jar
(24 kB at 1.0 MB/s)
[windows-jdk9] [INFO] Downloaded: https://repo.maven.apache.org/maven2/org/iq80/snappy/snappy/0.4/snappy-0.4.jar
(58 kB at 1.8 MB/s)
[windows-jdk9] [INFO] Downloaded: https://repo.maven.apache.org/maven2/org/codehaus/plexus/plexus-archiver/3.4/plexus-archiver-3.4.jar
(187 kB at 5.2 MB/s)
[windows-jdk9] [INFO] Downloaded: https://repo.maven.apache.org/maven2/org/tukaani/xz/1.5/xz-1.5.jar
(100 kB at 2.8 MB/s)
[windows-jdk9] [INFO] Downloaded: https://repo.maven.apache.org/maven2/org/apache/commons/commons-compress/1.11/commons-compress-1.11.jar
(426 kB at 8.9 MB/s)
[Pipeline] [linux-jdk8] }
[Pipeline] [linux-jdk10] }
[Pipeline] [linux-jdk9] }
[Pipeline] [linux-jdk7] }
[Pipeline] [windows-jdk7] }
[Pipeline] [windows-jdk9] }
[Pipeline] [linux-jdk8] // dir
[Pipeline] [linux-jdk10] // dir
[Pipeline] [linux-jdk9] // dir
[Pipeline] [linux-jdk7] // dir
[windows-jdk8] After 10s process did not stop
[Pipeline] [windows-jdk7] // dir
[Pipeline] [linux-jdk8] }
[linux-jdk8] [withMaven] One or multiple Maven executions have been ignored by the Jenkins
Pipeline Maven Plugin because they have been interrupted before completion (1). See Pipeline
Maven Plugin FAQ for more details.
[Pipeline] [linux-jdk10] }
[linux-jdk10] [withMaven] junitPublisher - Archive test results for Maven artifact org.apache.maven.plugins:maven-checkstyle-plugin:3.0.1-SNAPSHOT
generated by maven-surefire-plugin:test (default-test): m/target/surefire-reports/*.xml
[linux-jdk10] [withMaven] junitPublisher - Jenkins JUnit Attachments Plugin not found, can't
publish test attachments.Recording test results
[linux-jdk10] None of the test reports contained any result
[Pipeline] [linux-jdk9] }
[linux-jdk9] [withMaven] One or multiple Maven executions have been ignored by the Jenkins
Pipeline Maven Plugin because they have been interrupted before completion (1). See Pipeline
Maven Plugin FAQ for more details.
[Pipeline] [linux-jdk7] }
[linux-jdk7] [withMaven] One or multiple Maven executions have been ignored by the Jenkins
Pipeline Maven Plugin because they have been interrupted before completion (1). See Pipeline
Maven Plugin FAQ for more details.
[Pipeline] [windows-jdk7] }
[windows-jdk7] [withMaven] One or multiple Maven executions have been ignored by the Jenkins
Pipeline Maven Plugin because they have been interrupted before completion (1). See Pipeline
Maven Plugin FAQ for more details.
[Pipeline] [windows-jdk9] // dir
[Pipeline] [windows-jdk9] }
[windows-jdk9] [withMaven] One or multiple Maven executions have been ignored by the Jenkins
Pipeline Maven Plugin because they have been interrupted before completion (1). See Pipeline
Maven Plugin FAQ for more details.
[Pipeline] [linux-jdk8] // withMaven
[Pipeline] [linux-jdk10] // withMaven
[Pipeline] [linux-jdk9] // withMaven
[Pipeline] [linux-jdk7] // withMaven
[Pipeline] [windows-jdk7] // withMaven
[Pipeline] [windows-jdk8] }
[Pipeline] [linux-jdk8] echo
[linux-jdk8] [FAIL FAST] windows-jdk10 had first failure, ignoring null
[Pipeline] [linux-jdk8] }
[Pipeline] [linux-jdk10] echo
[linux-jdk10] [FAIL FAST] windows-jdk10 had first failure, ignoring script returned exit code
1
[Pipeline] [linux-jdk10] }
[Pipeline] [linux-jdk9] echo
[linux-jdk9] [FAIL FAST] windows-jdk10 had first failure, ignoring script returned exit code
143
[Pipeline] [linux-jdk9] }
[Pipeline] [linux-jdk7] echo
[linux-jdk7] [FAIL FAST] windows-jdk10 had first failure, ignoring script returned exit code
143
[Pipeline] [linux-jdk7] }
[Pipeline] [windows-jdk7] echo
[windows-jdk7] [FAIL FAST] windows-jdk10 had first failure, ignoring script returned exit
code -1
[Pipeline] [windows-jdk7] }
[Pipeline] [windows-jdk9] // withMaven
[Pipeline] [windows-jdk9] echo
[windows-jdk9] [FAIL FAST] windows-jdk10 had first failure, ignoring script returned exit
code -1
[Pipeline] [windows-jdk9] }
[Pipeline] [windows-jdk8] // dir
[Pipeline] [linux-jdk8] // stage
[Pipeline] [linux-jdk10] // stage
[Pipeline] [linux-jdk9] // stage
[Pipeline] [linux-jdk7] // stage
[Pipeline] [windows-jdk7] // stage
[Pipeline] [linux-jdk7] }
[Pipeline] [linux-jdk8] }
[Pipeline] [linux-jdk10] }
[Pipeline] [linux-jdk9] }
[Pipeline] [windows-jdk7] }
[Pipeline] [windows-jdk8] }
[windows-jdk8] [withMaven] One or multiple Maven executions have been ignored by the Jenkins
Pipeline Maven Plugin because they have been interrupted before completion (1). See Pipeline
Maven Plugin FAQ for more details.
[Pipeline] [windows-jdk9] // stage
[Pipeline] [windows-jdk9] }
[Pipeline] [linux-jdk7] // node
[Pipeline] [linux-jdk8] // node
[Pipeline] [linux-jdk10] // node
[Pipeline] [linux-jdk9] // node
[Pipeline] [windows-jdk7] // node
[Pipeline] [windows-jdk8] // withMaven
[Pipeline] [linux-jdk7] }
[Pipeline] [linux-jdk8] }
[Pipeline] [linux-jdk9] }
[Pipeline] [linux-jdk10] }
[Pipeline] [windows-jdk7] }
[Pipeline] [windows-jdk8] echo
[windows-jdk8] [FAIL FAST] windows-jdk10 had first failure, ignoring null
[Pipeline] [windows-jdk8] }
[Pipeline] [windows-jdk9] // node
[Pipeline] [windows-jdk9] }
[Pipeline] [windows-jdk8] // stage
[Pipeline] [windows-jdk8] }
[Pipeline] [windows-jdk8] // node
[Pipeline] [windows-jdk8] }
[Pipeline] // parallel
[Pipeline] echo
***** FAST FAILURE *****

Fast failure triggered by windows-jdk10

***** FAST FAILURE *****
[Pipeline] stage
[Pipeline] { (Notifications)
[Pipeline] echo
Build result: FAILURE
[Pipeline] jiraIssueSelector
[Pipeline] emailext
Mime
  • Unnamed multipart/mixed (inline, None, 0 bytes)
View raw message