maven-notifications mailing list archives

Site index · List index
Message view « Date » · « Thread »
Top « Date » · « Thread »
From Apache Jenkins Server <jenk...@builds.apache.org>
Subject Build unstable in Jenkins: Maven TLP » maven-remote-resources-plugin » MRRESOURCES-104 #4
Date Sat, 07 Apr 2018 22:26:01 GMT
See https://builds.apache.org/job/maven-box/job/maven-remote-resources-plugin/job/MRRESOURCES-104/4/

Changes:

* Fixed code.
* Fixed code.
* Fixed code.
* Fixed code.
* Fixed code.
* Fixed code.
* Fixed code.

4 tests failed.
FAILED:  org.apache.maven.plugin.resources.remote.it.IT_RunOnlyAtExecutionRoot.test

Error Message:
Exit code was non-zero: 1; command line and log = 
F:\jenkins\tools\maven\apache-maven-3.5.0\bin\mvn -e --batch-mode -Dmaven.repo.local=f:\jenkins\jenkins-slave\workspace\rces-plugin_MRRESOURCES-104-LGCBGPPUNLUBE2DYS4XSK7TMPVBNNKKJD5CX73QOJHAO4AO3H5JA\m\target/it-repo org.apache.maven.plugins:maven-clean-plugin:clean generate-resources
[INFO] [jenkins-event-spy] Jenkins Maven Event Spy is disabled
[INFO] Error stacktraces are turned on.
[INFO] Scanning for projects...
[INFO] Downloading: http://repository.apache.org/snapshots/org/apache/maven/plugin/rresource/it/it-parent/1.6-SNAPSHOT/maven-metadata.xml
[WARNING] Could not transfer metadata org.apache.maven.plugin.rresource.it:it-parent:1.6-SNAPSHOT/maven-metadata.xml from/to apache-snapshots (http://repository.apache.org/snapshots/): Connect to repository.apache.org:80 [repository.apache.org/207.244.88.140] failed: Connection timed out: connect
[INFO] Downloading: http://repository.apache.org/snapshots/org/apache/maven/plugin/rresource/it/it-parent/1.6-SNAPSHOT/it-parent-1.6-SNAPSHOT.pom
[ERROR] [ERROR] Some problems were encountered while processing the POMs:
[FATAL] Non-resolvable parent POM for org.apache.maven.plugin.rresource.it.mrr41:parent:[unknown-version]: Could not transfer artifact org.apache.maven.plugin.rresource.it:it-parent:pom:1.6-SNAPSHOT from/to apache-snapshots (http://repository.apache.org/snapshots/): Connect to repository.apache.org:80 [repository.apache.org/207.244.88.140] failed: Connection timed out: connect and 'parent.relativePath' points at wrong local POM @ org.apache.maven.plugin.rresource.it.mrr41:parent:[unknown-version], F:\jenkins\jenkins-slave\workspace\rces-plugin_MRRESOURCES-104-LGCBGPPUNLUBE2DYS4XSK7TMPVBNNKKJD5CX73QOJHAO4AO3H5JA\m\target\test-classes\run-only-at-execution-root\pom.xml, line 24, column 11
[FATAL] Non-resolvable parent POM for org.apache.maven.plugin.rresource.it.mrr41:parent:[unknown-version]: Failure to transfer org.apache.maven.plugin.rresource.it:it-parent:pom:1.6-SNAPSHOT from http://repository.apache.org/snapshots/ was cached in the local repository, resolution will not be reattempted until the update interval of apache-snapshots has elapsed or updates are forced. Original error: Could not transfer artifact org.apache.maven.plugin.rresource.it:it-parent:pom:1.6-SNAPSHOT from/to apache-snapshots (http://repository.apache.org/snapshots/): Connect to repository.apache.org:80 [repository.apache.org/207.244.88.140] failed: Connection timed out: connect and 'parent.relativePath' points at wrong local POM @ org.apache.maven.plugin.rresource.it.mrr41:parent:[unknown-version], F:\jenkins\jenkins-slave\workspace\rces-plugin_MRRESOURCES-104-LGCBGPPUNLUBE2DYS4XSK7TMPVBNNKKJD5CX73QOJHAO4AO3H5JA\m\target\test-classes\run-only-at-execution-root\pom.xml, line 24, column 11
 @ 
[ERROR] The build could not read 2 projects -> [Help 1]
org.apache.maven.project.ProjectBuildingException: Some problems were encountered while processing the POMs:
[FATAL] Non-resolvable parent POM for org.apache.maven.plugin.rresource.it.mrr41:parent:[unknown-version]: Could not transfer artifact org.apache.maven.plugin.rresource.it:it-parent:pom:1.6-SNAPSHOT from/to apache-snapshots (http://repository.apache.org/snapshots/): Connect to repository.apache.org:80 [repository.apache.org/207.244.88.140] failed: Connection timed out: connect and 'parent.relativePath' points at wrong local POM @ org.apache.maven.plugin.rresource.it.mrr41:parent:[unknown-version], F:\jenkins\jenkins-slave\workspace\rces-plugin_MRRESOURCES-104-LGCBGPPUNLUBE2DYS4XSK7TMPVBNNKKJD5CX73QOJHAO4AO3H5JA\m\target\test-classes\run-only-at-execution-root\pom.xml, line 24, column 11
[FATAL] Non-resolvable parent POM for org.apache.maven.plugin.rresource.it.mrr41:parent:[unknown-version]: Failure to transfer org.apache.maven.plugin.rresource.it:it-parent:pom:1.6-SNAPSHOT from http://repository.apache.org/snapshots/ was cached in the local repository, resolution will not be reattempted until the update interval of apache-snapshots has elapsed or updates are forced. Original error: Could not transfer artifact org.apache.maven.plugin.rresource.it:it-parent:pom:1.6-SNAPSHOT from/to apache-snapshots (http://repository.apache.org/snapshots/): Connect to repository.apache.org:80 [repository.apache.org/207.244.88.140] failed: Connection timed out: connect and 'parent.relativePath' points at wrong local POM @ org.apache.maven.plugin.rresource.it.mrr41:parent:[unknown-version], F:\jenkins\jenkins-slave\workspace\rces-plugin_MRRESOURCES-104-LGCBGPPUNLUBE2DYS4XSK7TMPVBNNKKJD5CX73QOJHAO4AO3H5JA\m\target\test-classes\run-only-at-execution-root\pom.xml, line 24, column 11

 at org.apache.maven.project.DefaultProjectBuilder.build(DefaultProjectBuilder.java:382)
 at org.apache.maven.graph.DefaultGraphBuilder.collectProjects(DefaultGraphBuilder.java:400)
 at org.apache.maven.graph.DefaultGraphBuilder.getProjectsForMavenReactor(DefaultGraphBuilder.java:391)
 at org.apache.maven.graph.DefaultGraphBuilder.build(DefaultGraphBuilder.java:78)
 at org.apache.maven.DefaultMaven.buildGraph(DefaultMaven.java:511)
 at org.apache.maven.DefaultMaven.doExecute(DefaultMaven.java:221)
 at org.apache.maven.DefaultMaven.doExecute(DefaultMaven.java:194)
 at org.apache.maven.DefaultMaven.execute(DefaultMaven.java:107)
 at org.apache.maven.cli.MavenCli.execute(MavenCli.java:993)
 at org.apache.maven.cli.MavenCli.doMain(MavenCli.java:345)
 at org.apache.maven.cli.MavenCli.main(MavenCli.java:191)
 at sun.reflect.NativeMethodAccessorImpl.invoke0(Native Method)
 at sun.reflect.NativeMethodAccessorImpl.invoke(NativeMethodAccessorImpl.java:57)
 at sun.reflect.DelegatingMethodAccessorImpl.invoke(DelegatingMethodAccessorImpl.java:43)
 at java.lang.reflect.Method.invoke(Method.java:606)
 at org.codehaus.plexus.classworlds.launcher.Launcher.launchEnhanced(Launcher.java:289)
 at org.codehaus.plexus.classworlds.launcher.Launcher.launch(Launcher.java:229)
 at org.codehaus.plexus.classworlds.launcher.Launcher.mainWithExitCode(Launcher.java:415)
 at org.codehaus.plexus.classworlds.launcher.Launcher.main(Launcher.java:356)
[ERROR]   
[ERROR]   The project org.apache.maven.plugin.rresource.it.mrr41:child-1:[unknown-version] (F:\jenkins\jenkins-slave\workspace\rces-plugin_MRRESOURCES-104-LGCBGPPUNLUBE2DYS4XSK7TMPVBNNKKJD5CX73QOJHAO4AO3H5JA\m\target\test-classes\run-only-at-execution-root\child1\pom.xml) has 1 error
[ERROR]     Non-resolvable parent POM for org.apache.maven.plugin.rresource.it.mrr41:parent:[unknown-version]: Could not transfer artifact org.apache.maven.plugin.rresource.it:it-parent:pom:1.6-SNAPSHOT from/to apache-snapshots (http://repository.apache.org/snapshots/): Connect to repository.apache.org:80 [repository.apache.org/207.244.88.140] failed: Connection timed out: connect and 'parent.relativePath' points at wrong local POM @ org.apache.maven.plugin.rresource.it.mrr41:parent:[unknown-version], F:\jenkins\jenkins-slave\workspace\rces-plugin_MRRESOURCES-104-LGCBGPPUNLUBE2DYS4XSK7TMPVBNNKKJD5CX73QOJHAO4AO3H5JA\m\target\test-classes\run-only-at-execution-root\pom.xml, line 24, column 11 -> [Help 2]
org.apache.maven.model.resolution.UnresolvableModelException: Could not transfer artifact org.apache.maven.plugin.rresource.it:it-parent:pom:1.6-SNAPSHOT from/to apache-snapshots (http://repository.apache.org/snapshots/): Connect to repository.apache.org:80 [repository.apache.org/207.244.88.140] failed: Connection timed out: connect
 at org.apache.maven.project.ProjectModelResolver.resolveModel(ProjectModelResolver.java:197)
 at org.apache.maven.project.ProjectModelResolver.resolveModel(ProjectModelResolver.java:243)
 at org.apache.maven.model.building.DefaultModelBuilder.readParentExternally(DefaultModelBuilder.java:1051)
 at org.apache.maven.model.building.DefaultModelBuilder.readParent(DefaultModelBuilder.java:851)
 at org.apache.maven.model.building.DefaultModelBuilder.build(DefaultModelBuilder.java:331)
 at org.apache.maven.project.DefaultProjectBuilder.build(DefaultProjectBuilder.java:429)
 at org.apache.maven.project.DefaultProjectBuilder.build(DefaultProjectBuilder.java:398)
 at org.apache.maven.project.DefaultProjectBuilder.build(DefaultProjectBuilder.java:515)
 at org.apache.maven.project.DefaultProjectBuilder.build(DefaultProjectBuilder.java:398)
 at org.apache.maven.project.DefaultProjectBuilder.build(DefaultProjectBuilder.java:361)
 at org.apache.maven.graph.DefaultGraphBuilder.collectProjects(DefaultGraphBuilder.java:400)
 at org.apache.maven.graph.DefaultGraphBuilder.getProjectsForMavenReactor(DefaultGraphBuilder.java:391)
 at org.apache.maven.graph.DefaultGraphBuilder.build(DefaultGraphBuilder.java:78)
 at org.apache.maven.DefaultMaven.buildGraph(DefaultMaven.java:511)
 at org.apache.maven.DefaultMaven.doExecute(DefaultMaven.java:221)
 at org.apache.maven.DefaultMaven.doExecute(DefaultMaven.java:194)
 at org.apache.maven.DefaultMaven.execute(DefaultMaven.java:107)
 at org.apache.maven.cli.MavenCli.execute(MavenCli.java:993)
 at org.apache.maven.cli.MavenCli.doMain(MavenCli.java:345)
 at org.apache.maven.cli.MavenCli.main(MavenCli.java:191)
 at sun.reflect.NativeMethodAccessorImpl.invoke0(Native Method)
 at sun.reflect.NativeMethodAccessorImpl.invoke(NativeMethodAccessorImpl.java:57)
 at sun.reflect.DelegatingMethodAccessorImpl.invoke(DelegatingMethodAccessorImpl.java:43)
 at java.lang.reflect.Method.invoke(Method.java:606)
 at org.codehaus.plexus.classworlds.launcher.Launcher.launchEnhanced(Launcher.java:289)
 at org.codehaus.plexus.classworlds.launcher.Launcher.launch(Launcher.java:229)
 at org.codehaus.plexus.classworlds.launcher.Launcher.mainWithExitCode(Launcher.java:415)
 at org.codehaus.plexus.classworlds.launcher.Launcher.main(Launcher.java:356)
Caused by: org.eclipse.aether.resolution.ArtifactResolutionException: Could not transfer artifact org.apache.maven.plugin.rresource.it:it-parent:pom:1.6-SNAPSHOT from/to apache-snapshots (http://repository.apache.org/snapshots/): Connect to repository.apache.org:80 [repository.apache.org/207.244.88.140] failed: Connection timed out: connect
 at org.eclipse.aether.internal.impl.DefaultArtifactResolver.resolve(DefaultArtifactResolver.java:453)
 at org.eclipse.aether.internal.impl.DefaultArtifactResolver.resolveArtifacts(DefaultArtifactResolver.java:255)
 at org.eclipse.aether.internal.impl.DefaultArtifactResolver.resolveArtifact(DefaultArtifactResolver.java:232)
 at org.eclipse.aether.internal.impl.DefaultRepositorySystem.resolveArtifact(DefaultRepositorySystem.java:303)
 at org.apache.maven.project.ProjectModelResolver.resolveModel(ProjectModelResolver.java:193)
 ... 27 more
Caused by: org.eclipse.aether.transfer.ArtifactTransferException: Could not transfer artifact org.apache.maven.plugin.rresource.it:it-parent:pom:1.6-SNAPSHOT from/to apache-snapshots (http://repository.apache.org/snapshots/): Connect to repository.apache.org:80 [repository.apache.org/207.244.88.140] failed: Connection timed out: connect
 at org.eclipse.aether.connector.basic.ArtifactTransportListener.transferFailed(ArtifactTransportListener.java:52)
 at org.eclipse.aether.connector.basic.BasicRepositoryConnector$TaskRunner.run(BasicRepositoryConnector.java:364)
 at org.eclipse.aether.util.concurrency.RunnableErrorForwarder$1.run(RunnableErrorForwarder.java:76)
 at org.eclipse.aether.connector.basic.BasicRepositoryConnector$DirectExecutor.execute(BasicRepositoryConnector.java:590)
 at org.eclipse.aether.connector.basic.BasicRepositoryConnector.get(BasicRepositoryConnector.java:258)
 at org.eclipse.aether.internal.impl.DefaultArtifactResolver.performDownloads(DefaultArtifactResolver.java:529)
 at org.eclipse.aether.internal.impl.DefaultArtifactResolver.resolve(DefaultArtifactResolver.java:430)
 ... 31 more
Caused by: org.apache.maven.wagon.TransferFailedException: Connect to repository.apache.org:80 [repository.apache.org/207.244.88.140] failed: Connection timed out: connect
 at org.apache.maven.wagon.providers.http.AbstractHttpClientWagon.fillInputData(AbstractHttpClientWagon.java:1068)
 at org.apache.maven.wagon.providers.http.AbstractHttpClientWagon.fillInputData(AbstractHttpClientWagon.java:962)
 at org.apache.maven.wagon.StreamWagon.getInputStream(StreamWagon.java:126)
 at org.apache.maven.wagon.StreamWagon.getIfNewer(StreamWagon.java:88)
 at org.apache.maven.wagon.StreamWagon.get(StreamWagon.java:61)
 at org.eclipse.aether.transport.wagon.WagonTransporter$GetTaskRunner.run(WagonTransporter.java:569)
 at org.eclipse.aether.transport.wagon.WagonTransporter.execute(WagonTransporter.java:436)
 at org.eclipse.aether.transport.wagon.WagonTransporter.get(WagonTransporter.java:413)
 at org.eclipse.aether.connector.basic.BasicRepositoryConnector$GetTaskRunner.runTask(BasicRepositoryConnector.java:456)
 at org.eclipse.aether.connector.basic.BasicRepositoryConnector$TaskRunner.run(BasicRepositoryConnector.java:359)
 ... 36 more
Caused by: org.apache.maven.wagon.providers.http.httpclient.conn.HttpHostConnectException: Connect to repository.apache.org:80 [repository.apache.org/207.244.88.140] failed: Connection timed out: connect
 at org.apache.maven.wagon.providers.http.httpclient.impl.conn.DefaultHttpClientConnectionOperator.connect(DefaultHttpClientConnectionOperator.java:158)
 at org.apache.maven.wagon.providers.http.httpclient.impl.conn.PoolingHttpClientConnectionManager.connect(PoolingHttpClientConnectionManager.java:353)
 at org.apache.maven.wagon.providers.http.httpclient.impl.execchain.MainClientExec.establishRoute(MainClientExec.java:380)
 at org.apache.maven.wagon.providers.http.httpclient.impl.execchain.MainClientExec.execute(MainClientExec.java:236)
 at org.apache.maven.wagon.providers.http.httpclient.impl.execchain.ProtocolExec.execute(ProtocolExec.java:184)
 at org.apache.maven.wagon.providers.http.httpclient.impl.execchain.RetryExec.execute(RetryExec.java:88)
 at org.apache.maven.wagon.providers.http.httpclient.impl.execchain.RedirectExec.execute(RedirectExec.java:110)
 at org.apache.maven.wagon.providers.http.httpclient.impl.client.InternalHttpClient.doExecute(InternalHttpClient.java:184)
 at org.apache.maven.wagon.providers.http.httpclient.impl.client.CloseableHttpClient.execute(CloseableHttpClient.java:82)
 at org.apache.maven.wagon.providers.http.AbstractHttpClientWagon.execute(AbstractHttpClientWagon.java:834)
 at org.apache.maven.wagon.providers.http.AbstractHttpClientWagon.fillInputData(AbstractHttpClientWagon.java:985)
 ... 45 more
Caused by: java.net.ConnectException: Connection timed out: connect
 at java.net.DualStackPlainSocketImpl.connect0(Native Method)
 at java.net.DualStackPlainSocketImpl.socketConnect(DualStackPlainSocketImpl.java:79)
 at java.net.AbstractPlainSocketImpl.doConnect(AbstractPlainSocketImpl.java:339)
 at java.net.AbstractPlainSocketImpl.connectToAddress(AbstractPlainSocketImpl.java:200)
 at java.net.AbstractPlainSocketImpl.connect(AbstractPlainSocketImpl.java:182)
 at java.net.PlainSocketImpl.connect(PlainSocketImpl.java:172)
 at java.net.SocksSocketImpl.connect(SocksSocketImpl.java:392)
 at java.net.Socket.connect(Socket.java:579)
 at org.apache.maven.wagon.providers.http.httpclient.conn.socket.PlainConnectionSocketFactory.connectSocket(PlainConnectionSocketFactory.java:74)
 at org.apache.maven.wagon.providers.http.httpclient.impl.conn.DefaultHttpClientConnectionOperator.connect(DefaultHttpClientConnectionOperator.java:141)
 ... 55 more
[ERROR]   
[ERROR]   The project org.apache.maven.plugin.rresource.it.mrr41:child-2:[unknown-version] (F:\jenkins\jenkins-slave\workspace\rces-plugin_MRRESOURCES-104-LGCBGPPUNLUBE2DYS4XSK7TMPVBNNKKJD5CX73QOJHAO4AO3H5JA\m\target\test-classes\run-only-at-execution-root\child2\pom.xml) has 1 error
[ERROR]     Non-resolvable parent POM for org.apache.maven.plugin.rresource.it.mrr41:parent:[unknown-version]: Failure to transfer org.apache.maven.plugin.rresource.it:it-parent:pom:1.6-SNAPSHOT from http://repository.apache.org/snapshots/ was cached in the local repository, resolution will not be reattempted until the update interval of apache-snapshots has elapsed or updates are forced. Original error: Could not transfer artifact org.apache.maven.plugin.rresource.it:it-parent:pom:1.6-SNAPSHOT from/to apache-snapshots (http://repository.apache.org/snapshots/): Connect to repository.apache.org:80 [repository.apache.org/207.244.88.140] failed: Connection timed out: connect and 'parent.relativePath' points at wrong local POM @ org.apache.maven.plugin.rresource.it.mrr41:parent:[unknown-version], F:\jenkins\jenkins-slave\workspace\rces-plugin_MRRESOURCES-104-LGCBGPPUNLUBE2DYS4XSK7TMPVBNNKKJD5CX73QOJHAO4AO3H5JA\m\target\test-classes\run-only-at-execution-root\pom.xml, line 24, column 11 -> [Help 2]
org.apache.maven.model.resolution.UnresolvableModelException: Failure to transfer org.apache.maven.plugin.rresource.it:it-parent:pom:1.6-SNAPSHOT from http://repository.apache.org/snapshots/ was cached in the local repository, resolution will not be reattempted until the update interval of apache-snapshots has elapsed or updates are forced. Original error: Could not transfer artifact org.apache.maven.plugin.rresource.it:it-parent:pom:1.6-SNAPSHOT from/to apache-snapshots (http://repository.apache.org/snapshots/): Connect to repository.apache.org:80 [repository.apache.org/207.244.88.140] failed: Connection timed out: connect
 at org.apache.maven.project.ProjectModelResolver.resolveModel(ProjectModelResolver.java:197)
 at org.apache.maven.project.ProjectModelResolver.resolveModel(ProjectModelResolver.java:243)
 at org.apache.maven.model.building.DefaultModelBuilder.readParentExternally(DefaultModelBuilder.java:1051)
 at org.apache.maven.model.building.DefaultModelBuilder.readParent(DefaultModelBuilder.java:851)
 at org.apache.maven.model.building.DefaultModelBuilder.build(DefaultModelBuilder.java:331)
 at org.apache.maven.project.DefaultProjectBuilder.build(DefaultProjectBuilder.java:429)
 at org.apache.maven.project.DefaultProjectBuilder.build(DefaultProjectBuilder.java:398)
 at org.apache.maven.project.DefaultProjectBuilder.build(DefaultProjectBuilder.java:515)
 at org.apache.maven.project.DefaultProjectBuilder.build(DefaultProjectBuilder.java:398)
 at org.apache.maven.project.DefaultProjectBuilder.build(DefaultProjectBuilder.java:361)
 at org.apache.maven.graph.DefaultGraphBuilder.collectProjects(DefaultGraphBuilder.java:400)
 at org.apache.maven.graph.DefaultGraphBuilder.getProjectsForMavenReactor(DefaultGraphBuilder.java:391)
 at org.apache.maven.graph.DefaultGraphBuilder.build(DefaultGraphBuilder.java:78)
 at org.apache.maven.DefaultMaven.buildGraph(DefaultMaven.java:511)
 at org.apache.maven.DefaultMaven.doExecute(DefaultMaven.java:221)
 at org.apache.maven.DefaultMaven.doExecute(DefaultMaven.java:194)
 at org.apache.maven.DefaultMaven.execute(DefaultMaven.java:107)
 at org.apache.maven.cli.MavenCli.execute(MavenCli.java:993)
 at org.apache.maven.cli.MavenCli.doMain(MavenCli.java:345)
 at org.apache.maven.cli.MavenCli.main(MavenCli.java:191)
 at sun.reflect.NativeMethodAccessorImpl.invoke0(Native Method)
 at sun.reflect.NativeMethodAccessorImpl.invoke(NativeMethodAccessorImpl.java:57)
 at sun.reflect.DelegatingMethodAccessorImpl.invoke(DelegatingMethodAccessorImpl.java:43)
 at java.lang.reflect.Method.invoke(Method.java:606)
 at org.codehaus.plexus.classworlds.launcher.Launcher.launchEnhanced(Launcher.java:289)
 at org.codehaus.plexus.classworlds.launcher.Launcher.launch(Launcher.java:229)
 at org.codehaus.plexus.classworlds.launcher.Launcher.mainWithExitCode(Launcher.java:415)
 at org.codehaus.plexus.classworlds.launcher.Launcher.main(Launcher.java:356)
Caused by: org.eclipse.aether.resolution.ArtifactResolutionException: Failure to transfer org.apache.maven.plugin.rresource.it:it-parent:pom:1.6-SNAPSHOT from http://repository.apache.org/snapshots/ was cached in the local repository, resolution will not be reattempted until the update interval of apache-snapshots has elapsed or updates are forced. Original error: Could not transfer artifact org.apache.maven.plugin.rresource.it:it-parent:pom:1.6-SNAPSHOT from/to apache-snapshots (http://repository.apache.org/snapshots/): Connect to repository.apache.org:80 [repository.apache.org/207.244.88.140] failed: Connection timed out: connect
 at org.eclipse.aether.internal.impl.DefaultArtifactResolver.resolve(DefaultArtifactResolver.java:453)
 at org.eclipse.aether.internal.impl.DefaultArtifactResolver.resolveArtifacts(DefaultArtifactResolver.java:255)
 at org.eclipse.aether.internal.impl.DefaultArtifactResolver.resolveArtifact(DefaultArtifactResolver.java:232)
 at org.eclipse.aether.internal.impl.DefaultRepositorySystem.resolveArtifact(DefaultRepositorySystem.java:303)
 at org.apache.maven.project.ProjectModelResolver.resolveModel(ProjectModelResolver.java:193)
 ... 27 more
Caused by: org.eclipse.aether.transfer.ArtifactTransferException: Failure to transfer org.apache.maven.plugin.rresource.it:it-parent:pom:1.6-SNAPSHOT from http://repository.apache.org/snapshots/ was cached in the local repository, resolution will not be reattempted until the update interval of apache-snapshots has elapsed or updates are forced. Original error: Could not transfer artifact org.apache.maven.plugin.rresource.it:it-parent:pom:1.6-SNAPSHOT from/to apache-snapshots (http://repository.apache.org/snapshots/): Connect to repository.apache.org:80 [repository.apache.org/207.244.88.140] failed: Connection timed out: connect
 at org.eclipse.aether.internal.impl.DefaultUpdateCheckManager.newException(DefaultUpdateCheckManager.java:247)
 at org.eclipse.aether.internal.impl.DefaultUpdateCheckManager.checkArtifact(DefaultUpdateCheckManager.java:192)
 at org.eclipse.aether.internal.impl.DefaultArtifactResolver.gatherDownloads(DefaultArtifactResolver.java:594)
 at org.eclipse.aether.internal.impl.DefaultArtifactResolver.performDownloads(DefaultArtifactResolver.java:512)
 at org.eclipse.aether.internal.impl.DefaultArtifactResolver.resolve(DefaultArtifactResolver.java:430)
 ... 31 more
[ERROR] 
[ERROR] Re-run Maven using the -X switch to enable full debug logging.
[ERROR] 
[ERROR] For more information about the errors and possible solutions, please read the following articles:
[ERROR] [Help 1] http://cwiki.apache.org/confluence/display/MAVEN/ProjectBuildingException
[ERROR] [Help 2] http://cwiki.apache.org/confluence/display/MAVEN/UnresolvableModelException
Picked up JAVA_TOOL_OPTIONS: -Dmaven.ext.class.path="f:\jenkins\jenkins-slave\workspace\rces-plugin_MRRESOURCES-104-LGCBGPPUNLUBE2DYS4XSK7TMPVBNNKKJD5CX73QOJHAO4AO3H5JA@tmp\withMavenb4948bf7\pipeline-maven-spy.jar" -Dorg.jenkinsci.plugins.pipeline.maven.reportsFolder="f:\jenkins\jenkins-slave\workspace\rces-plugin_MRRESOURCES-104-LGCBGPPUNLUBE2DYS4XSK7TMPVBNNKKJD5CX73QOJHAO4AO3H5JA@tmp\withMavenb4948bf7" 


Stack Trace:
org.apache.maven.it.VerificationException: 
Exit code was non-zero: 1; command line and log = 
F:\jenkins\tools\maven\apache-maven-3.5.0\bin\mvn -e --batch-mode -Dmaven.repo.local=f:\jenkins\jenkins-slave\workspace\rces-plugin_MRRESOURCES-104-LGCBGPPUNLUBE2DYS4XSK7TMPVBNNKKJD5CX73QOJHAO4AO3H5JA\m\target/it-repo org.apache.maven.plugins:maven-clean-plugin:clean generate-resources
[INFO] [jenkins-event-spy] Jenkins Maven Event Spy is disabled
[INFO] Error stacktraces are turned on.
[INFO] Scanning for projects...
[INFO] Downloading: http://repository.apache.org/snapshots/org/apache/maven/plugin/rresource/it/it-parent/1.6-SNAPSHOT/maven-metadata.xml
[WARNING] Could not transfer metadata org.apache.maven.plugin.rresource.it:it-parent:1.6-SNAPSHOT/maven-metadata.xml from/to apache-snapshots (http://repository.apache.org/snapshots/): Connect to repository.apache.org:80 [repository.apache.org/207.244.88.140] failed: Connection timed out: connect
[INFO] Downloading: http://repository.apache.org/snapshots/org/apache/maven/plugin/rresource/it/it-parent/1.6-SNAPSHOT/it-parent-1.6-SNAPSHOT.pom
[ERROR] [ERROR] Some problems were encountered while processing the POMs:
[FATAL] Non-resolvable parent POM for org.apache.maven.plugin.rresource.it.mrr41:parent:[unknown-version]: Could not transfer artifact org.apache.maven.plugin.rresource.it:it-parent:pom:1.6-SNAPSHOT from/to apache-snapshots (http://repository.apache.org/snapshots/): Connect to repository.apache.org:80 [repository.apache.org/207.244.88.140] failed: Connection timed out: connect and 'parent.relativePath' points at wrong local POM @ org.apache.maven.plugin.rresource.it.mrr41:parent:[unknown-version], F:\jenkins\jenkins-slave\workspace\rces-plugin_MRRESOURCES-104-LGCBGPPUNLUBE2DYS4XSK7TMPVBNNKKJD5CX73QOJHAO4AO3H5JA\m\target\test-classes\run-only-at-execution-root\pom.xml, line 24, column 11
[FATAL] Non-resolvable parent POM for org.apache.maven.plugin.rresource.it.mrr41:parent:[unknown-version]: Failure to transfer org.apache.maven.plugin.rresource.it:it-parent:pom:1.6-SNAPSHOT from http://repository.apache.org/snapshots/ was cached in the local repository, resolution will not be reattempted until the update interval of apache-snapshots has elapsed or updates are forced. Original error: Could not transfer artifact org.apache.maven.plugin.rresource.it:it-parent:pom:1.6-SNAPSHOT from/to apache-snapshots (http://repository.apache.org/snapshots/): Connect to repository.apache.org:80 [repository.apache.org/207.244.88.140] failed: Connection timed out: connect and 'parent.relativePath' points at wrong local POM @ org.apache.maven.plugin.rresource.it.mrr41:parent:[unknown-version], F:\jenkins\jenkins-slave\workspace\rces-plugin_MRRESOURCES-104-LGCBGPPUNLUBE2DYS4XSK7TMPVBNNKKJD5CX73QOJHAO4AO3H5JA\m\target\test-classes\run-only-at-execution-root\pom.xml, line 24, column 11
 @ 
[ERROR] The build could not read 2 projects -> [Help 1]
org.apache.maven.project.ProjectBuildingException: Some problems were encountered while processing the POMs:
[FATAL] Non-resolvable parent POM for org.apache.maven.plugin.rresource.it.mrr41:parent:[unknown-version]: Could not transfer artifact org.apache.maven.plugin.rresource.it:it-parent:pom:1.6-SNAPSHOT from/to apache-snapshots (http://repository.apache.org/snapshots/): Connect to repository.apache.org:80 [repository.apache.org/207.244.88.140] failed: Connection timed out: connect and 'parent.relativePath' points at wrong local POM @ org.apache.maven.plugin.rresource.it.mrr41:parent:[unknown-version], F:\jenkins\jenkins-slave\workspace\rces-plugin_MRRESOURCES-104-LGCBGPPUNLUBE2DYS4XSK7TMPVBNNKKJD5CX73QOJHAO4AO3H5JA\m\target\test-classes\run-only-at-execution-root\pom.xml, line 24, column 11
[FATAL] Non-resolvable parent POM for org.apache.maven.plugin.rresource.it.mrr41:parent:[unknown-version]: Failure to transfer org.apache.maven.plugin.rresource.it:it-parent:pom:1.6-SNAPSHOT from http://repository.apache.org/snapshots/ was cached in the local repository, resolution will not be reattempted until the update interval of apache-snapshots has elapsed or updates are forced. Original error: Could not transfer artifact org.apache.maven.plugin.rresource.it:it-parent:pom:1.6-SNAPSHOT from/to apache-snapshots (http://repository.apache.org/snapshots/): Connect to repository.apache.org:80 [repository.apache.org/207.244.88.140] failed: Connection timed out: connect and 'parent.relativePath' points at wrong local POM @ org.apache.maven.plugin.rresource.it.mrr41:parent:[unknown-version], F:\jenkins\jenkins-slave\workspace\rces-plugin_MRRESOURCES-104-LGCBGPPUNLUBE2DYS4XSK7TMPVBNNKKJD5CX73QOJHAO4AO3H5JA\m\target\test-classes\run-only-at-execution-root\pom.xml, line 24, column 11

	at org.apache.maven.project.DefaultProjectBuilder.build(DefaultProjectBuilder.java:382)
	at org.apache.maven.graph.DefaultGraphBuilder.collectProjects(DefaultGraphBuilder.java:400)
	at org.apache.maven.graph.DefaultGraphBuilder.getProjectsForMavenReactor(DefaultGraphBuilder.java:391)
	at org.apache.maven.graph.DefaultGraphBuilder.build(DefaultGraphBuilder.java:78)
	at org.apache.maven.DefaultMaven.buildGraph(DefaultMaven.java:511)
	at org.apache.maven.DefaultMaven.doExecute(DefaultMaven.java:221)
	at org.apache.maven.DefaultMaven.doExecute(DefaultMaven.java:194)
	at org.apache.maven.DefaultMaven.execute(DefaultMaven.java:107)
	at org.apache.maven.cli.MavenCli.execute(MavenCli.java:993)
	at org.apache.maven.cli.MavenCli.doMain(MavenCli.java:345)
	at org.apache.maven.cli.MavenCli.main(MavenCli.java:191)
	at sun.reflect.NativeMethodAccessorImpl.invoke0(Native Method)
	at sun.reflect.NativeMethodAccessorImpl.invoke(NativeMethodAccessorImpl.java:57)
	at sun.reflect.DelegatingMethodAccessorImpl.invoke(DelegatingMethodAccessorImpl.java:43)
	at java.lang.reflect.Method.invoke(Method.java:606)
	at org.codehaus.plexus.classworlds.launcher.Launcher.launchEnhanced(Launcher.java:289)
	at org.codehaus.plexus.classworlds.launcher.Launcher.launch(Launcher.java:229)
	at org.codehaus.plexus.classworlds.launcher.Launcher.mainWithExitCode(Launcher.java:415)
	at org.codehaus.plexus.classworlds.launcher.Launcher.main(Launcher.java:356)
[ERROR]   
[ERROR]   The project org.apache.maven.plugin.rresource.it.mrr41:child-1:[unknown-version] (F:\jenkins\jenkins-slave\workspace\rces-plugin_MRRESOURCES-104-LGCBGPPUNLUBE2DYS4XSK7TMPVBNNKKJD5CX73QOJHAO4AO3H5JA\m\target\test-classes\run-only-at-execution-root\child1\pom.xml) has 1 error
[ERROR]     Non-resolvable parent POM for org.apache.maven.plugin.rresource.it.mrr41:parent:[unknown-version]: Could not transfer artifact org.apache.maven.plugin.rresource.it:it-parent:pom:1.6-SNAPSHOT from/to apache-snapshots (http://repository.apache.org/snapshots/): Connect to repository.apache.org:80 [repository.apache.org/207.244.88.140] failed: Connection timed out: connect and 'parent.relativePath' points at wrong local POM @ org.apache.maven.plugin.rresource.it.mrr41:parent:[unknown-version], F:\jenkins\jenkins-slave\workspace\rces-plugin_MRRESOURCES-104-LGCBGPPUNLUBE2DYS4XSK7TMPVBNNKKJD5CX73QOJHAO4AO3H5JA\m\target\test-classes\run-only-at-execution-root\pom.xml, line 24, column 11 -> [Help 2]
org.apache.maven.model.resolution.UnresolvableModelException: Could not transfer artifact org.apache.maven.plugin.rresource.it:it-parent:pom:1.6-SNAPSHOT from/to apache-snapshots (http://repository.apache.org/snapshots/): Connect to repository.apache.org:80 [repository.apache.org/207.244.88.140] failed: Connection timed out: connect
	at org.apache.maven.project.ProjectModelResolver.resolveModel(ProjectModelResolver.java:197)
	at org.apache.maven.project.ProjectModelResolver.resolveModel(ProjectModelResolver.java:243)
	at org.apache.maven.model.building.DefaultModelBuilder.readParentExternally(DefaultModelBuilder.java:1051)
	at org.apache.maven.model.building.DefaultModelBuilder.readParent(DefaultModelBuilder.java:851)
	at org.apache.maven.model.building.DefaultModelBuilder.build(DefaultModelBuilder.java:331)
	at org.apache.maven.project.DefaultProjectBuilder.build(DefaultProjectBuilder.java:429)
	at org.apache.maven.project.DefaultProjectBuilder.build(DefaultProjectBuilder.java:398)
	at org.apache.maven.project.DefaultProjectBuilder.build(DefaultProjectBuilder.java:515)
	at org.apache.maven.project.DefaultProjectBuilder.build(DefaultProjectBuilder.java:398)
	at org.apache.maven.project.DefaultProjectBuilder.build(DefaultProjectBuilder.java:361)
	at org.apache.maven.graph.DefaultGraphBuilder.collectProjects(DefaultGraphBuilder.java:400)
	at org.apache.maven.graph.DefaultGraphBuilder.getProjectsForMavenReactor(DefaultGraphBuilder.java:391)
	at org.apache.maven.graph.DefaultGraphBuilder.build(DefaultGraphBuilder.java:78)
	at org.apache.maven.DefaultMaven.buildGraph(DefaultMaven.java:511)
	at org.apache.maven.DefaultMaven.doExecute(DefaultMaven.java:221)
	at org.apache.maven.DefaultMaven.doExecute(DefaultMaven.java:194)
	at org.apache.maven.DefaultMaven.execute(DefaultMaven.java:107)
	at org.apache.maven.cli.MavenCli.execute(MavenCli.java:993)
	at org.apache.maven.cli.MavenCli.doMain(MavenCli.java:345)
	at org.apache.maven.cli.MavenCli.main(MavenCli.java:191)
	at sun.reflect.NativeMethodAccessorImpl.invoke0(Native Method)
	at sun.reflect.NativeMethodAccessorImpl.invoke(NativeMethodAccessorImpl.java:57)
	at sun.reflect.DelegatingMethodAccessorImpl.invoke(DelegatingMethodAccessorImpl.java:43)
	at java.lang.reflect.Method.invoke(Method.java:606)
	at org.codehaus.plexus.classworlds.launcher.Launcher.launchEnhanced(Launcher.java:289)
	at org.codehaus.plexus.classworlds.launcher.Launcher.launch(Launcher.java:229)
	at org.codehaus.plexus.classworlds.launcher.Launcher.mainWithExitCode(Launcher.java:415)
	at org.codehaus.plexus.classworlds.launcher.Launcher.main(Launcher.java:356)
Caused by: org.eclipse.aether.resolution.ArtifactResolutionException: Could not transfer artifact org.apache.maven.plugin.rresource.it:it-parent:pom:1.6-SNAPSHOT from/to apache-snapshots (http://repository.apache.org/snapshots/): Connect to repository.apache.org:80 [repository.apache.org/207.244.88.140] failed: Connection timed out: connect
	at org.eclipse.aether.internal.impl.DefaultArtifactResolver.resolve(DefaultArtifactResolver.java:453)
	at org.eclipse.aether.internal.impl.DefaultArtifactResolver.resolveArtifacts(DefaultArtifactResolver.java:255)
	at org.eclipse.aether.internal.impl.DefaultArtifactResolver.resolveArtifact(DefaultArtifactResolver.java:232)
	at org.eclipse.aether.internal.impl.DefaultRepositorySystem.resolveArtifact(DefaultRepositorySystem.java:303)
	at org.apache.maven.project.ProjectModelResolver.resolveModel(ProjectModelResolver.java:193)
	... 27 more
Caused by: org.eclipse.aether.transfer.ArtifactTransferException: Could not transfer artifact org.apache.maven.plugin.rresource.it:it-parent:pom:1.6-SNAPSHOT from/to apache-snapshots (http://repository.apache.org/snapshots/): Connect to repository.apache.org:80 [repository.apache.org/207.244.88.140] failed: Connection timed out: connect
	at org.eclipse.aether.connector.basic.ArtifactTransportListener.transferFailed(ArtifactTransportListener.java:52)
	at org.eclipse.aether.connector.basic.BasicRepositoryConnector$TaskRunner.run(BasicRepositoryConnector.java:364)
	at org.eclipse.aether.util.concurrency.RunnableErrorForwarder$1.run(RunnableErrorForwarder.java:76)
	at org.eclipse.aether.connector.basic.BasicRepositoryConnector$DirectExecutor.execute(BasicRepositoryConnector.java:590)
	at org.eclipse.aether.connector.basic.BasicRepositoryConnector.get(BasicRepositoryConnector.java:258)
	at org.eclipse.aether.internal.impl.DefaultArtifactResolver.performDownloads(DefaultArtifactResolver.java:529)
	at org.eclipse.aether.internal.impl.DefaultArtifactResolver.resolve(DefaultArtifactResolver.java:430)
	... 31 more
Caused by: org.apache.maven.wagon.TransferFailedException: Connect to repository.apache.org:80 [repository.apache.org/207.244.88.140] failed: Connection timed out: connect
	at org.apache.maven.wagon.providers.http.AbstractHttpClientWagon.fillInputData(AbstractHttpClientWagon.java:1068)
	at org.apache.maven.wagon.providers.http.AbstractHttpClientWagon.fillInputData(AbstractHttpClientWagon.java:962)
	at org.apache.maven.wagon.StreamWagon.getInputStream(StreamWagon.java:126)
	at org.apache.maven.wagon.StreamWagon.getIfNewer(StreamWagon.java:88)
	at org.apache.maven.wagon.StreamWagon.get(StreamWagon.java:61)
	at org.eclipse.aether.transport.wagon.WagonTransporter$GetTaskRunner.run(WagonTransporter.java:569)
	at org.eclipse.aether.transport.wagon.WagonTransporter.execute(WagonTransporter.java:436)
	at org.eclipse.aether.transport.wagon.WagonTransporter.get(WagonTransporter.java:413)
	at org.eclipse.aether.connector.basic.BasicRepositoryConnector$GetTaskRunner.runTask(BasicRepositoryConnector.java:456)
	at org.eclipse.aether.connector.basic.BasicRepositoryConnector$TaskRunner.run(BasicRepositoryConnector.java:359)
	... 36 more
Caused by: org.apache.maven.wagon.providers.http.httpclient.conn.HttpHostConnectException: Connect to repository.apache.org:80 [repository.apache.org/207.244.88.140] failed: Connection timed out: connect
	at org.apache.maven.wagon.providers.http.httpclient.impl.conn.DefaultHttpClientConnectionOperator.connect(DefaultHttpClientConnectionOperator.java:158)
	at org.apache.maven.wagon.providers.http.httpclient.impl.conn.PoolingHttpClientConnectionManager.connect(PoolingHttpClientConnectionManager.java:353)
	at org.apache.maven.wagon.providers.http.httpclient.impl.execchain.MainClientExec.establishRoute(MainClientExec.java:380)
	at org.apache.maven.wagon.providers.http.httpclient.impl.execchain.MainClientExec.execute(MainClientExec.java:236)
	at org.apache.maven.wagon.providers.http.httpclient.impl.execchain.ProtocolExec.execute(ProtocolExec.java:184)
	at org.apache.maven.wagon.providers.http.httpclient.impl.execchain.RetryExec.execute(RetryExec.java:88)
	at org.apache.maven.wagon.providers.http.httpclient.impl.execchain.RedirectExec.execute(RedirectExec.java:110)
	at org.apache.maven.wagon.providers.http.httpclient.impl.client.InternalHttpClient.doExecute(InternalHttpClient.java:184)
	at org.apache.maven.wagon.providers.http.httpclient.impl.client.CloseableHttpClient.execute(CloseableHttpClient.java:82)
	at org.apache.maven.wagon.providers.http.AbstractHttpClientWagon.execute(AbstractHttpClientWagon.java:834)
	at org.apache.maven.wagon.providers.http.AbstractHttpClientWagon.fillInputData(AbstractHttpClientWagon.java:985)
	... 45 more
Caused by: java.net.ConnectException: Connection timed out: connect
	at java.net.DualStackPlainSocketImpl.connect0(Native Method)
	at java.net.DualStackPlainSocketImpl.socketConnect(DualStackPlainSocketImpl.java:79)
	at java.net.AbstractPlainSocketImpl.doConnect(AbstractPlainSocketImpl.java:339)
	at java.net.AbstractPlainSocketImpl.connectToAddress(AbstractPlainSocketImpl.java:200)
	at java.net.AbstractPlainSocketImpl.connect(AbstractPlainSocketImpl.java:182)
	at java.net.PlainSocketImpl.connect(PlainSocketImpl.java:172)
	at java.net.SocksSocketImpl.connect(SocksSocketImpl.java:392)
	at java.net.Socket.connect(Socket.java:579)
	at org.apache.maven.wagon.providers.http.httpclient.conn.socket.PlainConnectionSocketFactory.connectSocket(PlainConnectionSocketFactory.java:74)
	at org.apache.maven.wagon.providers.http.httpclient.impl.conn.DefaultHttpClientConnectionOperator.connect(DefaultHttpClientConnectionOperator.java:141)
	... 55 more
[ERROR]   
[ERROR]   The project org.apache.maven.plugin.rresource.it.mrr41:child-2:[unknown-version] (F:\jenkins\jenkins-slave\workspace\rces-plugin_MRRESOURCES-104-LGCBGPPUNLUBE2DYS4XSK7TMPVBNNKKJD5CX73QOJHAO4AO3H5JA\m\target\test-classes\run-only-at-execution-root\child2\pom.xml) has 1 error
[ERROR]     Non-resolvable parent POM for org.apache.maven.plugin.rresource.it.mrr41:parent:[unknown-version]: Failure to transfer org.apache.maven.plugin.rresource.it:it-parent:pom:1.6-SNAPSHOT from http://repository.apache.org/snapshots/ was cached in the local repository, resolution will not be reattempted until the update interval of apache-snapshots has elapsed or updates are forced. Original error: Could not transfer artifact org.apache.maven.plugin.rresource.it:it-parent:pom:1.6-SNAPSHOT from/to apache-snapshots (http://repository.apache.org/snapshots/): Connect to repository.apache.org:80 [repository.apache.org/207.244.88.140] failed: Connection timed out: connect and 'parent.relativePath' points at wrong local POM @ org.apache.maven.plugin.rresource.it.mrr41:parent:[unknown-version], F:\jenkins\jenkins-slave\workspace\rces-plugin_MRRESOURCES-104-LGCBGPPUNLUBE2DYS4XSK7TMPVBNNKKJD5CX73QOJHAO4AO3H5JA\m\target\test-classes\run-only-at-execution-root\pom.xml, line 24, column 11 -> [Help 2]
org.apache.maven.model.resolution.UnresolvableModelException: Failure to transfer org.apache.maven.plugin.rresource.it:it-parent:pom:1.6-SNAPSHOT from http://repository.apache.org/snapshots/ was cached in the local repository, resolution will not be reattempted until the update interval of apache-snapshots has elapsed or updates are forced. Original error: Could not transfer artifact org.apache.maven.plugin.rresource.it:it-parent:pom:1.6-SNAPSHOT from/to apache-snapshots (http://repository.apache.org/snapshots/): Connect to repository.apache.org:80 [repository.apache.org/207.244.88.140] failed: Connection timed out: connect
	at org.apache.maven.project.ProjectModelResolver.resolveModel(ProjectModelResolver.java:197)
	at org.apache.maven.project.ProjectModelResolver.resolveModel(ProjectModelResolver.java:243)
	at org.apache.maven.model.building.DefaultModelBuilder.readParentExternally(DefaultModelBuilder.java:1051)
	at org.apache.maven.model.building.DefaultModelBuilder.readParent(DefaultModelBuilder.java:851)
	at org.apache.maven.model.building.DefaultModelBuilder.build(DefaultModelBuilder.java:331)
	at org.apache.maven.project.DefaultProjectBuilder.build(DefaultProjectBuilder.java:429)
	at org.apache.maven.project.DefaultProjectBuilder.build(DefaultProjectBuilder.java:398)
	at org.apache.maven.project.DefaultProjectBuilder.build(DefaultProjectBuilder.java:515)
	at org.apache.maven.project.DefaultProjectBuilder.build(DefaultProjectBuilder.java:398)
	at org.apache.maven.project.DefaultProjectBuilder.build(DefaultProjectBuilder.java:361)
	at org.apache.maven.graph.DefaultGraphBuilder.collectProjects(DefaultGraphBuilder.java:400)
	at org.apache.maven.graph.DefaultGraphBuilder.getProjectsForMavenReactor(DefaultGraphBuilder.java:391)
	at org.apache.maven.graph.DefaultGraphBuilder.build(DefaultGraphBuilder.java:78)
	at org.apache.maven.DefaultMaven.buildGraph(DefaultMaven.java:511)
	at org.apache.maven.DefaultMaven.doExecute(DefaultMaven.java:221)
	at org.apache.maven.DefaultMaven.doExecute(DefaultMaven.java:194)
	at org.apache.maven.DefaultMaven.execute(DefaultMaven.java:107)
	at org.apache.maven.cli.MavenCli.execute(MavenCli.java:993)
	at org.apache.maven.cli.MavenCli.doMain(MavenCli.java:345)
	at org.apache.maven.cli.MavenCli.main(MavenCli.java:191)
	at sun.reflect.NativeMethodAccessorImpl.invoke0(Native Method)
	at sun.reflect.NativeMethodAccessorImpl.invoke(NativeMethodAccessorImpl.java:57)
	at sun.reflect.DelegatingMethodAccessorImpl.invoke(DelegatingMethodAccessorImpl.java:43)
	at java.lang.reflect.Method.invoke(Method.java:606)
	at org.codehaus.plexus.classworlds.launcher.Launcher.launchEnhanced(Launcher.java:289)
	at org.codehaus.plexus.classworlds.launcher.Launcher.launch(Launcher.java:229)
	at org.codehaus.plexus.classworlds.launcher.Launcher.mainWithExitCode(Launcher.java:415)
	at org.codehaus.plexus.classworlds.launcher.Launcher.main(Launcher.java:356)
Caused by: org.eclipse.aether.resolution.ArtifactResolutionException: Failure to transfer org.apache.maven.plugin.rresource.it:it-parent:pom:1.6-SNAPSHOT from http://repository.apache.org/snapshots/ was cached in the local repository, resolution will not be reattempted until the update interval of apache-snapshots has elapsed or updates are forced. Original error: Could not transfer artifact org.apache.maven.plugin.rresource.it:it-parent:pom:1.6-SNAPSHOT from/to apache-snapshots (http://repository.apache.org/snapshots/): Connect to repository.apache.org:80 [repository.apache.org/207.244.88.140] failed: Connection timed out: connect
	at org.eclipse.aether.internal.impl.DefaultArtifactResolver.resolve(DefaultArtifactResolver.java:453)
	at org.eclipse.aether.internal.impl.DefaultArtifactResolver.resolveArtifacts(DefaultArtifactResolver.java:255)
	at org.eclipse.aether.internal.impl.DefaultArtifactResolver.resolveArtifact(DefaultArtifactResolver.java:232)
	at org.eclipse.aether.internal.impl.DefaultRepositorySystem.resolveArtifact(DefaultRepositorySystem.java:303)
	at org.apache.maven.project.ProjectModelResolver.resolveModel(ProjectModelResolver.java:193)
	... 27 more
Caused by: org.eclipse.aether.transfer.ArtifactTransferException: Failure to transfer org.apache.maven.plugin.rresource.it:it-parent:pom:1.6-SNAPSHOT from http://repository.apache.org/snapshots/ was cached in the local repository, resolution will not be reattempted until the update interval of apache-snapshots has elapsed or updates are forced. Original error: Could not transfer artifact org.apache.maven.plugin.rresource.it:it-parent:pom:1.6-SNAPSHOT from/to apache-snapshots (http://repository.apache.org/snapshots/): Connect to repository.apache.org:80 [repository.apache.org/207.244.88.140] failed: Connection timed out: connect
	at org.eclipse.aether.internal.impl.DefaultUpdateCheckManager.newException(DefaultUpdateCheckManager.java:247)
	at org.eclipse.aether.internal.impl.DefaultUpdateCheckManager.checkArtifact(DefaultUpdateCheckManager.java:192)
	at org.eclipse.aether.internal.impl.DefaultArtifactResolver.gatherDownloads(DefaultArtifactResolver.java:594)
	at org.eclipse.aether.internal.impl.DefaultArtifactResolver.performDownloads(DefaultArtifactResolver.java:512)
	at org.eclipse.aether.internal.impl.DefaultArtifactResolver.resolve(DefaultArtifactResolver.java:430)
	... 31 more
[ERROR] 
[ERROR] Re-run Maven using the -X switch to enable full debug logging.
[ERROR] 
[ERROR] For more information about the errors and possible solutions, please read the following articles:
[ERROR] [Help 1] http://cwiki.apache.org/confluence/display/MAVEN/ProjectBuildingException
[ERROR] [Help 2] http://cwiki.apache.org/confluence/display/MAVEN/UnresolvableModelException
Picked up JAVA_TOOL_OPTIONS: -Dmaven.ext.class.path="f:\jenkins\jenkins-slave\workspace\rces-plugin_MRRESOURCES-104-LGCBGPPUNLUBE2DYS4XSK7TMPVBNNKKJD5CX73QOJHAO4AO3H5JA@tmp\withMavenb4948bf7\pipeline-maven-spy.jar" -Dorg.jenkinsci.plugins.pipeline.maven.reportsFolder="f:\jenkins\jenkins-slave\workspace\rces-plugin_MRRESOURCES-104-LGCBGPPUNLUBE2DYS4XSK7TMPVBNNKKJD5CX73QOJHAO4AO3H5JA@tmp\withMavenb4948bf7" 

	at org.apache.maven.plugin.resources.remote.it.IT_RunOnlyAtExecutionRoot.test(IT_RunOnlyAtExecutionRoot.java:60)


FAILED:  org.apache.maven.plugin.resources.remote.it.IT_RunOnlyAtExecutionRoot.test

Error Message:
Exit code was non-zero: 1; command line and log = 
F:\jenkins\tools\maven\apache-maven-3.5.0\bin\mvn -e --batch-mode -Dmaven.repo.local=f:\jenkins\jenkins-slave\workspace\rces-plugin_MRRESOURCES-104-LGCBGPPUNLUBE2DYS4XSK7TMPVBNNKKJD5CX73QOJHAO4AO3H5JA\m\target/it-repo org.apache.maven.plugins:maven-clean-plugin:clean generate-resources
[INFO] [jenkins-event-spy] Jenkins Maven Event Spy is disabled
[INFO] Error stacktraces are turned on.
[INFO] Scanning for projects...
[INFO] Downloading: http://repository.apache.org/snapshots/org/apache/maven/plugin/rresource/it/it-parent/1.6-SNAPSHOT/maven-metadata.xml
[WARNING] Could not transfer metadata org.apache.maven.plugin.rresource.it:it-parent:1.6-SNAPSHOT/maven-metadata.xml from/to apache-snapshots (http://repository.apache.org/snapshots/): Connect to repository.apache.org:80 [repository.apache.org/207.244.88.140] failed: Connection timed out: connect
[INFO] Downloading: http://repository.apache.org/snapshots/org/apache/maven/plugin/rresource/it/it-parent/1.6-SNAPSHOT/it-parent-1.6-SNAPSHOT.pom
[ERROR] [ERROR] Some problems were encountered while processing the POMs:
[FATAL] Non-resolvable parent POM for org.apache.maven.plugin.rresource.it.mrr41:parent:[unknown-version]: Could not transfer artifact org.apache.maven.plugin.rresource.it:it-parent:pom:1.6-SNAPSHOT from/to apache-snapshots (http://repository.apache.org/snapshots/): Connect to repository.apache.org:80 [repository.apache.org/207.244.88.140] failed: Connection timed out: connect and 'parent.relativePath' points at wrong local POM @ org.apache.maven.plugin.rresource.it.mrr41:parent:[unknown-version], F:\jenkins\jenkins-slave\workspace\rces-plugin_MRRESOURCES-104-LGCBGPPUNLUBE2DYS4XSK7TMPVBNNKKJD5CX73QOJHAO4AO3H5JA\m\target\test-classes\run-only-at-execution-root\pom.xml, line 24, column 11
[FATAL] Non-resolvable parent POM for org.apache.maven.plugin.rresource.it.mrr41:parent:[unknown-version]: Failure to transfer org.apache.maven.plugin.rresource.it:it-parent:pom:1.6-SNAPSHOT from http://repository.apache.org/snapshots/ was cached in the local repository, resolution will not be reattempted until the update interval of apache-snapshots has elapsed or updates are forced. Original error: Could not transfer artifact org.apache.maven.plugin.rresource.it:it-parent:pom:1.6-SNAPSHOT from/to apache-snapshots (http://repository.apache.org/snapshots/): Connect to repository.apache.org:80 [repository.apache.org/207.244.88.140] failed: Connection timed out: connect and 'parent.relativePath' points at wrong local POM @ org.apache.maven.plugin.rresource.it.mrr41:parent:[unknown-version], F:\jenkins\jenkins-slave\workspace\rces-plugin_MRRESOURCES-104-LGCBGPPUNLUBE2DYS4XSK7TMPVBNNKKJD5CX73QOJHAO4AO3H5JA\m\target\test-classes\run-only-at-execution-root\pom.xml, line 24, column 11
 @ 
[ERROR] The build could not read 2 projects -> [Help 1]
org.apache.maven.project.ProjectBuildingException: Some problems were encountered while processing the POMs:
[FATAL] Non-resolvable parent POM for org.apache.maven.plugin.rresource.it.mrr41:parent:[unknown-version]: Could not transfer artifact org.apache.maven.plugin.rresource.it:it-parent:pom:1.6-SNAPSHOT from/to apache-snapshots (http://repository.apache.org/snapshots/): Connect to repository.apache.org:80 [repository.apache.org/207.244.88.140] failed: Connection timed out: connect and 'parent.relativePath' points at wrong local POM @ org.apache.maven.plugin.rresource.it.mrr41:parent:[unknown-version], F:\jenkins\jenkins-slave\workspace\rces-plugin_MRRESOURCES-104-LGCBGPPUNLUBE2DYS4XSK7TMPVBNNKKJD5CX73QOJHAO4AO3H5JA\m\target\test-classes\run-only-at-execution-root\pom.xml, line 24, column 11
[FATAL] Non-resolvable parent POM for org.apache.maven.plugin.rresource.it.mrr41:parent:[unknown-version]: Failure to transfer org.apache.maven.plugin.rresource.it:it-parent:pom:1.6-SNAPSHOT from http://repository.apache.org/snapshots/ was cached in the local repository, resolution will not be reattempted until the update interval of apache-snapshots has elapsed or updates are forced. Original error: Could not transfer artifact org.apache.maven.plugin.rresource.it:it-parent:pom:1.6-SNAPSHOT from/to apache-snapshots (http://repository.apache.org/snapshots/): Connect to repository.apache.org:80 [repository.apache.org/207.244.88.140] failed: Connection timed out: connect and 'parent.relativePath' points at wrong local POM @ org.apache.maven.plugin.rresource.it.mrr41:parent:[unknown-version], F:\jenkins\jenkins-slave\workspace\rces-plugin_MRRESOURCES-104-LGCBGPPUNLUBE2DYS4XSK7TMPVBNNKKJD5CX73QOJHAO4AO3H5JA\m\target\test-classes\run-only-at-execution-root\pom.xml, line 24, column 11

 at org.apache.maven.project.DefaultProjectBuilder.build(DefaultProjectBuilder.java:382)
 at org.apache.maven.graph.DefaultGraphBuilder.collectProjects(DefaultGraphBuilder.java:400)
 at org.apache.maven.graph.DefaultGraphBuilder.getProjectsForMavenReactor(DefaultGraphBuilder.java:391)
 at org.apache.maven.graph.DefaultGraphBuilder.build(DefaultGraphBuilder.java:78)
 at org.apache.maven.DefaultMaven.buildGraph(DefaultMaven.java:511)
 at org.apache.maven.DefaultMaven.doExecute(DefaultMaven.java:221)
 at org.apache.maven.DefaultMaven.doExecute(DefaultMaven.java:194)
 at org.apache.maven.DefaultMaven.execute(DefaultMaven.java:107)
 at org.apache.maven.cli.MavenCli.execute(MavenCli.java:993)
 at org.apache.maven.cli.MavenCli.doMain(MavenCli.java:345)
 at org.apache.maven.cli.MavenCli.main(MavenCli.java:191)
 at sun.reflect.NativeMethodAccessorImpl.invoke0(Native Method)
 at sun.reflect.NativeMethodAccessorImpl.invoke(NativeMethodAccessorImpl.java:62)
 at sun.reflect.DelegatingMethodAccessorImpl.invoke(DelegatingMethodAccessorImpl.java:43)
 at java.lang.reflect.Method.invoke(Method.java:498)
 at org.codehaus.plexus.classworlds.launcher.Launcher.launchEnhanced(Launcher.java:289)
 at org.codehaus.plexus.classworlds.launcher.Launcher.launch(Launcher.java:229)
 at org.codehaus.plexus.classworlds.launcher.Launcher.mainWithExitCode(Launcher.java:415)
 at org.codehaus.plexus.classworlds.launcher.Launcher.main(Launcher.java:356)
[ERROR]   
[ERROR]   The project org.apache.maven.plugin.rresource.it.mrr41:child-1:[unknown-version] (F:\jenkins\jenkins-slave\workspace\rces-plugin_MRRESOURCES-104-LGCBGPPUNLUBE2DYS4XSK7TMPVBNNKKJD5CX73QOJHAO4AO3H5JA\m\target\test-classes\run-only-at-execution-root\child1\pom.xml) has 1 error
[ERROR]     Non-resolvable parent POM for org.apache.maven.plugin.rresource.it.mrr41:parent:[unknown-version]: Could not transfer artifact org.apache.maven.plugin.rresource.it:it-parent:pom:1.6-SNAPSHOT from/to apache-snapshots (http://repository.apache.org/snapshots/): Connect to repository.apache.org:80 [repository.apache.org/207.244.88.140] failed: Connection timed out: connect and 'parent.relativePath' points at wrong local POM @ org.apache.maven.plugin.rresource.it.mrr41:parent:[unknown-version], F:\jenkins\jenkins-slave\workspace\rces-plugin_MRRESOURCES-104-LGCBGPPUNLUBE2DYS4XSK7TMPVBNNKKJD5CX73QOJHAO4AO3H5JA\m\target\test-classes\run-only-at-execution-root\pom.xml, line 24, column 11 -> [Help 2]
org.apache.maven.model.resolution.UnresolvableModelException: Could not transfer artifact org.apache.maven.plugin.rresource.it:it-parent:pom:1.6-SNAPSHOT from/to apache-snapshots (http://repository.apache.org/snapshots/): Connect to repository.apache.org:80 [repository.apache.org/207.244.88.140] failed: Connection timed out: connect
 at org.apache.maven.project.ProjectModelResolver.resolveModel(ProjectModelResolver.java:197)
 at org.apache.maven.project.ProjectModelResolver.resolveModel(ProjectModelResolver.java:243)
 at org.apache.maven.model.building.DefaultModelBuilder.readParentExternally(DefaultModelBuilder.java:1051)
 at org.apache.maven.model.building.DefaultModelBuilder.readParent(DefaultModelBuilder.java:851)
 at org.apache.maven.model.building.DefaultModelBuilder.build(DefaultModelBuilder.java:331)
 at org.apache.maven.project.DefaultProjectBuilder.build(DefaultProjectBuilder.java:429)
 at org.apache.maven.project.DefaultProjectBuilder.build(DefaultProjectBuilder.java:398)
 at org.apache.maven.project.DefaultProjectBuilder.build(DefaultProjectBuilder.java:515)
 at org.apache.maven.project.DefaultProjectBuilder.build(DefaultProjectBuilder.java:398)
 at org.apache.maven.project.DefaultProjectBuilder.build(DefaultProjectBuilder.java:361)
 at org.apache.maven.graph.DefaultGraphBuilder.collectProjects(DefaultGraphBuilder.java:400)
 at org.apache.maven.graph.DefaultGraphBuilder.getProjectsForMavenReactor(DefaultGraphBuilder.java:391)
 at org.apache.maven.graph.DefaultGraphBuilder.build(DefaultGraphBuilder.java:78)
 at org.apache.maven.DefaultMaven.buildGraph(DefaultMaven.java:511)
 at org.apache.maven.DefaultMaven.doExecute(DefaultMaven.java:221)
 at org.apache.maven.DefaultMaven.doExecute(DefaultMaven.java:194)
 at org.apache.maven.DefaultMaven.execute(DefaultMaven.java:107)
 at org.apache.maven.cli.MavenCli.execute(MavenCli.java:993)
 at org.apache.maven.cli.MavenCli.doMain(MavenCli.java:345)
 at org.apache.maven.cli.MavenCli.main(MavenCli.java:191)
 at sun.reflect.NativeMethodAccessorImpl.invoke0(Native Method)
 at sun.reflect.NativeMethodAccessorImpl.invoke(NativeMethodAccessorImpl.java:62)
 at sun.reflect.DelegatingMethodAccessorImpl.invoke(DelegatingMethodAccessorImpl.java:43)
 at java.lang.reflect.Method.invoke(Method.java:498)
 at org.codehaus.plexus.classworlds.launcher.Launcher.launchEnhanced(Launcher.java:289)
 at org.codehaus.plexus.classworlds.launcher.Launcher.launch(Launcher.java:229)
 at org.codehaus.plexus.classworlds.launcher.Launcher.mainWithExitCode(Launcher.java:415)
 at org.codehaus.plexus.classworlds.launcher.Launcher.main(Launcher.java:356)
Caused by: org.eclipse.aether.resolution.ArtifactResolutionException: Could not transfer artifact org.apache.maven.plugin.rresource.it:it-parent:pom:1.6-SNAPSHOT from/to apache-snapshots (http://repository.apache.org/snapshots/): Connect to repository.apache.org:80 [repository.apache.org/207.244.88.140] failed: Connection timed out: connect
 at org.eclipse.aether.internal.impl.DefaultArtifactResolver.resolve(DefaultArtifactResolver.java:453)
 at org.eclipse.aether.internal.impl.DefaultArtifactResolver.resolveArtifacts(DefaultArtifactResolver.java:255)
 at org.eclipse.aether.internal.impl.DefaultArtifactResolver.resolveArtifact(DefaultArtifactResolver.java:232)
 at org.eclipse.aether.internal.impl.DefaultRepositorySystem.resolveArtifact(DefaultRepositorySystem.java:303)
 at org.apache.maven.project.ProjectModelResolver.resolveModel(ProjectModelResolver.java:193)
 ... 27 more
Caused by: org.eclipse.aether.transfer.ArtifactTransferException: Could not transfer artifact org.apache.maven.plugin.rresource.it:it-parent:pom:1.6-SNAPSHOT from/to apache-snapshots (http://repository.apache.org/snapshots/): Connect to repository.apache.org:80 [repository.apache.org/207.244.88.140] failed: Connection timed out: connect
 at org.eclipse.aether.connector.basic.ArtifactTransportListener.transferFailed(ArtifactTransportListener.java:52)
 at org.eclipse.aether.connector.basic.BasicRepositoryConnector$TaskRunner.run(BasicRepositoryConnector.java:364)
 at org.eclipse.aether.util.concurrency.RunnableErrorForwarder$1.run(RunnableErrorForwarder.java:76)
 at org.eclipse.aether.connector.basic.BasicRepositoryConnector$DirectExecutor.execute(BasicRepositoryConnector.java:590)
 at org.eclipse.aether.connector.basic.BasicRepositoryConnector.get(BasicRepositoryConnector.java:258)
 at org.eclipse.aether.internal.impl.DefaultArtifactResolver.performDownloads(DefaultArtifactResolver.java:529)
 at org.eclipse.aether.internal.impl.DefaultArtifactResolver.resolve(DefaultArtifactResolver.java:430)
 ... 31 more
Caused by: org.apache.maven.wagon.TransferFailedException: Connect to repository.apache.org:80 [repository.apache.org/207.244.88.140] failed: Connection timed out: connect
 at org.apache.maven.wagon.providers.http.AbstractHttpClientWagon.fillInputData(AbstractHttpClientWagon.java:1068)
 at org.apache.maven.wagon.providers.http.AbstractHttpClientWagon.fillInputData(AbstractHttpClientWagon.java:962)
 at org.apache.maven.wagon.StreamWagon.getInputStream(StreamWagon.java:126)
 at org.apache.maven.wagon.StreamWagon.getIfNewer(StreamWagon.java:88)
 at org.apache.maven.wagon.StreamWagon.get(StreamWagon.java:61)
 at org.eclipse.aether.transport.wagon.WagonTransporter$GetTaskRunner.run(WagonTransporter.java:569)
 at org.eclipse.aether.transport.wagon.WagonTransporter.execute(WagonTransporter.java:436)
 at org.eclipse.aether.transport.wagon.WagonTransporter.get(WagonTransporter.java:413)
 at org.eclipse.aether.connector.basic.BasicRepositoryConnector$GetTaskRunner.runTask(BasicRepositoryConnector.java:456)
 at org.eclipse.aether.connector.basic.BasicRepositoryConnector$TaskRunner.run(BasicRepositoryConnector.java:359)
 ... 36 more
Caused by: org.apache.maven.wagon.providers.http.httpclient.conn.HttpHostConnectException: Connect to repository.apache.org:80 [repository.apache.org/207.244.88.140] failed: Connection timed out: connect
 at org.apache.maven.wagon.providers.http.httpclient.impl.conn.DefaultHttpClientConnectionOperator.connect(DefaultHttpClientConnectionOperator.java:158)
 at org.apache.maven.wagon.providers.http.httpclient.impl.conn.PoolingHttpClientConnectionManager.connect(PoolingHttpClientConnectionManager.java:353)
 at org.apache.maven.wagon.providers.http.httpclient.impl.execchain.MainClientExec.establishRoute(MainClientExec.java:380)
 at org.apache.maven.wagon.providers.http.httpclient.impl.execchain.MainClientExec.execute(MainClientExec.java:236)
 at org.apache.maven.wagon.providers.http.httpclient.impl.execchain.ProtocolExec.execute(ProtocolExec.java:184)
 at org.apache.maven.wagon.providers.http.httpclient.impl.execchain.RetryExec.execute(RetryExec.java:88)
 at org.apache.maven.wagon.providers.http.httpclient.impl.execchain.RedirectExec.execute(RedirectExec.java:110)
 at org.apache.maven.wagon.providers.http.httpclient.impl.client.InternalHttpClient.doExecute(InternalHttpClient.java:184)
 at org.apache.maven.wagon.providers.http.httpclient.impl.client.CloseableHttpClient.execute(CloseableHttpClient.java:82)
 at org.apache.maven.wagon.providers.http.AbstractHttpClientWagon.execute(AbstractHttpClientWagon.java:834)
 at org.apache.maven.wagon.providers.http.AbstractHttpClientWagon.fillInputData(AbstractHttpClientWagon.java:985)
 ... 45 more
Caused by: java.net.ConnectException: Connection timed out: connect
 at java.net.DualStackPlainSocketImpl.connect0(Native Method)
 at java.net.DualStackPlainSocketImpl.socketConnect(DualStackPlainSocketImpl.java:79)
 at java.net.AbstractPlainSocketImpl.doConnect(AbstractPlainSocketImpl.java:350)
 at java.net.AbstractPlainSocketImpl.connectToAddress(AbstractPlainSocketImpl.java:206)
 at java.net.AbstractPlainSocketImpl.connect(AbstractPlainSocketImpl.java:188)
 at java.net.PlainSocketImpl.connect(PlainSocketImpl.java:172)
 at java.net.SocksSocketImpl.connect(SocksSocketImpl.java:392)
 at java.net.Socket.connect(Socket.java:589)
 at org.apache.maven.wagon.providers.http.httpclient.conn.socket.PlainConnectionSocketFactory.connectSocket(PlainConnectionSocketFactory.java:74)
 at org.apache.maven.wagon.providers.http.httpclient.impl.conn.DefaultHttpClientConnectionOperator.connect(DefaultHttpClientConnectionOperator.java:141)
 ... 55 more
[ERROR]   
[ERROR]   The project org.apache.maven.plugin.rresource.it.mrr41:child-2:[unknown-version] (F:\jenkins\jenkins-slave\workspace\rces-plugin_MRRESOURCES-104-LGCBGPPUNLUBE2DYS4XSK7TMPVBNNKKJD5CX73QOJHAO4AO3H5JA\m\target\test-classes\run-only-at-execution-root\child2\pom.xml) has 1 error
[ERROR]     Non-resolvable parent POM for org.apache.maven.plugin.rresource.it.mrr41:parent:[unknown-version]: Failure to transfer org.apache.maven.plugin.rresource.it:it-parent:pom:1.6-SNAPSHOT from http://repository.apache.org/snapshots/ was cached in the local repository, resolution will not be reattempted until the update interval of apache-snapshots has elapsed or updates are forced. Original error: Could not transfer artifact org.apache.maven.plugin.rresource.it:it-parent:pom:1.6-SNAPSHOT from/to apache-snapshots (http://repository.apache.org/snapshots/): Connect to repository.apache.org:80 [repository.apache.org/207.244.88.140] failed: Connection timed out: connect and 'parent.relativePath' points at wrong local POM @ org.apache.maven.plugin.rresource.it.mrr41:parent:[unknown-version], F:\jenkins\jenkins-slave\workspace\rces-plugin_MRRESOURCES-104-LGCBGPPUNLUBE2DYS4XSK7TMPVBNNKKJD5CX73QOJHAO4AO3H5JA\m\target\test-classes\run-only-at-execution-root\pom.xml, line 24, column 11 -> [Help 2]
org.apache.maven.model.resolution.UnresolvableModelException: Failure to transfer org.apache.maven.plugin.rresource.it:it-parent:pom:1.6-SNAPSHOT from http://repository.apache.org/snapshots/ was cached in the local repository, resolution will not be reattempted until the update interval of apache-snapshots has elapsed or updates are forced. Original error: Could not transfer artifact org.apache.maven.plugin.rresource.it:it-parent:pom:1.6-SNAPSHOT from/to apache-snapshots (http://repository.apache.org/snapshots/): Connect to repository.apache.org:80 [repository.apache.org/207.244.88.140] failed: Connection timed out: connect
 at org.apache.maven.project.ProjectModelResolver.resolveModel(ProjectModelResolver.java:197)
 at org.apache.maven.project.ProjectModelResolver.resolveModel(ProjectModelResolver.java:243)
 at org.apache.maven.model.building.DefaultModelBuilder.readParentExternally(DefaultModelBuilder.java:1051)
 at org.apache.maven.model.building.DefaultModelBuilder.readParent(DefaultModelBuilder.java:851)
 at org.apache.maven.model.building.DefaultModelBuilder.build(DefaultModelBuilder.java:331)
 at org.apache.maven.project.DefaultProjectBuilder.build(DefaultProjectBuilder.java:429)
 at org.apache.maven.project.DefaultProjectBuilder.build(DefaultProjectBuilder.java:398)
 at org.apache.maven.project.DefaultProjectBuilder.build(DefaultProjectBuilder.java:515)
 at org.apache.maven.project.DefaultProjectBuilder.build(DefaultProjectBuilder.java:398)
 at org.apache.maven.project.DefaultProjectBuilder.build(DefaultProjectBuilder.java:361)
 at org.apache.maven.graph.DefaultGraphBuilder.collectProjects(DefaultGraphBuilder.java:400)
 at org.apache.maven.graph.DefaultGraphBuilder.getProjectsForMavenReactor(DefaultGraphBuilder.java:391)
 at org.apache.maven.graph.DefaultGraphBuilder.build(DefaultGraphBuilder.java:78)
 at org.apache.maven.DefaultMaven.buildGraph(DefaultMaven.java:511)
 at org.apache.maven.DefaultMaven.doExecute(DefaultMaven.java:221)
 at org.apache.maven.DefaultMaven.doExecute(DefaultMaven.java:194)
 at org.apache.maven.DefaultMaven.execute(DefaultMaven.java:107)
 at org.apache.maven.cli.MavenCli.execute(MavenCli.java:993)
 at org.apache.maven.cli.MavenCli.doMain(MavenCli.java:345)
 at org.apache.maven.cli.MavenCli.main(MavenCli.java:191)
 at sun.reflect.NativeMethodAccessorImpl.invoke0(Native Method)
 at sun.reflect.NativeMethodAccessorImpl.invoke(NativeMethodAccessorImpl.java:62)
 at sun.reflect.DelegatingMethodAccessorImpl.invoke(DelegatingMethodAccessorImpl.java:43)
 at java.lang.reflect.Method.invoke(Method.java:498)
 at org.codehaus.plexus.classworlds.launcher.Launcher.launchEnhanced(Launcher.java:289)
 at org.codehaus.plexus.classworlds.launcher.Launcher.launch(Launcher.java:229)
 at org.codehaus.plexus.classworlds.launcher.Launcher.mainWithExitCode(Launcher.java:415)
 at org.codehaus.plexus.classworlds.launcher.Launcher.main(Launcher.java:356)
Caused by: org.eclipse.aether.resolution.ArtifactResolutionException: Failure to transfer org.apache.maven.plugin.rresource.it:it-parent:pom:1.6-SNAPSHOT from http://repository.apache.org/snapshots/ was cached in the local repository, resolution will not be reattempted until the update interval of apache-snapshots has elapsed or updates are forced. Original error: Could not transfer artifact org.apache.maven.plugin.rresource.it:it-parent:pom:1.6-SNAPSHOT from/to apache-snapshots (http://repository.apache.org/snapshots/): Connect to repository.apache.org:80 [repository.apache.org/207.244.88.140] failed: Connection timed out: connect
 at org.eclipse.aether.internal.impl.DefaultArtifactResolver.resolve(DefaultArtifactResolver.java:453)
 at org.eclipse.aether.internal.impl.DefaultArtifactResolver.resolveArtifacts(DefaultArtifactResolver.java:255)
 at org.eclipse.aether.internal.impl.DefaultArtifactResolver.resolveArtifact(DefaultArtifactResolver.java:232)
 at org.eclipse.aether.internal.impl.DefaultRepositorySystem.resolveArtifact(DefaultRepositorySystem.java:303)
 at org.apache.maven.project.ProjectModelResolver.resolveModel(ProjectModelResolver.java:193)
 ... 27 more
Caused by: org.eclipse.aether.transfer.ArtifactTransferException: Failure to transfer org.apache.maven.plugin.rresource.it:it-parent:pom:1.6-SNAPSHOT from http://repository.apache.org/snapshots/ was cached in the local repository, resolution will not be reattempted until the update interval of apache-snapshots has elapsed or updates are forced. Original error: Could not transfer artifact org.apache.maven.plugin.rresource.it:it-parent:pom:1.6-SNAPSHOT from/to apache-snapshots (http://repository.apache.org/snapshots/): Connect to repository.apache.org:80 [repository.apache.org/207.244.88.140] failed: Connection timed out: connect
 at org.eclipse.aether.internal.impl.DefaultUpdateCheckManager.newException(DefaultUpdateCheckManager.java:247)
 at org.eclipse.aether.internal.impl.DefaultUpdateCheckManager.checkArtifact(DefaultUpdateCheckManager.java:192)
 at org.eclipse.aether.internal.impl.DefaultArtifactResolver.gatherDownloads(DefaultArtifactResolver.java:594)
 at org.eclipse.aether.internal.impl.DefaultArtifactResolver.performDownloads(DefaultArtifactResolver.java:512)
 at org.eclipse.aether.internal.impl.DefaultArtifactResolver.resolve(DefaultArtifactResolver.java:430)
 ... 31 more
[ERROR] 
[ERROR] Re-run Maven using the -X switch to enable full debug logging.
[ERROR] 
[ERROR] For more information about the errors and possible solutions, please read the following articles:
[ERROR] [Help 1] http://cwiki.apache.org/confluence/display/MAVEN/ProjectBuildingException
[ERROR] [Help 2] http://cwiki.apache.org/confluence/display/MAVEN/UnresolvableModelException
Picked up JAVA_TOOL_OPTIONS: -Dmaven.ext.class.path="f:\jenkins\jenkins-slave\workspace\rces-plugin_MRRESOURCES-104-LGCBGPPUNLUBE2DYS4XSK7TMPVBNNKKJD5CX73QOJHAO4AO3H5JA@tmp\withMaven6e368b62\pipeline-maven-spy.jar" -Dorg.jenkinsci.plugins.pipeline.maven.reportsFolder="f:\jenkins\jenkins-slave\workspace\rces-plugin_MRRESOURCES-104-LGCBGPPUNLUBE2DYS4XSK7TMPVBNNKKJD5CX73QOJHAO4AO3H5JA@tmp\withMaven6e368b62" 


Stack Trace:
org.apache.maven.it.VerificationException: 
Exit code was non-zero: 1; command line and log = 
F:\jenkins\tools\maven\apache-maven-3.5.0\bin\mvn -e --batch-mode -Dmaven.repo.local=f:\jenkins\jenkins-slave\workspace\rces-plugin_MRRESOURCES-104-LGCBGPPUNLUBE2DYS4XSK7TMPVBNNKKJD5CX73QOJHAO4AO3H5JA\m\target/it-repo org.apache.maven.plugins:maven-clean-plugin:clean generate-resources
[INFO] [jenkins-event-spy] Jenkins Maven Event Spy is disabled
[INFO] Error stacktraces are turned on.
[INFO] Scanning for projects...
[INFO] Downloading: http://repository.apache.org/snapshots/org/apache/maven/plugin/rresource/it/it-parent/1.6-SNAPSHOT/maven-metadata.xml
[WARNING] Could not transfer metadata org.apache.maven.plugin.rresource.it:it-parent:1.6-SNAPSHOT/maven-metadata.xml from/to apache-snapshots (http://repository.apache.org/snapshots/): Connect to repository.apache.org:80 [repository.apache.org/207.244.88.140] failed: Connection timed out: connect
[INFO] Downloading: http://repository.apache.org/snapshots/org/apache/maven/plugin/rresource/it/it-parent/1.6-SNAPSHOT/it-parent-1.6-SNAPSHOT.pom
[ERROR] [ERROR] Some problems were encountered while processing the POMs:
[FATAL] Non-resolvable parent POM for org.apache.maven.plugin.rresource.it.mrr41:parent:[unknown-version]: Could not transfer artifact org.apache.maven.plugin.rresource.it:it-parent:pom:1.6-SNAPSHOT from/to apache-snapshots (http://repository.apache.org/snapshots/): Connect to repository.apache.org:80 [repository.apache.org/207.244.88.140] failed: Connection timed out: connect and 'parent.relativePath' points at wrong local POM @ org.apache.maven.plugin.rresource.it.mrr41:parent:[unknown-version], F:\jenkins\jenkins-slave\workspace\rces-plugin_MRRESOURCES-104-LGCBGPPUNLUBE2DYS4XSK7TMPVBNNKKJD5CX73QOJHAO4AO3H5JA\m\target\test-classes\run-only-at-execution-root\pom.xml, line 24, column 11
[FATAL] Non-resolvable parent POM for org.apache.maven.plugin.rresource.it.mrr41:parent:[unknown-version]: Failure to transfer org.apache.maven.plugin.rresource.it:it-parent:pom:1.6-SNAPSHOT from http://repository.apache.org/snapshots/ was cached in the local repository, resolution will not be reattempted until the update interval of apache-snapshots has elapsed or updates are forced. Original error: Could not transfer artifact org.apache.maven.plugin.rresource.it:it-parent:pom:1.6-SNAPSHOT from/to apache-snapshots (http://repository.apache.org/snapshots/): Connect to repository.apache.org:80 [repository.apache.org/207.244.88.140] failed: Connection timed out: connect and 'parent.relativePath' points at wrong local POM @ org.apache.maven.plugin.rresource.it.mrr41:parent:[unknown-version], F:\jenkins\jenkins-slave\workspace\rces-plugin_MRRESOURCES-104-LGCBGPPUNLUBE2DYS4XSK7TMPVBNNKKJD5CX73QOJHAO4AO3H5JA\m\target\test-classes\run-only-at-execution-root\pom.xml, line 24, column 11
 @ 
[ERROR] The build could not read 2 projects -> [Help 1]
org.apache.maven.project.ProjectBuildingException: Some problems were encountered while processing the POMs:
[FATAL] Non-resolvable parent POM for org.apache.maven.plugin.rresource.it.mrr41:parent:[unknown-version]: Could not transfer artifact org.apache.maven.plugin.rresource.it:it-parent:pom:1.6-SNAPSHOT from/to apache-snapshots (http://repository.apache.org/snapshots/): Connect to repository.apache.org:80 [repository.apache.org/207.244.88.140] failed: Connection timed out: connect and 'parent.relativePath' points at wrong local POM @ org.apache.maven.plugin.rresource.it.mrr41:parent:[unknown-version], F:\jenkins\jenkins-slave\workspace\rces-plugin_MRRESOURCES-104-LGCBGPPUNLUBE2DYS4XSK7TMPVBNNKKJD5CX73QOJHAO4AO3H5JA\m\target\test-classes\run-only-at-execution-root\pom.xml, line 24, column 11
[FATAL] Non-resolvable parent POM for org.apache.maven.plugin.rresource.it.mrr41:parent:[unknown-version]: Failure to transfer org.apache.maven.plugin.rresource.it:it-parent:pom:1.6-SNAPSHOT from http://repository.apache.org/snapshots/ was cached in the local repository, resolution will not be reattempted until the update interval of apache-snapshots has elapsed or updates are forced. Original error: Could not transfer artifact org.apache.maven.plugin.rresource.it:it-parent:pom:1.6-SNAPSHOT from/to apache-snapshots (http://repository.apache.org/snapshots/): Connect to repository.apache.org:80 [repository.apache.org/207.244.88.140] failed: Connection timed out: connect and 'parent.relativePath' points at wrong local POM @ org.apache.maven.plugin.rresource.it.mrr41:parent:[unknown-version], F:\jenkins\jenkins-slave\workspace\rces-plugin_MRRESOURCES-104-LGCBGPPUNLUBE2DYS4XSK7TMPVBNNKKJD5CX73QOJHAO4AO3H5JA\m\target\test-classes\run-only-at-execution-root\pom.xml, line 24, column 11

	at org.apache.maven.project.DefaultProjectBuilder.build(DefaultProjectBuilder.java:382)
	at org.apache.maven.graph.DefaultGraphBuilder.collectProjects(DefaultGraphBuilder.java:400)
	at org.apache.maven.graph.DefaultGraphBuilder.getProjectsForMavenReactor(DefaultGraphBuilder.java:391)
	at org.apache.maven.graph.DefaultGraphBuilder.build(DefaultGraphBuilder.java:78)
	at org.apache.maven.DefaultMaven.buildGraph(DefaultMaven.java:511)
	at org.apache.maven.DefaultMaven.doExecute(DefaultMaven.java:221)
	at org.apache.maven.DefaultMaven.doExecute(DefaultMaven.java:194)
	at org.apache.maven.DefaultMaven.execute(DefaultMaven.java:107)
	at org.apache.maven.cli.MavenCli.execute(MavenCli.java:993)
	at org.apache.maven.cli.MavenCli.doMain(MavenCli.java:345)
	at org.apache.maven.cli.MavenCli.main(MavenCli.java:191)
	at sun.reflect.NativeMethodAccessorImpl.invoke0(Native Method)
	at sun.reflect.NativeMethodAccessorImpl.invoke(NativeMethodAccessorImpl.java:62)
	at sun.reflect.DelegatingMethodAccessorImpl.invoke(DelegatingMethodAccessorImpl.java:43)
	at java.lang.reflect.Method.invoke(Method.java:498)
	at org.codehaus.plexus.classworlds.launcher.Launcher.launchEnhanced(Launcher.java:289)
	at org.codehaus.plexus.classworlds.launcher.Launcher.launch(Launcher.java:229)
	at org.codehaus.plexus.classworlds.launcher.Launcher.mainWithExitCode(Launcher.java:415)
	at org.codehaus.plexus.classworlds.launcher.Launcher.main(Launcher.java:356)
[ERROR]   
[ERROR]   The project org.apache.maven.plugin.rresource.it.mrr41:child-1:[unknown-version] (F:\jenkins\jenkins-slave\workspace\rces-plugin_MRRESOURCES-104-LGCBGPPUNLUBE2DYS4XSK7TMPVBNNKKJD5CX73QOJHAO4AO3H5JA\m\target\test-classes\run-only-at-execution-root\child1\pom.xml) has 1 error
[ERROR]     Non-resolvable parent POM for org.apache.maven.plugin.rresource.it.mrr41:parent:[unknown-version]: Could not transfer artifact org.apache.maven.plugin.rresource.it:it-parent:pom:1.6-SNAPSHOT from/to apache-snapshots (http://repository.apache.org/snapshots/): Connect to repository.apache.org:80 [repository.apache.org/207.244.88.140] failed: Connection timed out: connect and 'parent.relativePath' points at wrong local POM @ org.apache.maven.plugin.rresource.it.mrr41:parent:[unknown-version], F:\jenkins\jenkins-slave\workspace\rces-plugin_MRRESOURCES-104-LGCBGPPUNLUBE2DYS4XSK7TMPVBNNKKJD5CX73QOJHAO4AO3H5JA\m\target\test-classes\run-only-at-execution-root\pom.xml, line 24, column 11 -> [Help 2]
org.apache.maven.model.resolution.UnresolvableModelException: Could not transfer artifact org.apache.maven.plugin.rresource.it:it-parent:pom:1.6-SNAPSHOT from/to apache-snapshots (http://repository.apache.org/snapshots/): Connect to repository.apache.org:80 [repository.apache.org/207.244.88.140] failed: Connection timed out: connect
	at org.apache.maven.project.ProjectModelResolver.resolveModel(ProjectModelResolver.java:197)
	at org.apache.maven.project.ProjectModelResolver.resolveModel(ProjectModelResolver.java:243)
	at org.apache.maven.model.building.DefaultModelBuilder.readParentExternally(DefaultModelBuilder.java:1051)
	at org.apache.maven.model.building.DefaultModelBuilder.readParent(DefaultModelBuilder.java:851)
	at org.apache.maven.model.building.DefaultModelBuilder.build(DefaultModelBuilder.java:331)
	at org.apache.maven.project.DefaultProjectBuilder.build(DefaultProjectBuilder.java:429)
	at org.apache.maven.project.DefaultProjectBuilder.build(DefaultProjectBuilder.java:398)
	at org.apache.maven.project.DefaultProjectBuilder.build(DefaultProjectBuilder.java:515)
	at org.apache.maven.project.DefaultProjectBuilder.build(DefaultProjectBuilder.java:398)
	at org.apache.maven.project.DefaultProjectBuilder.build(DefaultProjectBuilder.java:361)
	at org.apache.maven.graph.DefaultGraphBuilder.collectProjects(DefaultGraphBuilder.java:400)
	at org.apache.maven.graph.DefaultGraphBuilder.getProjectsForMavenReactor(DefaultGraphBuilder.java:391)
	at org.apache.maven.graph.DefaultGraphBuilder.build(DefaultGraphBuilder.java:78)
	at org.apache.maven.DefaultMaven.buildGraph(DefaultMaven.java:511)
	at org.apache.maven.DefaultMaven.doExecute(DefaultMaven.java:221)
	at org.apache.maven.DefaultMaven.doExecute(DefaultMaven.java:194)
	at org.apache.maven.DefaultMaven.execute(DefaultMaven.java:107)
	at org.apache.maven.cli.MavenCli.execute(MavenCli.java:993)
	at org.apache.maven.cli.MavenCli.doMain(MavenCli.java:345)
	at org.apache.maven.cli.MavenCli.main(MavenCli.java:191)
	at sun.reflect.NativeMethodAccessorImpl.invoke0(Native Method)
	at sun.reflect.NativeMethodAccessorImpl.invoke(NativeMethodAccessorImpl.java:62)
	at sun.reflect.DelegatingMethodAccessorImpl.invoke(DelegatingMethodAccessorImpl.java:43)
	at java.lang.reflect.Method.invoke(Method.java:498)
	at org.codehaus.plexus.classworlds.launcher.Launcher.launchEnhanced(Launcher.java:289)
	at org.codehaus.plexus.classworlds.launcher.Launcher.launch(Launcher.java:229)
	at org.codehaus.plexus.classworlds.launcher.Launcher.mainWithExitCode(Launcher.java:415)
	at org.codehaus.plexus.classworlds.launcher.Launcher.main(Launcher.java:356)
Caused by: org.eclipse.aether.resolution.ArtifactResolutionException: Could not transfer artifact org.apache.maven.plugin.rresource.it:it-parent:pom:1.6-SNAPSHOT from/to apache-snapshots (http://repository.apache.org/snapshots/): Connect to repository.apache.org:80 [repository.apache.org/207.244.88.140] failed: Connection timed out: connect
	at org.eclipse.aether.internal.impl.DefaultArtifactResolver.resolve(DefaultArtifactResolver.java:453)
	at org.eclipse.aether.internal.impl.DefaultArtifactResolver.resolveArtifacts(DefaultArtifactResolver.java:255)
	at org.eclipse.aether.internal.impl.DefaultArtifactResolver.resolveArtifact(DefaultArtifactResolver.java:232)
	at org.eclipse.aether.internal.impl.DefaultRepositorySystem.resolveArtifact(DefaultRepositorySystem.java:303)
	at org.apache.maven.project.ProjectModelResolver.resolveModel(ProjectModelResolver.java:193)
	... 27 more
Caused by: org.eclipse.aether.transfer.ArtifactTransferException: Could not transfer artifact org.apache.maven.plugin.rresource.it:it-parent:pom:1.6-SNAPSHOT from/to apache-snapshots (http://repository.apache.org/snapshots/): Connect to repository.apache.org:80 [repository.apache.org/207.244.88.140] failed: Connection timed out: connect
	at org.eclipse.aether.connector.basic.ArtifactTransportListener.transferFailed(ArtifactTransportListener.java:52)
	at org.eclipse.aether.connector.basic.BasicRepositoryConnector$TaskRunner.run(BasicRepositoryConnector.java:364)
	at org.eclipse.aether.util.concurrency.RunnableErrorForwarder$1.run(RunnableErrorForwarder.java:76)
	at org.eclipse.aether.connector.basic.BasicRepositoryConnector$DirectExecutor.execute(BasicRepositoryConnector.java:590)
	at org.eclipse.aether.connector.basic.BasicRepositoryConnector.get(BasicRepositoryConnector.java:258)
	at org.eclipse.aether.internal.impl.DefaultArtifactResolver.performDownloads(DefaultArtifactResolver.java:529)
	at org.eclipse.aether.internal.impl.DefaultArtifactResolver.resolve(DefaultArtifactResolver.java:430)
	... 31 more
Caused by: org.apache.maven.wagon.TransferFailedException: Connect to repository.apache.org:80 [repository.apache.org/207.244.88.140] failed: Connection timed out: connect
	at org.apache.maven.wagon.providers.http.AbstractHttpClientWagon.fillInputData(AbstractHttpClientWagon.java:1068)
	at org.apache.maven.wagon.providers.http.AbstractHttpClientWagon.fillInputData(AbstractHttpClientWagon.java:962)
	at org.apache.maven.wagon.StreamWagon.getInputStream(StreamWagon.java:126)
	at org.apache.maven.wagon.StreamWagon.getIfNewer(StreamWagon.java:88)
	at org.apache.maven.wagon.StreamWagon.get(StreamWagon.java:61)
	at org.eclipse.aether.transport.wagon.WagonTransporter$GetTaskRunner.run(WagonTransporter.java:569)
	at org.eclipse.aether.transport.wagon.WagonTransporter.execute(WagonTransporter.java:436)
	at org.eclipse.aether.transport.wagon.WagonTransporter.get(WagonTransporter.java:413)
	at org.eclipse.aether.connector.basic.BasicRepositoryConnector$GetTaskRunner.runTask(BasicRepositoryConnector.java:456)
	at org.eclipse.aether.connector.basic.BasicRepositoryConnector$TaskRunner.run(BasicRepositoryConnector.java:359)
	... 36 more
Caused by: org.apache.maven.wagon.providers.http.httpclient.conn.HttpHostConnectException: Connect to repository.apache.org:80 [repository.apache.org/207.244.88.140] failed: Connection timed out: connect
	at org.apache.maven.wagon.providers.http.httpclient.impl.conn.DefaultHttpClientConnectionOperator.connect(DefaultHttpClientConnectionOperator.java:158)
	at org.apache.maven.wagon.providers.http.httpclient.impl.conn.PoolingHttpClientConnectionManager.connect(PoolingHttpClientConnectionManager.java:353)
	at org.apache.maven.wagon.providers.http.httpclient.impl.execchain.MainClientExec.establishRoute(MainClientExec.java:380)
	at org.apache.maven.wagon.providers.http.httpclient.impl.execchain.MainClientExec.execute(MainClientExec.java:236)
	at org.apache.maven.wagon.providers.http.httpclient.impl.execchain.ProtocolExec.execute(ProtocolExec.java:184)
	at org.apache.maven.wagon.providers.http.httpclient.impl.execchain.RetryExec.execute(RetryExec.java:88)
	at org.apache.maven.wagon.providers.http.httpclient.impl.execchain.RedirectExec.execute(RedirectExec.java:110)
	at org.apache.maven.wagon.providers.http.httpclient.impl.client.InternalHttpClient.doExecute(InternalHttpClient.java:184)
	at org.apache.maven.wagon.providers.http.httpclient.impl.client.CloseableHttpClient.execute(CloseableHttpClient.java:82)
	at org.apache.maven.wagon.providers.http.AbstractHttpClientWagon.execute(AbstractHttpClientWagon.java:834)
	at org.apache.maven.wagon.providers.http.AbstractHttpClientWagon.fillInputData(AbstractHttpClientWagon.java:985)
	... 45 more
Caused by: java.net.ConnectException: Connection timed out: connect
	at java.net.DualStackPlainSocketImpl.connect0(Native Method)
	at java.net.DualStackPlainSocketImpl.socketConnect(DualStackPlainSocketImpl.java:79)
	at java.net.AbstractPlainSocketImpl.doConnect(AbstractPlainSocketImpl.java:350)
	at java.net.AbstractPlainSocketImpl.connectToAddress(AbstractPlainSocketImpl.java:206)
	at java.net.AbstractPlainSocketImpl.connect(AbstractPlainSocketImpl.java:188)
	at java.net.PlainSocketImpl.connect(PlainSocketImpl.java:172)
	at java.net.SocksSocketImpl.connect(SocksSocketImpl.java:392)
	at java.net.Socket.connect(Socket.java:589)
	at org.apache.maven.wagon.providers.http.httpclient.conn.socket.PlainConnectionSocketFactory.connectSocket(PlainConnectionSocketFactory.java:74)
	at org.apache.maven.wagon.providers.http.httpclient.impl.conn.DefaultHttpClientConnectionOperator.connect(DefaultHttpClientConnectionOperator.java:141)
	... 55 more
[ERROR]   
[ERROR]   The project org.apache.maven.plugin.rresource.it.mrr41:child-2:[unknown-version] (F:\jenkins\jenkins-slave\workspace\rces-plugin_MRRESOURCES-104-LGCBGPPUNLUBE2DYS4XSK7TMPVBNNKKJD5CX73QOJHAO4AO3H5JA\m\target\test-classes\run-only-at-execution-root\child2\pom.xml) has 1 error
[ERROR]     Non-resolvable parent POM for org.apache.maven.plugin.rresource.it.mrr41:parent:[unknown-version]: Failure to transfer org.apache.maven.plugin.rresource.it:it-parent:pom:1.6-SNAPSHOT from http://repository.apache.org/snapshots/ was cached in the local repository, resolution will not be reattempted until the update interval of apache-snapshots has elapsed or updates are forced. Original error: Could not transfer artifact org.apache.maven.plugin.rresource.it:it-parent:pom:1.6-SNAPSHOT from/to apache-snapshots (http://repository.apache.org/snapshots/): Connect to repository.apache.org:80 [repository.apache.org/207.244.88.140] failed: Connection timed out: connect and 'parent.relativePath' points at wrong local POM @ org.apache.maven.plugin.rresource.it.mrr41:parent:[unknown-version], F:\jenkins\jenkins-slave\workspace\rces-plugin_MRRESOURCES-104-LGCBGPPUNLUBE2DYS4XSK7TMPVBNNKKJD5CX73QOJHAO4AO3H5JA\m\target\test-classes\run-only-at-execution-root\pom.xml, line 24, column 11 -> [Help 2]
org.apache.maven.model.resolution.UnresolvableModelException: Failure to transfer org.apache.maven.plugin.rresource.it:it-parent:pom:1.6-SNAPSHOT from http://repository.apache.org/snapshots/ was cached in the local repository, resolution will not be reattempted until the update interval of apache-snapshots has elapsed or updates are forced. Original error: Could not transfer artifact org.apache.maven.plugin.rresource.it:it-parent:pom:1.6-SNAPSHOT from/to apache-snapshots (http://repository.apache.org/snapshots/): Connect to repository.apache.org:80 [repository.apache.org/207.244.88.140] failed: Connection timed out: connect
	at org.apache.maven.project.ProjectModelResolver.resolveModel(ProjectModelResolver.java:197)
	at org.apache.maven.project.ProjectModelResolver.resolveModel(ProjectModelResolver.java:243)
	at org.apache.maven.model.building.DefaultModelBuilder.readParentExternally(DefaultModelBuilder.java:1051)
	at org.apache.maven.model.building.DefaultModelBuilder.readParent(DefaultModelBuilder.java:851)
	at org.apache.maven.model.building.DefaultModelBuilder.build(DefaultModelBuilder.java:331)
	at org.apache.maven.project.DefaultProjectBuilder.build(DefaultProjectBuilder.java:429)
	at org.apache.maven.project.DefaultProjectBuilder.build(DefaultProjectBuilder.java:398)
	at org.apache.maven.project.DefaultProjectBuilder.build(DefaultProjectBuilder.java:515)
	at org.apache.maven.project.DefaultProjectBuilder.build(DefaultProjectBuilder.java:398)
	at org.apache.maven.project.DefaultProjectBuilder.build(DefaultProjectBuilder.java:361)
	at org.apache.maven.graph.DefaultGraphBuilder.collectProjects(DefaultGraphBuilder.java:400)
	at org.apache.maven.graph.DefaultGraphBuilder.getProjectsForMavenReactor(DefaultGraphBuilder.java:391)
	at org.apache.maven.graph.DefaultGraphBuilder.build(DefaultGraphBuilder.java:78)
	at org.apache.maven.DefaultMaven.buildGraph(DefaultMaven.java:511)
	at org.apache.maven.DefaultMaven.doExecute(DefaultMaven.java:221)
	at org.apache.maven.DefaultMaven.doExecute(DefaultMaven.java:194)
	at org.apache.maven.DefaultMaven.execute(DefaultMaven.java:107)
	at org.apache.maven.cli.MavenCli.execute(MavenCli.java:993)
	at org.apache.maven.cli.MavenCli.doMain(MavenCli.java:345)
	at org.apache.maven.cli.MavenCli.main(MavenCli.java:191)
	at sun.reflect.NativeMethodAccessorImpl.invoke0(Native Method)
	at sun.reflect.NativeMethodAccessorImpl.invoke(NativeMethodAccessorImpl.java:62)
	at sun.reflect.DelegatingMethodAccessorImpl.invoke(DelegatingMethodAccessorImpl.java:43)
	at java.lang.reflect.Method.invoke(Method.java:498)
	at org.codehaus.plexus.classworlds.launcher.Launcher.launchEnhanced(Launcher.java:289)
	at org.codehaus.plexus.classworlds.launcher.Launcher.launch(Launcher.java:229)
	at org.codehaus.plexus.classworlds.launcher.Launcher.mainWithExitCode(Launcher.java:415)
	at org.codehaus.plexus.classworlds.launcher.Launcher.main(Launcher.java:356)
Caused by: org.eclipse.aether.resolution.ArtifactResolutionException: Failure to transfer org.apache.maven.plugin.rresource.it:it-parent:pom:1.6-SNAPSHOT from http://repository.apache.org/snapshots/ was cached in the local repository, resolution will not be reattempted until the update interval of apache-snapshots has elapsed or updates are forced. Original error: Could not transfer artifact org.apache.maven.plugin.rresource.it:it-parent:pom:1.6-SNAPSHOT from/to apache-snapshots (http://repository.apache.org/snapshots/): Connect to repository.apache.org:80 [repository.apache.org/207.244.88.140] failed: Connection timed out: connect
	at org.eclipse.aether.internal.impl.DefaultArtifactResolver.resolve(DefaultArtifactResolver.java:453)
	at org.eclipse.aether.internal.impl.DefaultArtifactResolver.resolveArtifacts(DefaultArtifactResolver.java:255)
	at org.eclipse.aether.internal.impl.DefaultArtifactResolver.resolveArtifact(DefaultArtifactResolver.java:232)
	at org.eclipse.aether.internal.impl.DefaultRepositorySystem.resolveArtifact(DefaultRepositorySystem.java:303)
	at org.apache.maven.project.ProjectModelResolver.resolveModel(ProjectModelResolver.java:193)
	... 27 more
Caused by: org.eclipse.aether.transfer.ArtifactTransferException: Failure to transfer org.apache.maven.plugin.rresource.it:it-parent:pom:1.6-SNAPSHOT from http://repository.apache.org/snapshots/ was cached in the local repository, resolution will not be reattempted until the update interval of apache-snapshots has elapsed or updates are forced. Original error: Could not transfer artifact org.apache.maven.plugin.rresource.it:it-parent:pom:1.6-SNAPSHOT from/to apache-snapshots (http://repository.apache.org/snapshots/): Connect to repository.apache.org:80 [repository.apache.org/207.244.88.140] failed: Connection timed out: connect
	at org.eclipse.aether.internal.impl.DefaultUpdateCheckManager.newException(DefaultUpdateCheckManager.java:247)
	at org.eclipse.aether.internal.impl.DefaultUpdateCheckManager.checkArtifact(DefaultUpdateCheckManager.java:192)
	at org.eclipse.aether.internal.impl.DefaultArtifactResolver.gatherDownloads(DefaultArtifactResolver.java:594)
	at org.eclipse.aether.internal.impl.DefaultArtifactResolver.performDownloads(DefaultArtifactResolver.java:512)
	at org.eclipse.aether.internal.impl.DefaultArtifactResolver.resolve(DefaultArtifactResolver.java:430)
	... 31 more
[ERROR] 
[ERROR] Re-run Maven using the -X switch to enable full debug logging.
[ERROR] 
[ERROR] For more information about the errors and possible solutions, please read the following articles:
[ERROR] [Help 1] http://cwiki.apache.org/confluence/display/MAVEN/ProjectBuildingException
[ERROR] [Help 2] http://cwiki.apache.org/confluence/display/MAVEN/UnresolvableModelException
Picked up JAVA_TOOL_OPTIONS: -Dmaven.ext.class.path="f:\jenkins\jenkins-slave\workspace\rces-plugin_MRRESOURCES-104-LGCBGPPUNLUBE2DYS4XSK7TMPVBNNKKJD5CX73QOJHAO4AO3H5JA@tmp\withMaven6e368b62\pipeline-maven-spy.jar" -Dorg.jenkinsci.plugins.pipeline.maven.reportsFolder="f:\jenkins\jenkins-slave\workspace\rces-plugin_MRRESOURCES-104-LGCBGPPUNLUBE2DYS4XSK7TMPVBNNKKJD5CX73QOJHAO4AO3H5JA@tmp\withMaven6e368b62" 

	at org.apache.maven.plugin.resources.remote.it.IT_RunOnlyAtExecutionRoot.test(IT_RunOnlyAtExecutionRoot.java:60)


FAILED:  org.apache.maven.plugin.resources.remote.it.IT_RunOnlyAtExecutionRoot.test

Error Message:
Exit code was non-zero: 1; command line and log = 
F:\jenkins\tools\maven\apache-maven-3.5.0\bin\mvn -e --batch-mode -Dmaven.repo.local=f:\jenkins\jenkins-slave\workspace\rces-plugin_MRRESOURCES-104-LGCBGPPUNLUBE2DYS4XSK7TMPVBNNKKJD5CX73QOJHAO4AO3H5JA\m\target/it-repo org.apache.maven.plugins:maven-clean-plugin:clean generate-resources
Picked up JAVA_TOOL_OPTIONS: -Dmaven.ext.class.path="f:\jenkins\jenkins-slave\workspace\rces-plugin_MRRESOURCES-104-LGCBGPPUNLUBE2DYS4XSK7TMPVBNNKKJD5CX73QOJHAO4AO3H5JA@tmp\withMaven60baf391\pipeline-maven-spy.jar" -Dorg.jenkinsci.plugins.pipeline.maven.reportsFolder="f:\jenkins\jenkins-slave\workspace\rces-plugin_MRRESOURCES-104-LGCBGPPUNLUBE2DYS4XSK7TMPVBNNKKJD5CX73QOJHAO4AO3H5JA@tmp\withMaven60baf391" 
[INFO] [jenkins-event-spy] Jenkins Maven Event Spy is disabled
[INFO] Error stacktraces are turned on.
[INFO] Scanning for projects...
[INFO] Downloading: http://repository.apache.org/snapshots/org/apache/maven/plugin/rresource/it/it-parent/1.6-SNAPSHOT/maven-metadata.xml
[WARNING] Could not transfer metadata org.apache.maven.plugin.rresource.it:it-parent:1.6-SNAPSHOT/maven-metadata.xml from/to apache-snapshots (http://repository.apache.org/snapshots/): Connect to repository.apache.org:80 [repository.apache.org/207.244.88.140] failed: Connection timed out: connect
[INFO] Downloading: http://repository.apache.org/snapshots/org/apache/maven/plugin/rresource/it/it-parent/1.6-SNAPSHOT/it-parent-1.6-SNAPSHOT.pom
[ERROR] [ERROR] Some problems were encountered while processing the POMs:
[FATAL] Non-resolvable parent POM for org.apache.maven.plugin.rresource.it.mrr41:parent:[unknown-version]: Could not transfer artifact org.apache.maven.plugin.rresource.it:it-parent:pom:1.6-SNAPSHOT from/to apache-snapshots (http://repository.apache.org/snapshots/): Connect to repository.apache.org:80 [repository.apache.org/207.244.88.140] failed: Connection timed out: connect and 'parent.relativePath' points at wrong local POM @ org.apache.maven.plugin.rresource.it.mrr41:parent:[unknown-version], F:\jenkins\jenkins-slave\workspace\rces-plugin_MRRESOURCES-104-LGCBGPPUNLUBE2DYS4XSK7TMPVBNNKKJD5CX73QOJHAO4AO3H5JA\m\target\test-classes\run-only-at-execution-root\pom.xml, line 24, column 11
[FATAL] Non-resolvable parent POM for org.apache.maven.plugin.rresource.it.mrr41:parent:[unknown-version]: Failure to transfer org.apache.maven.plugin.rresource.it:it-parent:pom:1.6-SNAPSHOT from http://repository.apache.org/snapshots/ was cached in the local repository, resolution will not be reattempted until the update interval of apache-snapshots has elapsed or updates are forced. Original error: Could not transfer artifact org.apache.maven.plugin.rresource.it:it-parent:pom:1.6-SNAPSHOT from/to apache-snapshots (http://repository.apache.org/snapshots/): Connect to repository.apache.org:80 [repository.apache.org/207.244.88.140] failed: Connection timed out: connect and 'parent.relativePath' points at wrong local POM @ org.apache.maven.plugin.rresource.it.mrr41:parent:[unknown-version], F:\jenkins\jenkins-slave\workspace\rces-plugin_MRRESOURCES-104-LGCBGPPUNLUBE2DYS4XSK7TMPVBNNKKJD5CX73QOJHAO4AO3H5JA\m\target\test-classes\run-only-at-execution-root\pom.xml, line 24, column 11
 @ 
[ERROR] The build could not read 2 projects -> [Help 1]
org.apache.maven.project.ProjectBuildingException: Some problems were encountered while processing the POMs:
[FATAL] Non-resolvable parent POM for org.apache.maven.plugin.rresource.it.mrr41:parent:[unknown-version]: Could not transfer artifact org.apache.maven.plugin.rresource.it:it-parent:pom:1.6-SNAPSHOT from/to apache-snapshots (http://repository.apache.org/snapshots/): Connect to repository.apache.org:80 [repository.apache.org/207.244.88.140] failed: Connection timed out: connect and 'parent.relativePath' points at wrong local POM @ org.apache.maven.plugin.rresource.it.mrr41:parent:[unknown-version], F:\jenkins\jenkins-slave\workspace\rces-plugin_MRRESOURCES-104-LGCBGPPUNLUBE2DYS4XSK7TMPVBNNKKJD5CX73QOJHAO4AO3H5JA\m\target\test-classes\run-only-at-execution-root\pom.xml, line 24, column 11
[FATAL] Non-resolvable parent POM for org.apache.maven.plugin.rresource.it.mrr41:parent:[unknown-version]: Failure to transfer org.apache.maven.plugin.rresource.it:it-parent:pom:1.6-SNAPSHOT from http://repository.apache.org/snapshots/ was cached in the local repository, resolution will not be reattempted until the update interval of apache-snapshots has elapsed or updates are forced. Original error: Could not transfer artifact org.apache.maven.plugin.rresource.it:it-parent:pom:1.6-SNAPSHOT from/to apache-snapshots (http://repository.apache.org/snapshots/): Connect to repository.apache.org:80 [repository.apache.org/207.244.88.140] failed: Connection timed out: connect and 'parent.relativePath' points at wrong local POM @ org.apache.maven.plugin.rresource.it.mrr41:parent:[unknown-version], F:\jenkins\jenkins-slave\workspace\rces-plugin_MRRESOURCES-104-LGCBGPPUNLUBE2DYS4XSK7TMPVBNNKKJD5CX73QOJHAO4AO3H5JA\m\target\test-classes\run-only-at-execution-root\pom.xml, line 24, column 11

 at org.apache.maven.project.DefaultProjectBuilder.build(DefaultProjectBuilder.java:382)
 at org.apache.maven.graph.DefaultGraphBuilder.collectProjects(DefaultGraphBuilder.java:400)
 at org.apache.maven.graph.DefaultGraphBuilder.getProjectsForMavenReactor(DefaultGraphBuilder.java:391)
 at org.apache.maven.graph.DefaultGraphBuilder.build(DefaultGraphBuilder.java:78)
 at org.apache.maven.DefaultMaven.buildGraph(DefaultMaven.java:511)
 at org.apache.maven.DefaultMaven.doExecute(DefaultMaven.java:221)
 at org.apache.maven.DefaultMaven.doExecute(DefaultMaven.java:194)
 at org.apache.maven.DefaultMaven.execute(DefaultMaven.java:107)
 at org.apache.maven.cli.MavenCli.execute(MavenCli.java:993)
 at org.apache.maven.cli.MavenCli.doMain(MavenCli.java:345)
 at org.apache.maven.cli.MavenCli.main(MavenCli.java:191)
 at java.base/jdk.internal.reflect.NativeMethodAccessorImpl.invoke0(Native Method)
 at java.base/jdk.internal.reflect.NativeMethodAccessorImpl.invoke(NativeMethodAccessorImpl.java:62)
 at java.base/jdk.internal.reflect.DelegatingMethodAccessorImpl.invoke(DelegatingMethodAccessorImpl.java:43)
 at java.base/java.lang.reflect.Method.invoke(Method.java:564)
 at org.codehaus.plexus.classworlds.launcher.Launcher.launchEnhanced(Launcher.java:289)
 at org.codehaus.plexus.classworlds.launcher.Launcher.launch(Launcher.java:229)
 at org.codehaus.plexus.classworlds.launcher.Launcher.mainWithExitCode(Launcher.java:415)
 at org.codehaus.plexus.classworlds.launcher.Launcher.main(Launcher.java:356)
[ERROR]   
[ERROR]   The project org.apache.maven.plugin.rresource.it.mrr41:child-1:[unknown-version] (F:\jenkins\jenkins-slave\workspace\rces-plugin_MRRESOURCES-104-LGCBGPPUNLUBE2DYS4XSK7TMPVBNNKKJD5CX73QOJHAO4AO3H5JA\m\target\test-classes\run-only-at-execution-root\child1\pom.xml) has 1 error
[ERROR]     Non-resolvable parent POM for org.apache.maven.plugin.rresource.it.mrr41:parent:[unknown-version]: Could not transfer artifact org.apache.maven.plugin.rresource.it:it-parent:pom:1.6-SNAPSHOT from/to apache-snapshots (http://repository.apache.org/snapshots/): Connect to repository.apache.org:80 [repository.apache.org/207.244.88.140] failed: Connection timed out: connect and 'parent.relativePath' points at wrong local POM @ org.apache.maven.plugin.rresource.it.mrr41:parent:[unknown-version], F:\jenkins\jenkins-slave\workspace\rces-plugin_MRRESOURCES-104-LGCBGPPUNLUBE2DYS4XSK7TMPVBNNKKJD5CX73QOJHAO4AO3H5JA\m\target\test-classes\run-only-at-execution-root\pom.xml, line 24, column 11 -> [Help 2]
org.apache.maven.model.resolution.UnresolvableModelException: Could not transfer artifact org.apache.maven.plugin.rresource.it:it-parent:pom:1.6-SNAPSHOT from/to apache-snapshots (http://repository.apache.org/snapshots/): Connect to repository.apache.org:80 [repository.apache.org/207.244.88.140] failed: Connection timed out: connect
 at org.apache.maven.project.ProjectModelResolver.resolveModel(ProjectModelResolver.java:197)
 at org.apache.maven.project.ProjectModelResolver.resolveModel(ProjectModelResolver.java:243)
 at org.apache.maven.model.building.DefaultModelBuilder.readParentExternally(DefaultModelBuilder.java:1051)
 at org.apache.maven.model.building.DefaultModelBuilder.readParent(DefaultModelBuilder.java:851)
 at org.apache.maven.model.building.DefaultModelBuilder.build(DefaultModelBuilder.java:331)
 at org.apache.maven.project.DefaultProjectBuilder.build(DefaultProjectBuilder.java:429)
 at org.apache.maven.project.DefaultProjectBuilder.build(DefaultProjectBuilder.java:398)
 at org.apache.maven.project.DefaultProjectBuilder.build(DefaultProjectBuilder.java:515)
 at org.apache.maven.project.DefaultProjectBuilder.build(DefaultProjectBuilder.java:398)
 at org.apache.maven.project.DefaultProjectBuilder.build(DefaultProjectBuilder.java:361)
 at org.apache.maven.graph.DefaultGraphBuilder.collectProjects(DefaultGraphBuilder.java:400)
 at org.apache.maven.graph.DefaultGraphBuilder.getProjectsForMavenReactor(DefaultGraphBuilder.java:391)
 at org.apache.maven.graph.DefaultGraphBuilder.build(DefaultGraphBuilder.java:78)
 at org.apache.maven.DefaultMaven.buildGraph(DefaultMaven.java:511)
 at org.apache.maven.DefaultMaven.doExecute(DefaultMaven.java:221)
 at org.apache.maven.DefaultMaven.doExecute(DefaultMaven.java:194)
 at org.apache.maven.DefaultMaven.execute(DefaultMaven.java:107)
 at org.apache.maven.cli.MavenCli.execute(MavenCli.java:993)
 at org.apache.maven.cli.MavenCli.doMain(MavenCli.java:345)
 at org.apache.maven.cli.MavenCli.main(MavenCli.java:191)
 at java.base/jdk.internal.reflect.NativeMethodAccessorImpl.invoke0(Native Method)
 at java.base/jdk.internal.reflect.NativeMethodAccessorImpl.invoke(NativeMethodAccessorImpl.java:62)
 at java.base/jdk.internal.reflect.DelegatingMethodAccessorImpl.invoke(DelegatingMethodAccessorImpl.java:43)
 at java.base/java.lang.reflect.Method.invoke(Method.java:564)
 at org.codehaus.plexus.classworlds.launcher.Launcher.launchEnhanced(Launcher.java:289)
 at org.codehaus.plexus.classworlds.launcher.Launcher.launch(Launcher.java:229)
 at org.codehaus.plexus.classworlds.launcher.Launcher.mainWithExitCode(Launcher.java:415)
 at org.codehaus.plexus.classworlds.launcher.Launcher.main(Launcher.java:356)
Caused by: org.eclipse.aether.resolution.ArtifactResolutionException: Could not transfer artifact org.apache.maven.plugin.rresource.it:it-parent:pom:1.6-SNAPSHOT from/to apache-snapshots (http://repository.apache.org/snapshots/): Connect to repository.apache.org:80 [repository.apache.org/207.244.88.140] failed: Connection timed out: connect
 at org.eclipse.aether.internal.impl.DefaultArtifactResolver.resolve(DefaultArtifactResolver.java:453)
 at org.eclipse.aether.internal.impl.DefaultArtifactResolver.resolveArtifacts(DefaultArtifactResolver.java:255)
 at org.eclipse.aether.internal.impl.DefaultArtifactResolver.resolveArtifact(DefaultArtifactResolver.java:232)
 at org.eclipse.aether.internal.impl.DefaultRepositorySystem.resolveArtifact(DefaultRepositorySystem.java:303)
 at org.apache.maven.project.ProjectModelResolver.resolveModel(ProjectModelResolver.java:193)
 ... 27 more
Caused by: org.eclipse.aether.transfer.ArtifactTransferException: Could not transfer artifact org.apache.maven.plugin.rresource.it:it-parent:pom:1.6-SNAPSHOT from/to apache-snapshots (http://repository.apache.org/snapshots/): Connect to repository.apache.org:80 [repository.apache.org/207.244.88.140] failed: Connection timed out: connect
 at org.eclipse.aether.connector.basic.ArtifactTransportListener.transferFailed(ArtifactTransportListener.java:52)
 at org.eclipse.aether.connector.basic.BasicRepositoryConnector$TaskRunner.run(BasicRepositoryConnector.java:364)
 at org.eclipse.aether.util.concurrency.RunnableErrorForwarder$1.run(RunnableErrorForwarder.java:76)
 at org.eclipse.aether.connector.basic.BasicRepositoryConnector$DirectExecutor.execute(BasicRepositoryConnector.java:590)
 at org.eclipse.aether.connector.basic.BasicRepositoryConnector.get(BasicRepositoryConnector.java:258)
 at org.eclipse.aether.internal.impl.DefaultArtifactResolver.performDownloads(DefaultArtifactResolver.java:529)
 at org.eclipse.aether.internal.impl.DefaultArtifactResolver.resolve(DefaultArtifactResolver.java:430)
 ... 31 more
Caused by: org.apache.maven.wagon.TransferFailedException: Connect to repository.apache.org:80 [repository.apache.org/207.244.88.140] failed: Connection timed out: connect
 at org.apache.maven.wagon.providers.http.AbstractHttpClientWagon.fillInputData(AbstractHttpClientWagon.java:1068)
 at org.apache.maven.wagon.providers.http.AbstractHttpClientWagon.fillInputData(AbstractHttpClientWagon.java:962)
 at org.apache.maven.wagon.StreamWagon.getInputStream(StreamWagon.java:126)
 at org.apache.maven.wagon.StreamWagon.getIfNewer(StreamWagon.java:88)
 at org.apache.maven.wagon.StreamWagon.get(StreamWagon.java:61)
 at org.eclipse.aether.transport.wagon.WagonTransporter$GetTaskRunner.run(WagonTransporter.java:569)
 at org.eclipse.aether.transport.wagon.WagonTransporter.execute(WagonTransporter.java:436)
 at org.eclipse.aether.transport.wagon.WagonTransporter.get(WagonTransporter.java:413)
 at org.eclipse.aether.connector.basic.BasicRepositoryConnector$GetTaskRunner.runTask(BasicRepositoryConnector.java:456)
 at org.eclipse.aether.connector.basic.BasicRepositoryConnector$TaskRunner.run(BasicRepositoryConnector.java:359)
 ... 36 more
Caused by: org.apache.maven.wagon.providers.http.httpclient.conn.HttpHostConnectException: Connect to repository.apache.org:80 [repository.apache.org/207.244.88.140] failed: Connection timed out: connect
 at org.apache.maven.wagon.providers.http.httpclient.impl.conn.DefaultHttpClientConnectionOperator.connect(DefaultHttpClientConnectionOperator.java:158)
 at org.apache.maven.wagon.providers.http.httpclient.impl.conn.PoolingHttpClientConnectionManager.connect(PoolingHttpClientConnectionManager.java:353)
 at org.apache.maven.wagon.providers.http.httpclient.impl.execchain.MainClientExec.establishRoute(MainClientExec.java:380)
 at org.apache.maven.wagon.providers.http.httpclient.impl.execchain.MainClientExec.execute(MainClientExec.java:236)
 at org.apache.maven.wagon.providers.http.httpclient.impl.execchain.ProtocolExec.execute(ProtocolExec.java:184)
 at org.apache.maven.wagon.providers.http.httpclient.impl.execchain.RetryExec.execute(RetryExec.java:88)
 at org.apache.maven.wagon.providers.http.httpclient.impl.execchain.RedirectExec.execute(RedirectExec.java:110)
 at org.apache.maven.wagon.providers.http.httpclient.impl.client.InternalHttpClient.doExecute(InternalHttpClient.java:184)
 at org.apache.maven.wagon.providers.http.httpclient.impl.client.CloseableHttpClient.execute(CloseableHttpClient.java:82)
 at org.apache.maven.wagon.providers.http.AbstractHttpClientWagon.execute(AbstractHttpClientWagon.java:834)
 at org.apache.maven.wagon.providers.http.AbstractHttpClientWagon.fillInputData(AbstractHttpClientWagon.java:985)
 ... 45 more
Caused by: java.net.ConnectException: Connection timed out: connect
 at java.base/java.net.DualStackPlainSocketImpl.connect0(Native Method)
 at java.base/java.net.DualStackPlainSocketImpl.socketConnect(DualStackPlainSocketImpl.java:79)
 at java.base/java.net.AbstractPlainSocketImpl.doConnect(AbstractPlainSocketImpl.java:400)
 at java.base/java.net.AbstractPlainSocketImpl.connectToAddress(AbstractPlainSocketImpl.java:243)
 at java.base/java.net.AbstractPlainSocketImpl.connect(AbstractPlainSocketImpl.java:225)
 at java.base/java.net.PlainSocketImpl.connect(PlainSocketImpl.java:148)
 at java.base/java.net.SocksSocketImpl.connect(SocksSocketImpl.java:402)
 at java.base/java.net.Socket.connect(Socket.java:591)
 at org.apache.maven.wagon.providers.http.httpclient.conn.socket.PlainConnectionSocketFactory.connectSocket(PlainConnectionSocketFactory.java:74)
 at org.apache.maven.wagon.providers.http.httpclient.impl.conn.DefaultHttpClientConnectionOperator.connect(DefaultHttpClientConnectionOperator.java:141)
 ... 55 more
[ERROR]   
[ERROR]   The project org.apache.maven.plugin.rresource.it.mrr41:child-2:[unknown-version] (F:\jenkins\jenkins-slave\workspace\rces-plugin_MRRESOURCES-104-LGCBGPPUNLUBE2DYS4XSK7TMPVBNNKKJD5CX73QOJHAO4AO3H5JA\m\target\test-classes\run-only-at-execution-root\child2\pom.xml) has 1 error
[ERROR]     Non-resolvable parent POM for org.apache.maven.plugin.rresource.it.mrr41:parent:[unknown-version]: Failure to transfer org.apache.maven.plugin.rresource.it:it-parent:pom:1.6-SNAPSHOT from http://repository.apache.org/snapshots/ was cached in the local repository, resolution will not be reattempted until the update interval of apache-snapshots has elapsed or updates are forced. Original error: Could not transfer artifact org.apache.maven.plugin.rresource.it:it-parent:pom:1.6-SNAPSHOT from/to apache-snapshots (http://repository.apache.org/snapshots/): Connect to repository.apache.org:80 [repository.apache.org/207.244.88.140] failed: Connection timed out: connect and 'parent.relativePath' points at wrong local POM @ org.apache.maven.plugin.rresource.it.mrr41:parent:[unknown-version], F:\jenkins\jenkins-slave\workspace\rces-plugin_MRRESOURCES-104-LGCBGPPUNLUBE2DYS4XSK7TMPVBNNKKJD5CX73QOJHAO4AO3H5JA\m\target\test-classes\run-only-at-execution-root\pom.xml, line 24, column 11 -> [Help 2]
org.apache.maven.model.resolution.UnresolvableModelException: Failure to transfer org.apache.maven.plugin.rresource.it:it-parent:pom:1.6-SNAPSHOT from http://repository.apache.org/snapshots/ was cached in the local repository, resolution will not be reattempted until the update interval of apache-snapshots has elapsed or updates are forced. Original error: Could not transfer artifact org.apache.maven.plugin.rresource.it:it-parent:pom:1.6-SNAPSHOT from/to apache-snapshots (http://repository.apache.org/snapshots/): Connect to repository.apache.org:80 [repository.apache.org/207.244.88.140] failed: Connection timed out: connect
 at org.apache.maven.project.ProjectModelResolver.resolveModel(ProjectModelResolver.java:197)
 at org.apache.maven.project.ProjectModelResolver.resolveModel(ProjectModelResolver.java:243)
 at org.apache.maven.model.building.DefaultModelBuilder.readParentExternally(DefaultModelBuilder.java:1051)
 at org.apache.maven.model.building.DefaultModelBuilder.readParent(DefaultModelBuilder.java:851)
 at org.apache.maven.model.building.DefaultModelBuilder.build(DefaultModelBuilder.java:331)
 at org.apache.maven.project.DefaultProjectBuilder.build(DefaultProjectBuilder.java:429)
 at org.apache.maven.project.DefaultProjectBuilder.build(DefaultProjectBuilder.java:398)
 at org.apache.maven.project.DefaultProjectBuilder.build(DefaultProjectBuilder.java:515)
 at org.apache.maven.project.DefaultProjectBuilder.build(DefaultProjectBuilder.java:398)
 at org.apache.maven.project.DefaultProjectBuilder.build(DefaultProjectBuilder.java:361)
 at org.apache.maven.graph.DefaultGraphBuilder.collectProjects(DefaultGraphBuilder.java:400)
 at org.apache.maven.graph.DefaultGraphBuilder.getProjectsForMavenReactor(DefaultGraphBuilder.java:391)
 at org.apache.maven.graph.DefaultGraphBuilder.build(DefaultGraphBuilder.java:78)
 at org.apache.maven.DefaultMaven.buildGraph(DefaultMaven.java:511)
 at org.apache.maven.DefaultMaven.doExecute(DefaultMaven.java:221)
 at org.apache.maven.DefaultMaven.doExecute(DefaultMaven.java:194)
 at org.apache.maven.DefaultMaven.execute(DefaultMaven.java:107)
 at org.apache.maven.cli.MavenCli.execute(MavenCli.java:993)
 at org.apache.maven.cli.MavenCli.doMain(MavenCli.java:345)
 at org.apache.maven.cli.MavenCli.main(MavenCli.java:191)
 at java.base/jdk.internal.reflect.NativeMethodAccessorImpl.invoke0(Native Method)
 at java.base/jdk.internal.reflect.NativeMethodAccessorImpl.invoke(NativeMethodAccessorImpl.java:62)
 at java.base/jdk.internal.reflect.DelegatingMethodAccessorImpl.invoke(DelegatingMethodAccessorImpl.java:43)
 at java.base/java.lang.reflect.Method.invoke(Method.java:564)
 at org.codehaus.plexus.classworlds.launcher.Launcher.launchEnhanced(Launcher.java:289)
 at org.codehaus.plexus.classworlds.launcher.Launcher.launch(Launcher.java:229)
 at org.codehaus.plexus.classworlds.launcher.Launcher.mainWithExitCode(Launcher.java:415)
 at org.codehaus.plexus.classworlds.launcher.Launcher.main(Launcher.java:356)
Caused by: org.eclipse.aether.resolution.ArtifactResolutionException: Failure to transfer org.apache.maven.plugin.rresource.it:it-parent:pom:1.6-SNAPSHOT from http://repository.apache.org/snapshots/ was cached in the local repository, resolution will not be reattempted until the update interval of apache-snapshots has elapsed or updates are forced. Original error: Could not transfer artifact org.apache.maven.plugin.rresource.it:it-parent:pom:1.6-SNAPSHOT from/to apache-snapshots (http://repository.apache.org/snapshots/): Connect to repository.apache.org:80 [repository.apache.org/207.244.88.140] failed: Connection timed out: connect
 at org.eclipse.aether.internal.impl.DefaultArtifactResolver.resolve(DefaultArtifactResolver.java:453)
 at org.eclipse.aether.internal.impl.DefaultArtifactResolver.resolveArtifacts(DefaultArtifactResolver.java:255)
 at org.eclipse.aether.internal.impl.DefaultArtifactResolver.resolveArtifact(DefaultArtifactResolver.java:232)
 at org.eclipse.aether.internal.impl.DefaultRepositorySystem.resolveArtifact(DefaultRepositorySystem.java:303)
 at org.apache.maven.project.ProjectModelResolver.resolveModel(ProjectModelResolver.java:193)
 ... 27 more
Caused by: org.eclipse.aether.transfer.ArtifactTransferException: Failure to transfer org.apache.maven.plugin.rresource.it:it-parent:pom:1.6-SNAPSHOT from http://repository.apache.org/snapshots/ was cached in the local repository, resolution will not be reattempted until the update interval of apache-snapshots has elapsed or updates are forced. Original error: Could not transfer artifact org.apache.maven.plugin.rresource.it:it-parent:pom:1.6-SNAPSHOT from/to apache-snapshots (http://repository.apache.org/snapshots/): Connect to repository.apache.org:80 [repository.apache.org/207.244.88.140] failed: Connection timed out: connect
 at org.eclipse.aether.internal.impl.DefaultUpdateCheckManager.newException(DefaultUpdateCheckManager.java:247)
 at org.eclipse.aether.internal.impl.DefaultUpdateCheckManager.checkArtifact(DefaultUpdateCheckManager.java:192)
 at org.eclipse.aether.internal.impl.DefaultArtifactResolver.gatherDownloads(DefaultArtifactResolver.java:594)
 at org.eclipse.aether.internal.impl.DefaultArtifactResolver.performDownloads(DefaultArtifactResolver.java:512)
 at org.eclipse.aether.internal.impl.DefaultArtifactResolver.resolve(DefaultArtifactResolver.java:430)
 ... 31 more
[ERROR] 
[ERROR] Re-run Maven using the -X switch to enable full debug logging.
[ERROR] 
[ERROR] For more information about the errors and possible solutions, please read the following articles:
[ERROR] [Help 1] http://cwiki.apache.org/confluence/display/MAVEN/ProjectBuildingException
[ERROR] [Help 2] http://cwiki.apache.org/confluence/display/MAVEN/UnresolvableModelException


Stack Trace:
org.apache.maven.it.VerificationException: 
Exit code was non-zero: 1; command line and log = 
F:\jenkins\tools\maven\apache-maven-3.5.0\bin\mvn -e --batch-mode -Dmaven.repo.local=f:\jenkins\jenkins-slave\workspace\rces-plugin_MRRESOURCES-104-LGCBGPPUNLUBE2DYS4XSK7TMPVBNNKKJD5CX73QOJHAO4AO3H5JA\m\target/it-repo org.apache.maven.plugins:maven-clean-plugin:clean generate-resources
Picked up JAVA_TOOL_OPTIONS: -Dmaven.ext.class.path="f:\jenkins\jenkins-slave\workspace\rces-plugin_MRRESOURCES-104-LGCBGPPUNLUBE2DYS4XSK7TMPVBNNKKJD5CX73QOJHAO4AO3H5JA@tmp\withMaven60baf391\pipeline-maven-spy.jar" -Dorg.jenkinsci.plugins.pipeline.maven.reportsFolder="f:\jenkins\jenkins-slave\workspace\rces-plugin_MRRESOURCES-104-LGCBGPPUNLUBE2DYS4XSK7TMPVBNNKKJD5CX73QOJHAO4AO3H5JA@tmp\withMaven60baf391" 
[INFO] [jenkins-event-spy] Jenkins Maven Event Spy is disabled
[INFO] Error stacktraces are turned on.
[INFO] Scanning for projects...
[INFO] Downloading: http://repository.apache.org/snapshots/org/apache/maven/plugin/rresource/it/it-parent/1.6-SNAPSHOT/maven-metadata.xml
[WARNING] Could not transfer metadata org.apache.maven.plugin.rresource.it:it-parent:1.6-SNAPSHOT/maven-metadata.xml from/to apache-snapshots (http://repository.apache.org/snapshots/): Connect to repository.apache.org:80 [repository.apache.org/207.244.88.140] failed: Connection timed out: connect
[INFO] Downloading: http://repository.apache.org/snapshots/org/apache/maven/plugin/rresource/it/it-parent/1.6-SNAPSHOT/it-parent-1.6-SNAPSHOT.pom
[ERROR] [ERROR] Some problems were encountered while processing the POMs:
[FATAL] Non-resolvable parent POM for org.apache.maven.plugin.rresource.it.mrr41:parent:[unknown-version]: Could not transfer artifact org.apache.maven.plugin.rresource.it:it-parent:pom:1.6-SNAPSHOT from/to apache-snapshots (http://repository.apache.org/snapshots/): Connect to repository.apache.org:80 [repository.apache.org/207.244.88.140] failed: Connection timed out: connect and 'parent.relativePath' points at wrong local POM @ org.apache.maven.plugin.rresource.it.mrr41:parent:[unknown-version], F:\jenkins\jenkins-slave\workspace\rces-plugin_MRRESOURCES-104-LGCBGPPUNLUBE2DYS4XSK7TMPVBNNKKJD5CX73QOJHAO4AO3H5JA\m\target\test-classes\run-only-at-execution-root\pom.xml, line 24, column 11
[FATAL] Non-resolvable parent POM for org.apache.maven.plugin.rresource.it.mrr41:parent:[unknown-version]: Failure to transfer org.apache.maven.plugin.rresource.it:it-parent:pom:1.6-SNAPSHOT from http://repository.apache.org/snapshots/ was cached in the local repository, resolution will not be reattempted until the update interval of apache-snapshots has elapsed or updates are forced. Original error: Could not transfer artifact org.apache.maven.plugin.rresource.it:it-parent:pom:1.6-SNAPSHOT from/to apache-snapshots (http://repository.apache.org/snapshots/): Connect to repository.apache.org:80 [repository.apache.org/207.244.88.140] failed: Connection timed out: connect and 'parent.relativePath' points at wrong local POM @ org.apache.maven.plugin.rresource.it.mrr41:parent:[unknown-version], F:\jenkins\jenkins-slave\workspace\rces-plugin_MRRESOURCES-104-LGCBGPPUNLUBE2DYS4XSK7TMPVBNNKKJD5CX73QOJHAO4AO3H5JA\m\target\test-classes\run-only-at-execution-root\pom.xml, line 24, column 11
 @ 
[ERROR] The build could not read 2 projects -> [Help 1]
org.apache.maven.project.ProjectBuildingException: Some problems were encountered while processing the POMs:
[FATAL] Non-resolvable parent POM for org.apache.maven.plugin.rresource.it.mrr41:parent:[unknown-version]: Could not transfer artifact org.apache.maven.plugin.rresource.it:it-parent:pom:1.6-SNAPSHOT from/to apache-snapshots (http://repository.apache.org/snapshots/): Connect to repository.apache.org:80 [repository.apache.org/207.244.88.140] failed: Connection timed out: connect and 'parent.relativePath' points at wrong local POM @ org.apache.maven.plugin.rresource.it.mrr41:parent:[unknown-version], F:\jenkins\jenkins-slave\workspace\rces-plugin_MRRESOURCES-104-LGCBGPPUNLUBE2DYS4XSK7TMPVBNNKKJD5CX73QOJHAO4AO3H5JA\m\target\test-classes\run-only-at-execution-root\pom.xml, line 24, column 11
[FATAL] Non-resolvable parent POM for org.apache.maven.plugin.rresource.it.mrr41:parent:[unknown-version]: Failure to transfer org.apache.maven.plugin.rresource.it:it-parent:pom:1.6-SNAPSHOT from http://repository.apache.org/snapshots/ was cached in the local repository, resolution will not be reattempted until the update interval of apache-snapshots has elapsed or updates are forced. Original error: Could not transfer artifact org.apache.maven.plugin.rresource.it:it-parent:pom:1.6-SNAPSHOT from/to apache-snapshots (http://repository.apache.org/snapshots/): Connect to repository.apache.org:80 [repository.apache.org/207.244.88.140] failed: Connection timed out: connect and 'parent.relativePath' points at wrong local POM @ org.apache.maven.plugin.rresource.it.mrr41:parent:[unknown-version], F:\jenkins\jenkins-slave\workspace\rces-plugin_MRRESOURCES-104-LGCBGPPUNLUBE2DYS4XSK7TMPVBNNKKJD5CX73QOJHAO4AO3H5JA\m\target\test-classes\run-only-at-execution-root\pom.xml, line 24, column 11

	at org.apache.maven.project.DefaultProjectBuilder.build(DefaultProjectBuilder.java:382)
	at org.apache.maven.graph.DefaultGraphBuilder.collectProjects(DefaultGraphBuilder.java:400)
	at org.apache.maven.graph.DefaultGraphBuilder.getProjectsForMavenReactor(DefaultGraphBuilder.java:391)
	at org.apache.maven.graph.DefaultGraphBuilder.build(DefaultGraphBuilder.java:78)
	at org.apache.maven.DefaultMaven.buildGraph(DefaultMaven.java:511)
	at org.apache.maven.DefaultMaven.doExecute(DefaultMaven.java:221)
	at org.apache.maven.DefaultMaven.doExecute(DefaultMaven.java:194)
	at org.apache.maven.DefaultMaven.execute(DefaultMaven.java:107)
	at org.apache.maven.cli.MavenCli.execute(MavenCli.java:993)
	at org.apache.maven.cli.MavenCli.doMain(MavenCli.java:345)
	at org.apache.maven.cli.MavenCli.main(MavenCli.java:191)
	at java.base/jdk.internal.reflect.NativeMethodAccessorImpl.invoke0(Native Method)
	at java.base/jdk.internal.reflect.NativeMethodAccessorImpl.invoke(NativeMethodAccessorImpl.java:62)
	at java.base/jdk.internal.reflect.DelegatingMethodAccessorImpl.invoke(DelegatingMethodAccessorImpl.java:43)
	at java.base/java.lang.reflect.Method.invoke(Method.java:564)
	at org.codehaus.plexus.classworlds.launcher.Launcher.launchEnhanced(Launcher.java:289)
	at org.codehaus.plexus.classworlds.launcher.Launcher.launch(Launcher.java:229)
	at org.codehaus.plexus.classworlds.launcher.Launcher.mainWithExitCode(Launcher.java:415)
	at org.codehaus.plexus.classworlds.launcher.Launcher.main(Launcher.java:356)
[ERROR]   
[ERROR]   The project org.apache.maven.plugin.rresource.it.mrr41:child-1:[unknown-version] (F:\jenkins\jenkins-slave\workspace\rces-plugin_MRRESOURCES-104-LGCBGPPUNLUBE2DYS4XSK7TMPVBNNKKJD5CX73QOJHAO4AO3H5JA\m\target\test-classes\run-only-at-execution-root\child1\pom.xml) has 1 error
[ERROR]     Non-resolvable parent POM for org.apache.maven.plugin.rresource.it.mrr41:parent:[unknown-version]: Could not transfer artifact org.apache.maven.plugin.rresource.it:it-parent:pom:1.6-SNAPSHOT from/to apache-snapshots (http://repository.apache.org/snapshots/): Connect to repository.apache.org:80 [repository.apache.org/207.244.88.140] failed: Connection timed out: connect and 'parent.relativePath' points at wrong local POM @ org.apache.maven.plugin.rresource.it.mrr41:parent:[unknown-version], F:\jenkins\jenkins-slave\workspace\rces-plugin_MRRESOURCES-104-LGCBGPPUNLUBE2DYS4XSK7TMPVBNNKKJD5CX73QOJHAO4AO3H5JA\m\target\test-classes\run-only-at-execution-root\pom.xml, line 24, column 11 -> [Help 2]
org.apache.maven.model.resolution.UnresolvableModelException: Could not transfer artifact org.apache.maven.plugin.rresource.it:it-parent:pom:1.6-SNAPSHOT from/to apache-snapshots (http://repository.apache.org/snapshots/): Connect to repository.apache.org:80 [repository.apache.org/207.244.88.140] failed: Connection timed out: connect
	at org.apache.maven.project.ProjectModelResolver.resolveModel(ProjectModelResolver.java:197)
	at org.apache.maven.project.ProjectModelResolver.resolveModel(ProjectModelResolver.java:243)
	at org.apache.maven.model.building.DefaultModelBuilder.readParentExternally(DefaultModelBuilder.java:1051)
	at org.apache.maven.model.building.DefaultModelBuilder.readParent(DefaultModelBuilder.java:851)
	at org.apache.maven.model.building.DefaultModelBuilder.build(DefaultModelBuilder.java:331)
	at org.apache.maven.project.DefaultProjectBuilder.build(DefaultProjectBuilder.java:429)
	at org.apache.maven.project.DefaultProjectBuilder.build(DefaultProjectBuilder.java:398)
	at org.apache.maven.project.DefaultProjectBuilder.build(DefaultProjectBuilder.java:515)
	at org.apache.maven.project.DefaultProjectBuilder.build(DefaultProjectBuilder.java:398)
	at org.apache.maven.project.DefaultProjectBuilder.build(DefaultProjectBuilder.java:361)
	at org.apache.maven.graph.DefaultGraphBuilder.collectProjects(DefaultGraphBuilder.java:400)
	at org.apache.maven.graph.DefaultGraphBuilder.getProjectsForMavenReactor(DefaultGraphBuilder.java:391)
	at org.apache.maven.graph.DefaultGraphBuilder.build(DefaultGraphBuilder.java:78)
	at org.apache.maven.DefaultMaven.buildGraph(DefaultMaven.java:511)
	at org.apache.maven.DefaultMaven.doExecute(DefaultMaven.java:221)
	at org.apache.maven.DefaultMaven.doExecute(DefaultMaven.java:194)
	at org.apache.maven.DefaultMaven.execute(DefaultMaven.java:107)
	at org.apache.maven.cli.MavenCli.execute(MavenCli.java:993)
	at org.apache.maven.cli.MavenCli.doMain(MavenCli.java:345)
	at org.apache.maven.cli.MavenCli.main(MavenCli.java:191)
	at java.base/jdk.internal.reflect.NativeMethodAccessorImpl.invoke0(Native Method)
	at java.base/jdk.internal.reflect.NativeMethodAccessorImpl.invoke(NativeMethodAccessorImpl.java:62)
	at java.base/jdk.internal.reflect.DelegatingMethodAccessorImpl.invoke(DelegatingMethodAccessorImpl.java:43)
	at java.base/java.lang.reflect.Method.invoke(Method.java:564)
	at org.codehaus.plexus.classworlds.launcher.Launcher.launchEnhanced(Launcher.java:289)
	at org.codehaus.plexus.classworlds.launcher.Launcher.launch(Launcher.java:229)
	at org.codehaus.plexus.classworlds.launcher.Launcher.mainWithExitCode(Launcher.java:415)
	at org.codehaus.plexus.classworlds.launcher.Launcher.main(Launcher.java:356)
Caused by: org.eclipse.aether.resolution.ArtifactResolutionException: Could not transfer artifact org.apache.maven.plugin.rresource.it:it-parent:pom:1.6-SNAPSHOT from/to apache-snapshots (http://repository.apache.org/snapshots/): Connect to repository.apache.org:80 [repository.apache.org/207.244.88.140] failed: Connection timed out: connect
	at org.eclipse.aether.internal.impl.DefaultArtifactResolver.resolve(DefaultArtifactResolver.java:453)
	at org.eclipse.aether.internal.impl.DefaultArtifactResolver.resolveArtifacts(DefaultArtifactResolver.java:255)
	at org.eclipse.aether.internal.impl.DefaultArtifactResolver.resolveArtifact(DefaultArtifactResolver.java:232)
	at org.eclipse.aether.internal.impl.DefaultRepositorySystem.resolveArtifact(DefaultRepositorySystem.java:303)
	at org.apache.maven.project.ProjectModelResolver.resolveModel(ProjectModelResolver.java:193)
	... 27 more
Caused by: org.eclipse.aether.transfer.ArtifactTransferException: Could not transfer artifact org.apache.maven.plugin.rresource.it:it-parent:pom:1.6-SNAPSHOT from/to apache-snapshots (http://repository.apache.org/snapshots/): Connect to repository.apache.org:80 [repository.apache.org/207.244.88.140] failed: Connection timed out: connect
	at org.eclipse.aether.connector.basic.ArtifactTransportListener.transferFailed(ArtifactTransportListener.java:52)
	at org.eclipse.aether.connector.basic.BasicRepositoryConnector$TaskRunner.run(BasicRepositoryConnector.java:364)
	at org.eclipse.aether.util.concurrency.RunnableErrorForwarder$1.run(RunnableErrorForwarder.java:76)
	at org.eclipse.aether.connector.basic.BasicRepositoryConnector$DirectExecutor.execute(BasicRepositoryConnector.java:590)
	at org.eclipse.aether.connector.basic.BasicRepositoryConnector.get(BasicRepositoryConnector.java:258)
	at org.eclipse.aether.internal.impl.DefaultArtifactResolver.performDownloads(DefaultArtifactResolver.java:529)
	at org.eclipse.aether.internal.impl.DefaultArtifactResolver.resolve(DefaultArtifactResolver.java:430)
	... 31 more
Caused by: org.apache.maven.wagon.TransferFailedException: Connect to repository.apache.org:80 [repository.apache.org/207.244.88.140] failed: Connection timed out: connect
	at org.apache.maven.wagon.providers.http.AbstractHttpClientWagon.fillInputData(AbstractHttpClientWagon.java:1068)
	at org.apache.maven.wagon.providers.http.AbstractHttpClientWagon.fillInputData(AbstractHttpClientWagon.java:962)
	at org.apache.maven.wagon.StreamWagon.getInputStream(StreamWagon.java:126)
	at org.apache.maven.wagon.StreamWagon.getIfNewer(StreamWagon.java:88)
	at org.apache.maven.wagon.StreamWagon.get(StreamWagon.java:61)
	at org.eclipse.aether.transport.wagon.WagonTransporter$GetTaskRunner.run(WagonTransporter.java:569)
	at org.eclipse.aether.transport.wagon.WagonTransporter.execute(WagonTransporter.java:436)
	at org.eclipse.aether.transport.wagon.WagonTransporter.get(WagonTransporter.java:413)
	at org.eclipse.aether.connector.basic.BasicRepositoryConnector$GetTaskRunner.runTask(BasicRepositoryConnector.java:456)
	at org.eclipse.aether.connector.basic.BasicRepositoryConnector$TaskRunner.run(BasicRepositoryConnector.java:359)
	... 36 more
Caused by: org.apache.maven.wagon.providers.http.httpclient.conn.HttpHostConnectException: Connect to repository.apache.org:80 [repository.apache.org/207.244.88.140] failed: Connection timed out: connect
	at org.apache.maven.wagon.providers.http.httpclient.impl.conn.DefaultHttpClientConnectionOperator.connect(DefaultHttpClientConnectionOperator.java:158)
	at org.apache.maven.wagon.providers.http.httpclient.impl.conn.PoolingHttpClientConnectionManager.connect(PoolingHttpClientConnectionManager.java:353)
	at org.apache.maven.wagon.providers.http.httpclient.impl.execchain.MainClientExec.establishRoute(MainClientExec.java:380)
	at org.apache.maven.wagon.providers.http.httpclient.impl.execchain.MainClientExec.execute(MainClientExec.java:236)
	at org.apache.maven.wagon.providers.http.httpclient.impl.execchain.ProtocolExec.execute(ProtocolExec.java:184)
	at org.apache.maven.wagon.providers.http.httpclient.impl.execchain.RetryExec.execute(RetryExec.java:88)
	at org.apache.maven.wagon.providers.http.httpclient.impl.execchain.RedirectExec.execute(RedirectExec.java:110)
	at org.apache.maven.wagon.providers.http.httpclient.impl.client.InternalHttpClient.doExecute(InternalHttpClient.java:184)
	at org.apache.maven.wagon.providers.http.httpclient.impl.client.CloseableHttpClient.execute(CloseableHttpClient.java:82)
	at org.apache.maven.wagon.providers.http.AbstractHttpClientWagon.execute(AbstractHttpClientWagon.java:834)
	at org.apache.maven.wagon.providers.http.AbstractHttpClientWagon.fillInputData(AbstractHttpClientWagon.java:985)
	... 45 more
Caused by: java.net.ConnectException: Connection timed out: connect
	at java.base/java.net.DualStackPlainSocketImpl.connect0(Native Method)
	at java.base/java.net.DualStackPlainSocketImpl.socketConnect(DualStackPlainSocketImpl.java:79)
	at java.base/java.net.AbstractPlainSocketImpl.doConnect(AbstractPlainSocketImpl.java:400)
	at java.base/java.net.AbstractPlainSocketImpl.connectToAddress(AbstractPlainSocketImpl.java:243)
	at java.base/java.net.AbstractPlainSocketImpl.connect(AbstractPlainSocketImpl.java:225)
	at java.base/java.net.PlainSocketImpl.connect(PlainSocketImpl.java:148)
	at java.base/java.net.SocksSocketImpl.connect(SocksSocketImpl.java:402)
	at java.base/java.net.Socket.connect(Socket.java:591)
	at org.apache.maven.wagon.providers.http.httpclient.conn.socket.PlainConnectionSocketFactory.connectSocket(PlainConnectionSocketFactory.java:74)
	at org.apache.maven.wagon.providers.http.httpclient.impl.conn.DefaultHttpClientConnectionOperator.connect(DefaultHttpClientConnectionOperator.java:141)
	... 55 more
[ERROR]   
[ERROR]   The project org.apache.maven.plugin.rresource.it.mrr41:child-2:[unknown-version] (F:\jenkins\jenkins-slave\workspace\rces-plugin_MRRESOURCES-104-LGCBGPPUNLUBE2DYS4XSK7TMPVBNNKKJD5CX73QOJHAO4AO3H5JA\m\target\test-classes\run-only-at-execution-root\child2\pom.xml) has 1 error
[ERROR]     Non-resolvable parent POM for org.apache.maven.plugin.rresource.it.mrr41:parent:[unknown-version]: Failure to transfer org.apache.maven.plugin.rresource.it:it-parent:pom:1.6-SNAPSHOT from http://repository.apache.org/snapshots/ was cached in the local repository, resolution will not be reattempted until the update interval of apache-snapshots has elapsed or updates are forced. Original error: Could not transfer artifact org.apache.maven.plugin.rresource.it:it-parent:pom:1.6-SNAPSHOT from/to apache-snapshots (http://repository.apache.org/snapshots/): Connect to repository.apache.org:80 [repository.apache.org/207.244.88.140] failed: Connection timed out: connect and 'parent.relativePath' points at wrong local POM @ org.apache.maven.plugin.rresource.it.mrr41:parent:[unknown-version], F:\jenkins\jenkins-slave\workspace\rces-plugin_MRRESOURCES-104-LGCBGPPUNLUBE2DYS4XSK7TMPVBNNKKJD5CX73QOJHAO4AO3H5JA\m\target\test-classes\run-only-at-execution-root\pom.xml, line 24, column 11 -> [Help 2]
org.apache.maven.model.resolution.UnresolvableModelException: Failure to transfer org.apache.maven.plugin.rresource.it:it-parent:pom:1.6-SNAPSHOT from http://repository.apache.org/snapshots/ was cached in the local repository, resolution will not be reattempted until the update interval of apache-snapshots has elapsed or updates are forced. Original error: Could not transfer artifact org.apache.maven.plugin.rresource.it:it-parent:pom:1.6-SNAPSHOT from/to apache-snapshots (http://repository.apache.org/snapshots/): Connect to repository.apache.org:80 [repository.apache.org/207.244.88.140] failed: Connection timed out: connect
	at org.apache.maven.project.ProjectModelResolver.resolveModel(ProjectModelResolver.java:197)
	at org.apache.maven.project.ProjectModelResolver.resolveModel(ProjectModelResolver.java:243)
	at org.apache.maven.model.building.DefaultModelBuilder.readParentExternally(DefaultModelBuilder.java:1051)
	at org.apache.maven.model.building.DefaultModelBuilder.readParent(DefaultModelBuilder.java:851)
	at org.apache.maven.model.building.DefaultModelBuilder.build(DefaultModelBuilder.java:331)
	at org.apache.maven.project.DefaultProjectBuilder.build(DefaultProjectBuilder.java:429)
	at org.apache.maven.project.DefaultProjectBuilder.build(DefaultProjectBuilder.java:398)
	at org.apache.maven.project.DefaultProjectBuilder.build(DefaultProjectBuilder.java:515)
	at org.apache.maven.project.DefaultProjectBuilder.build(DefaultProjectBuilder.java:398)
	at org.apache.maven.project.DefaultProjectBuilder.build(DefaultProjectBuilder.java:361)
	at org.apache.maven.graph.DefaultGraphBuilder.collectProjects(DefaultGraphBuilder.java:400)
	at org.apache.maven.graph.DefaultGraphBuilder.getProjectsForMavenReactor(DefaultGraphBuilder.java:391)
	at org.apache.maven.graph.DefaultGraphBuilder.build(DefaultGraphBuilder.java:78)
	at org.apache.maven.DefaultMaven.buildGraph(DefaultMaven.java:511)
	at org.apache.maven.DefaultMaven.doExecute(DefaultMaven.java:221)
	at org.apache.maven.DefaultMaven.doExecute(DefaultMaven.java:194)
	at org.apache.maven.DefaultMaven.execute(DefaultMaven.java:107)
	at org.apache.maven.cli.MavenCli.execute(MavenCli.java:993)
	at org.apache.maven.cli.MavenCli.doMain(MavenCli.java:345)
	at org.apache.maven.cli.MavenCli.main(MavenCli.java:191)
	at java.base/jdk.internal.reflect.NativeMethodAccessorImpl.invoke0(Native Method)
	at java.base/jdk.internal.reflect.NativeMethodAccessorImpl.invoke(NativeMethodAccessorImpl.java:62)
	at java.base/jdk.internal.reflect.DelegatingMethodAccessorImpl.invoke(DelegatingMethodAccessorImpl.java:43)
	at java.base/java.lang.reflect.Method.invoke(Method.java:564)
	at org.codehaus.plexus.classworlds.launcher.Launcher.launchEnhanced(Launcher.java:289)
	at org.codehaus.plexus.classworlds.launcher.Launcher.launch(Launcher.java:229)
	at org.codehaus.plexus.classworlds.launcher.Launcher.mainWithExitCode(Launcher.java:415)
	at org.codehaus.plexus.classworlds.launcher.Launcher.main(Launcher.java:356)
Caused by: org.eclipse.aether.resolution.ArtifactResolutionException: Failure to transfer org.apache.maven.plugin.rresource.it:it-parent:pom:1.6-SNAPSHOT from http://repository.apache.org/snapshots/ was cached in the local repository, resolution will not be reattempted until the update interval of apache-snapshots has elapsed or updates are forced. Original error: Could not transfer artifact org.apache.maven.plugin.rresource.it:it-parent:pom:1.6-SNAPSHOT from/to apache-snapshots (http://repository.apache.org/snapshots/): Connect to repository.apache.org:80 [repository.apache.org/207.244.88.140] failed: Connection timed out: connect
	at org.eclipse.aether.internal.impl.DefaultArtifactResolver.resolve(DefaultArtifactResolver.java:453)
	at org.eclipse.aether.internal.impl.DefaultArtifactResolver.resolveArtifacts(DefaultArtifactResolver.java:255)
	at org.eclipse.aether.internal.impl.DefaultArtifactResolver.resolveArtifact(DefaultArtifactResolver.java:232)
	at org.eclipse.aether.internal.impl.DefaultRepositorySystem.resolveArtifact(DefaultRepositorySystem.java:303)
	at org.apache.maven.project.ProjectModelResolver.resolveModel(ProjectModelResolver.java:193)
	... 27 more
Caused by: org.eclipse.aether.transfer.ArtifactTransferException: Failure to transfer org.apache.maven.plugin.rresource.it:it-parent:pom:1.6-SNAPSHOT from http://repository.apache.org/snapshots/ was cached in the local repository, resolution will not be reattempted until the update interval of apache-snapshots has elapsed or updates are forced. Original error: Could not transfer artifact org.apache.maven.plugin.rresource.it:it-parent:pom:1.6-SNAPSHOT from/to apache-snapshots (http://repository.apache.org/snapshots/): Connect to repository.apache.org:80 [repository.apache.org/207.244.88.140] failed: Connection timed out: connect
	at org.eclipse.aether.internal.impl.DefaultUpdateCheckManager.newException(DefaultUpdateCheckManager.java:247)
	at org.eclipse.aether.internal.impl.DefaultUpdateCheckManager.checkArtifact(DefaultUpdateCheckManager.java:192)
	at org.eclipse.aether.internal.impl.DefaultArtifactResolver.gatherDownloads(DefaultArtifactResolver.java:594)
	at org.eclipse.aether.internal.impl.DefaultArtifactResolver.performDownloads(DefaultArtifactResolver.java:512)
	at org.eclipse.aether.internal.impl.DefaultArtifactResolver.resolve(DefaultArtifactResolver.java:430)
	... 31 more
[ERROR] 
[ERROR] Re-run Maven using the -X switch to enable full debug logging.
[ERROR] 
[ERROR] For more information about the errors and possible solutions, please read the following articles:
[ERROR] [Help 1] http://cwiki.apache.org/confluence/display/MAVEN/ProjectBuildingException
[ERROR] [Help 2] http://cwiki.apache.org/confluence/display/MAVEN/UnresolvableModelException

	at org.apache.maven.plugin.resources.remote.it.IT_RunOnlyAtExecutionRoot.test(IT_RunOnlyAtExecutionRoot.java:60)


FAILED:  org.apache.maven.plugin.resources.remote.it.IT_RunOnlyAtExecutionRoot.test

Error Message:
Exit code was non-zero: 1; command line and log = 
F:\jenkins\tools\maven\apache-maven-3.5.0\bin\mvn -e --batch-mode -Dmaven.repo.local=f:\jenkins\jenkins-slave\workspace\rces-plugin_MRRESOURCES-104-LGCBGPPUNLUBE2DYS4XSK7TMPVBNNKKJD5CX73QOJHAO4AO3H5JA@2\m\target/it-repo org.apache.maven.plugins:maven-clean-plugin:clean generate-resources
Picked up JAVA_TOOL_OPTIONS: -Dmaven.ext.class.path="f:\jenkins\jenkins-slave\workspace\rces-plugin_MRRESOURCES-104-LGCBGPPUNLUBE2DYS4XSK7TMPVBNNKKJD5CX73QOJHAO4AO3H5JA@2@tmp\withMaven76b8dc64\pipeline-maven-spy.jar" -Dorg.jenkinsci.plugins.pipeline.maven.reportsFolder="f:\jenkins\jenkins-slave\workspace\rces-plugin_MRRESOURCES-104-LGCBGPPUNLUBE2DYS4XSK7TMPVBNNKKJD5CX73QOJHAO4AO3H5JA@2@tmp\withMaven76b8dc64" 
[INFO] [jenkins-event-spy] Jenkins Maven Event Spy is disabled
[INFO] Error stacktraces are turned on.
[INFO] Scanning for projects...
[INFO] Downloading: http://repository.apache.org/snapshots/org/apache/maven/plugin/rresource/it/it-parent/1.6-SNAPSHOT/maven-metadata.xml
[WARNING] Could not transfer metadata org.apache.maven.plugin.rresource.it:it-parent:1.6-SNAPSHOT/maven-metadata.xml from/to apache-snapshots (http://repository.apache.org/snapshots/): Connect to repository.apache.org:80 [repository.apache.org/207.244.88.140] failed: Connection timed out: connect
[INFO] Downloading: http://repository.apache.org/snapshots/org/apache/maven/plugin/rresource/it/it-parent/1.6-SNAPSHOT/it-parent-1.6-SNAPSHOT.pom
[ERROR] [ERROR] Some problems were encountered while processing the POMs:
[FATAL] Non-resolvable parent POM for org.apache.maven.plugin.rresource.it.mrr41:parent:[unknown-version]: Could not transfer artifact org.apache.maven.plugin.rresource.it:it-parent:pom:1.6-SNAPSHOT from/to apache-snapshots (http://repository.apache.org/snapshots/): Connect to repository.apache.org:80 [repository.apache.org/207.244.88.140] failed: Connection timed out: connect and 'parent.relativePath' points at wrong local POM @ org.apache.maven.plugin.rresource.it.mrr41:parent:[unknown-version], F:\jenkins\jenkins-slave\workspace\rces-plugin_MRRESOURCES-104-LGCBGPPUNLUBE2DYS4XSK7TMPVBNNKKJD5CX73QOJHAO4AO3H5JA@2\m\target\test-classes\run-only-at-execution-root\pom.xml, line 24, column 11
[FATAL] Non-resolvable parent POM for org.apache.maven.plugin.rresource.it.mrr41:parent:[unknown-version]: Failure to transfer org.apache.maven.plugin.rresource.it:it-parent:pom:1.6-SNAPSHOT from http://repository.apache.org/snapshots/ was cached in the local repository, resolution will not be reattempted until the update interval of apache-snapshots has elapsed or updates are forced. Original error: Could not transfer artifact org.apache.maven.plugin.rresource.it:it-parent:pom:1.6-SNAPSHOT from/to apache-snapshots (http://repository.apache.org/snapshots/): Connect to repository.apache.org:80 [repository.apache.org/207.244.88.140] failed: Connection timed out: connect and 'parent.relativePath' points at wrong local POM @ org.apache.maven.plugin.rresource.it.mrr41:parent:[unknown-version], F:\jenkins\jenkins-slave\workspace\rces-plugin_MRRESOURCES-104-LGCBGPPUNLUBE2DYS4XSK7TMPVBNNKKJD5CX73QOJHAO4AO3H5JA@2\m\target\test-classes\run-only-at-execution-root\pom.xml, line 24, column 11
 @ 
[ERROR] The build could not read 2 projects -> [Help 1]
org.apache.maven.project.ProjectBuildingException: Some problems were encountered while processing the POMs:
[FATAL] Non-resolvable parent POM for org.apache.maven.plugin.rresource.it.mrr41:parent:[unknown-version]: Could not transfer artifact org.apache.maven.plugin.rresource.it:it-parent:pom:1.6-SNAPSHOT from/to apache-snapshots (http://repository.apache.org/snapshots/): Connect to repository.apache.org:80 [repository.apache.org/207.244.88.140] failed: Connection timed out: connect and 'parent.relativePath' points at wrong local POM @ org.apache.maven.plugin.rresource.it.mrr41:parent:[unknown-version], F:\jenkins\jenkins-slave\workspace\rces-plugin_MRRESOURCES-104-LGCBGPPUNLUBE2DYS4XSK7TMPVBNNKKJD5CX73QOJHAO4AO3H5JA@2\m\target\test-classes\run-only-at-execution-root\pom.xml, line 24, column 11
[FATAL] Non-resolvable parent POM for org.apache.maven.plugin.rresource.it.mrr41:parent:[unknown-version]: Failure to transfer org.apache.maven.plugin.rresource.it:it-parent:pom:1.6-SNAPSHOT from http://repository.apache.org/snapshots/ was cached in the local repository, resolution will not be reattempted until the update interval of apache-snapshots has elapsed or updates are forced. Original error: Could not transfer artifact org.apache.maven.plugin.rresource.it:it-parent:pom:1.6-SNAPSHOT from/to apache-snapshots (http://repository.apache.org/snapshots/): Connect to repository.apache.org:80 [repository.apache.org/207.244.88.140] failed: Connection timed out: connect and 'parent.relativePath' points at wrong local POM @ org.apache.maven.plugin.rresource.it.mrr41:parent:[unknown-version], F:\jenkins\jenkins-slave\workspace\rces-plugin_MRRESOURCES-104-LGCBGPPUNLUBE2DYS4XSK7TMPVBNNKKJD5CX73QOJHAO4AO3H5JA@2\m\target\test-classes\run-only-at-execution-root\pom.xml, line 24, column 11

 at org.apache.maven.project.DefaultProjectBuilder.build(DefaultProjectBuilder.java:382)
 at org.apache.maven.graph.DefaultGraphBuilder.collectProjects(DefaultGraphBuilder.java:400)
 at org.apache.maven.graph.DefaultGraphBuilder.getProjectsForMavenReactor(DefaultGraphBuilder.java:391)
 at org.apache.maven.graph.DefaultGraphBuilder.build(DefaultGraphBuilder.java:78)
 at org.apache.maven.DefaultMaven.buildGraph(DefaultMaven.java:511)
 at org.apache.maven.DefaultMaven.doExecute(DefaultMaven.java:221)
 at org.apache.maven.DefaultMaven.doExecute(DefaultMaven.java:194)
 at org.apache.maven.DefaultMaven.execute(DefaultMaven.java:107)
 at org.apache.maven.cli.MavenCli.execute(MavenCli.java:993)
 at org.apache.maven.cli.MavenCli.doMain(MavenCli.java:345)
 at org.apache.maven.cli.MavenCli.main(MavenCli.java:191)
 at java.base/jdk.internal.reflect.NativeMethodAccessorImpl.invoke0(Native Method)
 at java.base/jdk.internal.reflect.NativeMethodAccessorImpl.invoke(NativeMethodAccessorImpl.java:62)
 at java.base/jdk.internal.reflect.DelegatingMethodAccessorImpl.invoke(DelegatingMethodAccessorImpl.java:43)
 at java.base/java.lang.reflect.Method.invoke(Method.java:564)
 at org.codehaus.plexus.classworlds.launcher.Launcher.launchEnhanced(Launcher.java:289)
 at org.codehaus.plexus.classworlds.launcher.Launcher.launch(Launcher.java:229)
 at org.codehaus.plexus.classworlds.launcher.Launcher.mainWithExitCode(Launcher.java:415)
 at org.codehaus.plexus.classworlds.launcher.Launcher.main(Launcher.java:356)
[ERROR]   
[ERROR]   The project org.apache.maven.plugin.rresource.it.mrr41:child-1:[unknown-version] (F:\jenkins\jenkins-slave\workspace\rces-plugin_MRRESOURCES-104-LGCBGPPUNLUBE2DYS4XSK7TMPVBNNKKJD5CX73QOJHAO4AO3H5JA@2\m\target\test-classes\run-only-at-execution-root\child1\pom.xml) has 1 error
[ERROR]     Non-resolvable parent POM for org.apache.maven.plugin.rresource.it.mrr41:parent:[unknown-version]: Could not transfer artifact org.apache.maven.plugin.rresource.it:it-parent:pom:1.6-SNAPSHOT from/to apache-snapshots (http://repository.apache.org/snapshots/): Connect to repository.apache.org:80 [repository.apache.org/207.244.88.140] failed: Connection timed out: connect and 'parent.relativePath' points at wrong local POM @ org.apache.maven.plugin.rresource.it.mrr41:parent:[unknown-version], F:\jenkins\jenkins-slave\workspace\rces-plugin_MRRESOURCES-104-LGCBGPPUNLUBE2DYS4XSK7TMPVBNNKKJD5CX73QOJHAO4AO3H5JA@2\m\target\test-classes\run-only-at-execution-root\pom.xml, line 24, column 11 -> [Help 2]
org.apache.maven.model.resolution.UnresolvableModelException: Could not transfer artifact org.apache.maven.plugin.rresource.it:it-parent:pom:1.6-SNAPSHOT from/to apache-snapshots (http://repository.apache.org/snapshots/): Connect to repository.apache.org:80 [repository.apache.org/207.244.88.140] failed: Connection timed out: connect
 at org.apache.maven.project.ProjectModelResolver.resolveModel(ProjectModelResolver.java:197)
 at org.apache.maven.project.ProjectModelResolver.resolveModel(ProjectModelResolver.java:243)
 at org.apache.maven.model.building.DefaultModelBuilder.readParentExternally(DefaultModelBuilder.java:1051)
 at org.apache.maven.model.building.DefaultModelBuilder.readParent(DefaultModelBuilder.java:851)
 at org.apache.maven.model.building.DefaultModelBuilder.build(DefaultModelBuilder.java:331)
 at org.apache.maven.project.DefaultProjectBuilder.build(DefaultProjectBuilder.java:429)
 at org.apache.maven.project.DefaultProjectBuilder.build(DefaultProjectBuilder.java:398)
 at org.apache.maven.project.DefaultProjectBuilder.build(DefaultProjectBuilder.java:515)
 at org.apache.maven.project.DefaultProjectBuilder.build(DefaultProjectBuilder.java:398)
 at org.apache.maven.project.DefaultProjectBuilder.build(DefaultProjectBuilder.java:361)
 at org.apache.maven.graph.DefaultGraphBuilder.collectProjects(DefaultGraphBuilder.java:400)
 at org.apache.maven.graph.DefaultGraphBuilder.getProjectsForMavenReactor(DefaultGraphBuilder.java:391)
 at org.apache.maven.graph.DefaultGraphBuilder.build(DefaultGraphBuilder.java:78)
 at org.apache.maven.DefaultMaven.buildGraph(DefaultMaven.java:511)
 at org.apache.maven.DefaultMaven.doExecute(DefaultMaven.java:221)
 at org.apache.maven.DefaultMaven.doExecute(DefaultMaven.java:194)
 at org.apache.maven.DefaultMaven.execute(DefaultMaven.java:107)
 at org.apache.maven.cli.MavenCli.execute(MavenCli.java:993)
 at org.apache.maven.cli.MavenCli.doMain(MavenCli.java:345)
 at org.apache.maven.cli.MavenCli.main(MavenCli.java:191)
 at java.base/jdk.internal.reflect.NativeMethodAccessorImpl.invoke0(Native Method)
 at java.base/jdk.internal.reflect.NativeMethodAccessorImpl.invoke(NativeMethodAccessorImpl.java:62)
 at java.base/jdk.internal.reflect.DelegatingMethodAccessorImpl.invoke(DelegatingMethodAccessorImpl.java:43)
 at java.base/java.lang.reflect.Method.invoke(Method.java:564)
 at org.codehaus.plexus.classworlds.launcher.Launcher.launchEnhanced(Launcher.java:289)
 at org.codehaus.plexus.classworlds.launcher.Launcher.launch(Launcher.java:229)
 at org.codehaus.plexus.classworlds.launcher.Launcher.mainWithExitCode(Launcher.java:415)
 at org.codehaus.plexus.classworlds.launcher.Launcher.main(Launcher.java:356)
Caused by: org.eclipse.aether.resolution.ArtifactResolutionException: Could not transfer artifact org.apache.maven.plugin.rresource.it:it-parent:pom:1.6-SNAPSHOT from/to apache-snapshots (http://repository.apache.org/snapshots/): Connect to repository.apache.org:80 [repository.apache.org/207.244.88.140] failed: Connection timed out: connect
 at org.eclipse.aether.internal.impl.DefaultArtifactResolver.resolve(DefaultArtifactResolver.java:453)
 at org.eclipse.aether.internal.impl.DefaultArtifactResolver.resolveArtifacts(DefaultArtifactResolver.java:255)
 at org.eclipse.aether.internal.impl.DefaultArtifactResolver.resolveArtifact(DefaultArtifactResolver.java:232)
 at org.eclipse.aether.internal.impl.DefaultRepositorySystem.resolveArtifact(DefaultRepositorySystem.java:303)
 at org.apache.maven.project.ProjectModelResolver.resolveModel(ProjectModelResolver.java:193)
 ... 27 more
Caused by: org.eclipse.aether.transfer.ArtifactTransferException: Could not transfer artifact org.apache.maven.plugin.rresource.it:it-parent:pom:1.6-SNAPSHOT from/to apache-snapshots (http://repository.apache.org/snapshots/): Connect to repository.apache.org:80 [repository.apache.org/207.244.88.140] failed: Connection timed out: connect
 at org.eclipse.aether.connector.basic.ArtifactTransportListener.transferFailed(ArtifactTransportListener.java:52)
 at org.eclipse.aether.connector.basic.BasicRepositoryConnector$TaskRunner.run(BasicRepositoryConnector.java:364)
 at org.eclipse.aether.util.concurrency.RunnableErrorForwarder$1.run(RunnableErrorForwarder.java:76)
 at org.eclipse.aether.connector.basic.BasicRepositoryConnector$DirectExecutor.execute(BasicRepositoryConnector.java:590)
 at org.eclipse.aether.connector.basic.BasicRepositoryConnector.get(BasicRepositoryConnector.java:258)
 at org.eclipse.aether.internal.impl.DefaultArtifactResolver.performDownloads(DefaultArtifactResolver.java:529)
 at org.eclipse.aether.internal.impl.DefaultArtifactResolver.resolve(DefaultArtifactResolver.java:430)
 ... 31 more
Caused by: org.apache.maven.wagon.TransferFailedException: Connect to repository.apache.org:80 [repository.apache.org/207.244.88.140] failed: Connection timed out: connect
 at org.apache.maven.wagon.providers.http.AbstractHttpClientWagon.fillInputData(AbstractHttpClientWagon.java:1068)
 at org.apache.maven.wagon.providers.http.AbstractHttpClientWagon.fillInputData(AbstractHttpClientWagon.java:962)
 at org.apache.maven.wagon.StreamWagon.getInputStream(StreamWagon.java:126)
 at org.apache.maven.wagon.StreamWagon.getIfNewer(StreamWagon.java:88)
 at org.apache.maven.wagon.StreamWagon.get(StreamWagon.java:61)
 at org.eclipse.aether.transport.wagon.WagonTransporter$GetTaskRunner.run(WagonTransporter.java:569)
 at org.eclipse.aether.transport.wagon.WagonTransporter.execute(WagonTransporter.java:436)
 at org.eclipse.aether.transport.wagon.WagonTransporter.get(WagonTransporter.java:413)
 at org.eclipse.aether.connector.basic.BasicRepositoryConnector$GetTaskRunner.runTask(BasicRepositoryConnector.java:456)
 at org.eclipse.aether.connector.basic.BasicRepositoryConnector$TaskRunner.run(BasicRepositoryConnector.java:359)
 ... 36 more
Caused by: org.apache.maven.wagon.providers.http.httpclient.conn.HttpHostConnectException: Connect to repository.apache.org:80 [repository.apache.org/207.244.88.140] failed: Connection timed out: connect
 at org.apache.maven.wagon.providers.http.httpclient.impl.conn.DefaultHttpClientConnectionOperator.connect(DefaultHttpClientConnectionOperator.java:158)
 at org.apache.maven.wagon.providers.http.httpclient.impl.conn.PoolingHttpClientConnectionManager.connect(PoolingHttpClientConnectionManager.java:353)
 at org.apache.maven.wagon.providers.http.httpclient.impl.execchain.MainClientExec.establishRoute(MainClientExec.java:380)
 at org.apache.maven.wagon.providers.http.httpclient.impl.execchain.MainClientExec.execute(MainClientExec.java:236)
 at org.apache.maven.wagon.providers.http.httpclient.impl.execchain.ProtocolExec.execute(ProtocolExec.java:184)
 at org.apache.maven.wagon.providers.http.httpclient.impl.execchain.RetryExec.execute(RetryExec.java:88)
 at org.apache.maven.wagon.providers.http.httpclient.impl.execchain.RedirectExec.execute(RedirectExec.java:110)
 at org.apache.maven.wagon.providers.http.httpclient.impl.client.InternalHttpClient.doExecute(InternalHttpClient.java:184)
 at org.apache.maven.wagon.providers.http.httpclient.impl.client.CloseableHttpClient.execute(CloseableHttpClient.java:82)
 at org.apache.maven.wagon.providers.http.AbstractHttpClientWagon.execute(AbstractHttpClientWagon.java:834)
 at org.apache.maven.wagon.providers.http.AbstractHttpClientWagon.fillInputData(AbstractHttpClientWagon.java:985)
 ... 45 more
Caused by: java.net.ConnectException: Connection timed out: connect
 at java.base/java.net.DualStackPlainSocketImpl.connect0(Native Method)
 at java.base/java.net.DualStackPlainSocketImpl.socketConnect(DualStackPlainSocketImpl.java:79)
 at java.base/java.net.AbstractPlainSocketImpl.doConnect(AbstractPlainSocketImpl.java:400)
 at java.base/java.net.AbstractPlainSocketImpl.connectToAddress(AbstractPlainSocketImpl.java:243)
 at java.base/java.net.AbstractPlainSocketImpl.connect(AbstractPlainSocketImpl.java:225)
 at java.base/java.net.PlainSocketImpl.connect(PlainSocketImpl.java:148)
 at java.base/java.net.SocksSocketImpl.connect(SocksSocketImpl.java:402)
 at java.base/java.net.Socket.connect(Socket.java:591)
 at org.apache.maven.wagon.providers.http.httpclient.conn.socket.PlainConnectionSocketFactory.connectSocket(PlainConnectionSocketFactory.java:74)
 at org.apache.maven.wagon.providers.http.httpclient.impl.conn.DefaultHttpClientConnectionOperator.connect(DefaultHttpClientConnectionOperator.java:141)
 ... 55 more
[ERROR]   
[ERROR]   The project org.apache.maven.plugin.rresource.it.mrr41:child-2:[unknown-version] (F:\jenkins\jenkins-slave\workspace\rces-plugin_MRRESOURCES-104-LGCBGPPUNLUBE2DYS4XSK7TMPVBNNKKJD5CX73QOJHAO4AO3H5JA@2\m\target\test-classes\run-only-at-execution-root\child2\pom.xml) has 1 error
[ERROR]     Non-resolvable parent POM for org.apache.maven.plugin.rresource.it.mrr41:parent:[unknown-version]: Failure to transfer org.apache.maven.plugin.rresource.it:it-parent:pom:1.6-SNAPSHOT from http://repository.apache.org/snapshots/ was cached in the local repository, resolution will not be reattempted until the update interval of apache-snapshots has elapsed or updates are forced. Original error: Could not transfer artifact org.apache.maven.plugin.rresource.it:it-parent:pom:1.6-SNAPSHOT from/to apache-snapshots (http://repository.apache.org/snapshots/): Connect to repository.apache.org:80 [repository.apache.org/207.244.88.140] failed: Connection timed out: connect and 'parent.relativePath' points at wrong local POM @ org.apache.maven.plugin.rresource.it.mrr41:parent:[unknown-version], F:\jenkins\jenkins-slave\workspace\rces-plugin_MRRESOURCES-104-LGCBGPPUNLUBE2DYS4XSK7TMPVBNNKKJD5CX73QOJHAO4AO3H5JA@2\m\target\test-classes\run-only-at-execution-root\pom.xml, line 24, column 11 -> [Help 2]
org.apache.maven.model.resolution.UnresolvableModelException: Failure to transfer org.apache.maven.plugin.rresource.it:it-parent:pom:1.6-SNAPSHOT from http://repository.apache.org/snapshots/ was cached in the local repository, resolution will not be reattempted until the update interval of apache-snapshots has elapsed or updates are forced. Original error: Could not transfer artifact org.apache.maven.plugin.rresource.it:it-parent:pom:1.6-SNAPSHOT from/to apache-snapshots (http://repository.apache.org/snapshots/): Connect to repository.apache.org:80 [repository.apache.org/207.244.88.140] failed: Connection timed out: connect
 at org.apache.maven.project.ProjectModelResolver.resolveModel(ProjectModelResolver.java:197)
 at org.apache.maven.project.ProjectModelResolver.resolveModel(ProjectModelResolver.java:243)
 at org.apache.maven.model.building.DefaultModelBuilder.readParentExternally(DefaultModelBuilder.java:1051)
 at org.apache.maven.model.building.DefaultModelBuilder.readParent(DefaultModelBuilder.java:851)
 at org.apache.maven.model.building.DefaultModelBuilder.build(DefaultModelBuilder.java:331)
 at org.apache.maven.project.DefaultProjectBuilder.build(DefaultProjectBuilder.java:429)
 at org.apache.maven.project.DefaultProjectBuilder.build(DefaultProjectBuilder.java:398)
 at org.apache.maven.project.DefaultProjectBuilder.build(DefaultProjectBuilder.java:515)
 at org.apache.maven.project.DefaultProjectBuilder.build(DefaultProjectBuilder.java:398)
 at org.apache.maven.project.DefaultProjectBuilder.build(DefaultProjectBuilder.java:361)
 at org.apache.maven.graph.DefaultGraphBuilder.collectProjects(DefaultGraphBuilder.java:400)
 at org.apache.maven.graph.DefaultGraphBuilder.getProjectsForMavenReactor(DefaultGraphBuilder.java:391)
 at org.apache.maven.graph.DefaultGraphBuilder.build(DefaultGraphBuilder.java:78)
 at org.apache.maven.DefaultMaven.buildGraph(DefaultMaven.java:511)
 at org.apache.maven.DefaultMaven.doExecute(DefaultMaven.java:221)
 at org.apache.maven.DefaultMaven.doExecute(DefaultMaven.java:194)
 at org.apache.maven.DefaultMaven.execute(DefaultMaven.java:107)
 at org.apache.maven.cli.MavenCli.execute(MavenCli.java:993)
 at org.apache.maven.cli.MavenCli.doMain(MavenCli.java:345)
 at org.apache.maven.cli.MavenCli.main(MavenCli.java:191)
 at java.base/jdk.internal.reflect.NativeMethodAccessorImpl.invoke0(Native Method)
 at java.base/jdk.internal.reflect.NativeMethodAccessorImpl.invoke(NativeMethodAccessorImpl.java:62)
 at java.base/jdk.internal.reflect.DelegatingMethodAccessorImpl.invoke(DelegatingMethodAccessorImpl.java:43)
 at java.base/java.lang.reflect.Method.invoke(Method.java:564)
 at org.codehaus.plexus.classworlds.launcher.Launcher.launchEnhanced(Launcher.java:289)
 at org.codehaus.plexus.classworlds.launcher.Launcher.launch(Launcher.java:229)
 at org.codehaus.plexus.classworlds.launcher.Launcher.mainWithExitCode(Launcher.java:415)
 at org.codehaus.plexus.classworlds.launcher.Launcher.main(Launcher.java:356)
Caused by: org.eclipse.aether.resolution.ArtifactResolutionException: Failure to transfer org.apache.maven.plugin.rresource.it:it-parent:pom:1.6-SNAPSHOT from http://repository.apache.org/snapshots/ was cached in the local repository, resolution will not be reattempted until the update interval of apache-snapshots has elapsed or updates are forced. Original error: Could not transfer artifact org.apache.maven.plugin.rresource.it:it-parent:pom:1.6-SNAPSHOT from/to apache-snapshots (http://repository.apache.org/snapshots/): Connect to repository.apache.org:80 [repository.apache.org/207.244.88.140] failed: Connection timed out: connect
 at org.eclipse.aether.internal.impl.DefaultArtifactResolver.resolve(DefaultArtifactResolver.java:453)
 at org.eclipse.aether.internal.impl.DefaultArtifactResolver.resolveArtifacts(DefaultArtifactResolver.java:255)
 at org.eclipse.aether.internal.impl.DefaultArtifactResolver.resolveArtifact(DefaultArtifactResolver.java:232)
 at org.eclipse.aether.internal.impl.DefaultRepositorySystem.resolveArtifact(DefaultRepositorySystem.java:303)
 at org.apache.maven.project.ProjectModelResolver.resolveModel(ProjectModelResolver.java:193)
 ... 27 more
Caused by: org.eclipse.aether.transfer.ArtifactTransferException: Failure to transfer org.apache.maven.plugin.rresource.it:it-parent:pom:1.6-SNAPSHOT from http://repository.apache.org/snapshots/ was cached in the local repository, resolution will not be reattempted until the update interval of apache-snapshots has elapsed or updates are forced. Original error: Could not transfer artifact org.apache.maven.plugin.rresource.it:it-parent:pom:1.6-SNAPSHOT from/to apache-snapshots (http://repository.apache.org/snapshots/): Connect to repository.apache.org:80 [repository.apache.org/207.244.88.140] failed: Connection timed out: connect
 at org.eclipse.aether.internal.impl.DefaultUpdateCheckManager.newException(DefaultUpdateCheckManager.java:247)
 at org.eclipse.aether.internal.impl.DefaultUpdateCheckManager.checkArtifact(DefaultUpdateCheckManager.java:192)
 at org.eclipse.aether.internal.impl.DefaultArtifactResolver.gatherDownloads(DefaultArtifactResolver.java:594)
 at org.eclipse.aether.internal.impl.DefaultArtifactResolver.performDownloads(DefaultArtifactResolver.java:512)
 at org.eclipse.aether.internal.impl.DefaultArtifactResolver.resolve(DefaultArtifactResolver.java:430)
 ... 31 more
[ERROR] 
[ERROR] Re-run Maven using the -X switch to enable full debug logging.
[ERROR] 
[ERROR] For more information about the errors and possible solutions, please read the following articles:
[ERROR] [Help 1] http://cwiki.apache.org/confluence/display/MAVEN/ProjectBuildingException
[ERROR] [Help 2] http://cwiki.apache.org/confluence/display/MAVEN/UnresolvableModelException


Stack Trace:
org.apache.maven.it.VerificationException: 
Exit code was non-zero: 1; command line and log = 
F:\jenkins\tools\maven\apache-maven-3.5.0\bin\mvn -e --batch-mode -Dmaven.repo.local=f:\jenkins\jenkins-slave\workspace\rces-plugin_MRRESOURCES-104-LGCBGPPUNLUBE2DYS4XSK7TMPVBNNKKJD5CX73QOJHAO4AO3H5JA@2\m\target/it-repo org.apache.maven.plugins:maven-clean-plugin:clean generate-resources
Picked up JAVA_TOOL_OPTIONS: -Dmaven.ext.class.path="f:\jenkins\jenkins-slave\workspace\rces-plugin_MRRESOURCES-104-LGCBGPPUNLUBE2DYS4XSK7TMPVBNNKKJD5CX73QOJHAO4AO3H5JA@2@tmp\withMaven76b8dc64\pipeline-maven-spy.jar" -Dorg.jenkinsci.plugins.pipeline.maven.reportsFolder="f:\jenkins\jenkins-slave\workspace\rces-plugin_MRRESOURCES-104-LGCBGPPUNLUBE2DYS4XSK7TMPVBNNKKJD5CX73QOJHAO4AO3H5JA@2@tmp\withMaven76b8dc64" 
[INFO] [jenkins-event-spy] Jenkins Maven Event Spy is disabled
[INFO] Error stacktraces are turned on.
[INFO] Scanning for projects...
[INFO] Downloading: http://repository.apache.org/snapshots/org/apache/maven/plugin/rresource/it/it-parent/1.6-SNAPSHOT/maven-metadata.xml
[WARNING] Could not transfer metadata org.apache.maven.plugin.rresource.it:it-parent:1.6-SNAPSHOT/maven-metadata.xml from/to apache-snapshots (http://repository.apache.org/snapshots/): Connect to repository.apache.org:80 [repository.apache.org/207.244.88.140] failed: Connection timed out: connect
[INFO] Downloading: http://repository.apache.org/snapshots/org/apache/maven/plugin/rresource/it/it-parent/1.6-SNAPSHOT/it-parent-1.6-SNAPSHOT.pom
[ERROR] [ERROR] Some problems were encountered while processing the POMs:
[FATAL] Non-resolvable parent POM for org.apache.maven.plugin.rresource.it.mrr41:parent:[unknown-version]: Could not transfer artifact org.apache.maven.plugin.rresource.it:it-parent:pom:1.6-SNAPSHOT from/to apache-snapshots (http://repository.apache.org/snapshots/): Connect to repository.apache.org:80 [repository.apache.org/207.244.88.140] failed: Connection timed out: connect and 'parent.relativePath' points at wrong local POM @ org.apache.maven.plugin.rresource.it.mrr41:parent:[unknown-version], F:\jenkins\jenkins-slave\workspace\rces-plugin_MRRESOURCES-104-LGCBGPPUNLUBE2DYS4XSK7TMPVBNNKKJD5CX73QOJHAO4AO3H5JA@2\m\target\test-classes\run-only-at-execution-root\pom.xml, line 24, column 11
[FATAL] Non-resolvable parent POM for org.apache.maven.plugin.rresource.it.mrr41:parent:[unknown-version]: Failure to transfer org.apache.maven.plugin.rresource.it:it-parent:pom:1.6-SNAPSHOT from http://repository.apache.org/snapshots/ was cached in the local repository, resolution will not be reattempted until the update interval of apache-snapshots has elapsed or updates are forced. Original error: Could not transfer artifact org.apache.maven.plugin.rresource.it:it-parent:pom:1.6-SNAPSHOT from/to apache-snapshots (http://repository.apache.org/snapshots/): Connect to repository.apache.org:80 [repository.apache.org/207.244.88.140] failed: Connection timed out: connect and 'parent.relativePath' points at wrong local POM @ org.apache.maven.plugin.rresource.it.mrr41:parent:[unknown-version], F:\jenkins\jenkins-slave\workspace\rces-plugin_MRRESOURCES-104-LGCBGPPUNLUBE2DYS4XSK7TMPVBNNKKJD5CX73QOJHAO4AO3H5JA@2\m\target\test-classes\run-only-at-execution-root\pom.xml, line 24, column 11
 @ 
[ERROR] The build could not read 2 projects -> [Help 1]
org.apache.maven.project.ProjectBuildingException: Some problems were encountered while processing the POMs:
[FATAL] Non-resolvable parent POM for org.apache.maven.plugin.rresource.it.mrr41:parent:[unknown-version]: Could not transfer artifact org.apache.maven.plugin.rresource.it:it-parent:pom:1.6-SNAPSHOT from/to apache-snapshots (http://repository.apache.org/snapshots/): Connect to repository.apache.org:80 [repository.apache.org/207.244.88.140] failed: Connection timed out: connect and 'parent.relativePath' points at wrong local POM @ org.apache.maven.plugin.rresource.it.mrr41:parent:[unknown-version], F:\jenkins\jenkins-slave\workspace\rces-plugin_MRRESOURCES-104-LGCBGPPUNLUBE2DYS4XSK7TMPVBNNKKJD5CX73QOJHAO4AO3H5JA@2\m\target\test-classes\run-only-at-execution-root\pom.xml, line 24, column 11
[FATAL] Non-resolvable parent POM for org.apache.maven.plugin.rresource.it.mrr41:parent:[unknown-version]: Failure to transfer org.apache.maven.plugin.rresource.it:it-parent:pom:1.6-SNAPSHOT from http://repository.apache.org/snapshots/ was cached in the local repository, resolution will not be reattempted until the update interval of apache-snapshots has elapsed or updates are forced. Original error: Could not transfer artifact org.apache.maven.plugin.rresource.it:it-parent:pom:1.6-SNAPSHOT from/to apache-snapshots (http://repository.apache.org/snapshots/): Connect to repository.apache.org:80 [repository.apache.org/207.244.88.140] failed: Connection timed out: connect and 'parent.relativePath' points at wrong local POM @ org.apache.maven.plugin.rresource.it.mrr41:parent:[unknown-version], F:\jenkins\jenkins-slave\workspace\rces-plugin_MRRESOURCES-104-LGCBGPPUNLUBE2DYS4XSK7TMPVBNNKKJD5CX73QOJHAO4AO3H5JA@2\m\target\test-classes\run-only-at-execution-root\pom.xml, line 24, column 11

	at org.apache.maven.project.DefaultProjectBuilder.build(DefaultProjectBuilder.java:382)
	at org.apache.maven.graph.DefaultGraphBuilder.collectProjects(DefaultGraphBuilder.java:400)
	at org.apache.maven.graph.DefaultGraphBuilder.getProjectsForMavenReactor(DefaultGraphBuilder.java:391)
	at org.apache.maven.graph.DefaultGraphBuilder.build(DefaultGraphBuilder.java:78)
	at org.apache.maven.DefaultMaven.buildGraph(DefaultMaven.java:511)
	at org.apache.maven.DefaultMaven.doExecute(DefaultMaven.java:221)
	at org.apache.maven.DefaultMaven.doExecute(DefaultMaven.java:194)
	at org.apache.maven.DefaultMaven.execute(DefaultMaven.java:107)
	at org.apache.maven.cli.MavenCli.execute(MavenCli.java:993)
	at org.apache.maven.cli.MavenCli.doMain(MavenCli.java:345)
	at org.apache.maven.cli.MavenCli.main(MavenCli.java:191)
	at java.base/jdk.internal.reflect.NativeMethodAccessorImpl.invoke0(Native Method)
	at java.base/jdk.internal.reflect.NativeMethodAccessorImpl.invoke(NativeMethodAccessorImpl.java:62)
	at java.base/jdk.internal.reflect.DelegatingMethodAccessorImpl.invoke(DelegatingMethodAccessorImpl.java:43)
	at java.base/java.lang.reflect.Method.invoke(Method.java:564)
	at org.codehaus.plexus.classworlds.launcher.Launcher.launchEnhanced(Launcher.java:289)
	at org.codehaus.plexus.classworlds.launcher.Launcher.launch(Launcher.java:229)
	at org.codehaus.plexus.classworlds.launcher.Launcher.mainWithExitCode(Launcher.java:415)
	at org.codehaus.plexus.classworlds.launcher.Launcher.main(Launcher.java:356)
[ERROR]   
[ERROR]   The project org.apache.maven.plugin.rresource.it.mrr41:child-1:[unknown-version] (F:\jenkins\jenkins-slave\workspace\rces-plugin_MRRESOURCES-104-LGCBGPPUNLUBE2DYS4XSK7TMPVBNNKKJD5CX73QOJHAO4AO3H5JA@2\m\target\test-classes\run-only-at-execution-root\child1\pom.xml) has 1 error
[ERROR]     Non-resolvable parent POM for org.apache.maven.plugin.rresource.it.mrr41:parent:[unknown-version]: Could not transfer artifact org.apache.maven.plugin.rresource.it:it-parent:pom:1.6-SNAPSHOT from/to apache-snapshots (http://repository.apache.org/snapshots/): Connect to repository.apache.org:80 [repository.apache.org/207.244.88.140] failed: Connection timed out: connect and 'parent.relativePath' points at wrong local POM @ org.apache.maven.plugin.rresource.it.mrr41:parent:[unknown-version], F:\jenkins\jenkins-slave\workspace\rces-plugin_MRRESOURCES-104-LGCBGPPUNLUBE2DYS4XSK7TMPVBNNKKJD5CX73QOJHAO4AO3H5JA@2\m\target\test-classes\run-only-at-execution-root\pom.xml, line 24, column 11 -> [Help 2]
org.apache.maven.model.resolution.UnresolvableModelException: Could not transfer artifact org.apache.maven.plugin.rresource.it:it-parent:pom:1.6-SNAPSHOT from/to apache-snapshots (http://repository.apache.org/snapshots/): Connect to repository.apache.org:80 [repository.apache.org/207.244.88.140] failed: Connection timed out: connect
	at org.apache.maven.project.ProjectModelResolver.resolveModel(ProjectModelResolver.java:197)
	at org.apache.maven.project.ProjectModelResolver.resolveModel(ProjectModelResolver.java:243)
	at org.apache.maven.model.building.DefaultModelBuilder.readParentExternally(DefaultModelBuilder.java:1051)
	at org.apache.maven.model.building.DefaultModelBuilder.readParent(DefaultModelBuilder.java:851)
	at org.apache.maven.model.building.DefaultModelBuilder.build(DefaultModelBuilder.java:331)
	at org.apache.maven.project.DefaultProjectBuilder.build(DefaultProjectBuilder.java:429)
	at org.apache.maven.project.DefaultProjectBuilder.build(DefaultProjectBuilder.java:398)
	at org.apache.maven.project.DefaultProjectBuilder.build(DefaultProjectBuilder.java:515)
	at org.apache.maven.project.DefaultProjectBuilder.build(DefaultProjectBuilder.java:398)
	at org.apache.maven.project.DefaultProjectBuilder.build(DefaultProjectBuilder.java:361)
	at org.apache.maven.graph.DefaultGraphBuilder.collectProjects(DefaultGraphBuilder.java:400)
	at org.apache.maven.graph.DefaultGraphBuilder.getProjectsForMavenReactor(DefaultGraphBuilder.java:391)
	at org.apache.maven.graph.DefaultGraphBuilder.build(DefaultGraphBuilder.java:78)
	at org.apache.maven.DefaultMaven.buildGraph(DefaultMaven.java:511)
	at org.apache.maven.DefaultMaven.doExecute(DefaultMaven.java:221)
	at org.apache.maven.DefaultMaven.doExecute(DefaultMaven.java:194)
	at org.apache.maven.DefaultMaven.execute(DefaultMaven.java:107)
	at org.apache.maven.cli.MavenCli.execute(MavenCli.java:993)
	at org.apache.maven.cli.MavenCli.doMain(MavenCli.java:345)
	at org.apache.maven.cli.MavenCli.main(MavenCli.java:191)
	at java.base/jdk.internal.reflect.NativeMethodAccessorImpl.invoke0(Native Method)
	at java.base/jdk.internal.reflect.NativeMethodAccessorImpl.invoke(NativeMethodAccessorImpl.java:62)
	at java.base/jdk.internal.reflect.DelegatingMethodAccessorImpl.invoke(DelegatingMethodAccessorImpl.java:43)
	at java.base/java.lang.reflect.Method.invoke(Method.java:564)
	at org.codehaus.plexus.classworlds.launcher.Launcher.launchEnhanced(Launcher.java:289)
	at org.codehaus.plexus.classworlds.launcher.Launcher.launch(Launcher.java:229)
	at org.codehaus.plexus.classworlds.launcher.Launcher.mainWithExitCode(Launcher.java:415)
	at org.codehaus.plexus.classworlds.launcher.Launcher.main(Launcher.java:356)
Caused by: org.eclipse.aether.resolution.ArtifactResolutionException: Could not transfer artifact org.apache.maven.plugin.rresource.it:it-parent:pom:1.6-SNAPSHOT from/to apache-snapshots (http://repository.apache.org/snapshots/): Connect to repository.apache.org:80 [repository.apache.org/207.244.88.140] failed: Connection timed out: connect
	at org.eclipse.aether.internal.impl.DefaultArtifactResolver.resolve(DefaultArtifactResolver.java:453)
	at org.eclipse.aether.internal.impl.DefaultArtifactResolver.resolveArtifacts(DefaultArtifactResolver.java:255)
	at org.eclipse.aether.internal.impl.DefaultArtifactResolver.resolveArtifact(DefaultArtifactResolver.java:232)
	at org.eclipse.aether.internal.impl.DefaultRepositorySystem.resolveArtifact(DefaultRepositorySystem.java:303)
	at org.apache.maven.project.ProjectModelResolver.resolveModel(ProjectModelResolver.java:193)
	... 27 more
Caused by: org.eclipse.aether.transfer.ArtifactTransferException: Could not transfer artifact org.apache.maven.plugin.rresource.it:it-parent:pom:1.6-SNAPSHOT from/to apache-snapshots (http://repository.apache.org/snapshots/): Connect to repository.apache.org:80 [repository.apache.org/207.244.88.140] failed: Connection timed out: connect
	at org.eclipse.aether.connector.basic.ArtifactTransportListener.transferFailed(ArtifactTransportListener.java:52)
	at org.eclipse.aether.connector.basic.BasicRepositoryConnector$TaskRunner.run(BasicRepositoryConnector.java:364)
	at org.eclipse.aether.util.concurrency.RunnableErrorForwarder$1.run(RunnableErrorForwarder.java:76)
	at org.eclipse.aether.connector.basic.BasicRepositoryConnector$DirectExecutor.execute(BasicRepositoryConnector.java:590)
	at org.eclipse.aether.connector.basic.BasicRepositoryConnector.get(BasicRepositoryConnector.java:258)
	at org.eclipse.aether.internal.impl.DefaultArtifactResolver.performDownloads(DefaultArtifactResolver.java:529)
	at org.eclipse.aether.internal.impl.DefaultArtifactResolver.resolve(DefaultArtifactResolver.java:430)
	... 31 more
Caused by: org.apache.maven.wagon.TransferFailedException: Connect to repository.apache.org:80 [repository.apache.org/207.244.88.140] failed: Connection timed out: connect
	at org.apache.maven.wagon.providers.http.AbstractHttpClientWagon.fillInputData(AbstractHttpClientWagon.java:1068)
	at org.apache.maven.wagon.providers.http.AbstractHttpClientWagon.fillInputData(AbstractHttpClientWagon.java:962)
	at org.apache.maven.wagon.StreamWagon.getInputStream(StreamWagon.java:126)
	at org.apache.maven.wagon.StreamWagon.getIfNewer(StreamWagon.java:88)
	at org.apache.maven.wagon.StreamWagon.get(StreamWagon.java:61)
	at org.eclipse.aether.transport.wagon.WagonTransporter$GetTaskRunner.run(WagonTransporter.java:569)
	at org.eclipse.aether.transport.wagon.WagonTransporter.execute(WagonTransporter.java:436)
	at org.eclipse.aether.transport.wagon.WagonTransporter.get(WagonTransporter.java:413)
	at org.eclipse.aether.connector.basic.BasicRepositoryConnector$GetTaskRunner.runTask(BasicRepositoryConnector.java:456)
	at org.eclipse.aether.connector.basic.BasicRepositoryConnector$TaskRunner.run(BasicRepositoryConnector.java:359)
	... 36 more
Caused by: org.apache.maven.wagon.providers.http.httpclient.conn.HttpHostConnectException: Connect to repository.apache.org:80 [repository.apache.org/207.244.88.140] failed: Connection timed out: connect
	at org.apache.maven.wagon.providers.http.httpclient.impl.conn.DefaultHttpClientConnectionOperator.connect(DefaultHttpClientConnectionOperator.java:158)
	at org.apache.maven.wagon.providers.http.httpclient.impl.conn.PoolingHttpClientConnectionManager.connect(PoolingHttpClientConnectionManager.java:353)
	at org.apache.maven.wagon.providers.http.httpclient.impl.execchain.MainClientExec.establishRoute(MainClientExec.java:380)
	at org.apache.maven.wagon.providers.http.httpclient.impl.execchain.MainClientExec.execute(MainClientExec.java:236)
	at org.apache.maven.wagon.providers.http.httpclient.impl.execchain.ProtocolExec.execute(ProtocolExec.java:184)
	at org.apache.maven.wagon.providers.http.httpclient.impl.execchain.RetryExec.execute(RetryExec.java:88)
	at org.apache.maven.wagon.providers.http.httpclient.impl.execchain.RedirectExec.execute(RedirectExec.java:110)
	at org.apache.maven.wagon.providers.http.httpclient.impl.client.InternalHttpClient.doExecute(InternalHttpClient.java:184)
	at org.apache.maven.wagon.providers.http.httpclient.impl.client.CloseableHttpClient.execute(CloseableHttpClient.java:82)
	at org.apache.maven.wagon.providers.http.AbstractHttpClientWagon.execute(AbstractHttpClientWagon.java:834)
	at org.apache.maven.wagon.providers.http.AbstractHttpClientWagon.fillInputData(AbstractHttpClientWagon.java:985)
	... 45 more
Caused by: java.net.ConnectException: Connection timed out: connect
	at java.base/java.net.DualStackPlainSocketImpl.connect0(Native Method)
	at java.base/java.net.DualStackPlainSocketImpl.socketConnect(DualStackPlainSocketImpl.java:79)
	at java.base/java.net.AbstractPlainSocketImpl.doConnect(AbstractPlainSocketImpl.java:400)
	at java.base/java.net.AbstractPlainSocketImpl.connectToAddress(AbstractPlainSocketImpl.java:243)
	at java.base/java.net.AbstractPlainSocketImpl.connect(AbstractPlainSocketImpl.java:225)
	at java.base/java.net.PlainSocketImpl.connect(PlainSocketImpl.java:148)
	at java.base/java.net.SocksSocketImpl.connect(SocksSocketImpl.java:402)
	at java.base/java.net.Socket.connect(Socket.java:591)
	at org.apache.maven.wagon.providers.http.httpclient.conn.socket.PlainConnectionSocketFactory.connectSocket(PlainConnectionSocketFactory.java:74)
	at org.apache.maven.wagon.providers.http.httpclient.impl.conn.DefaultHttpClientConnectionOperator.connect(DefaultHttpClientConnectionOperator.java:141)
	... 55 more
[ERROR]   
[ERROR]   The project org.apache.maven.plugin.rresource.it.mrr41:child-2:[unknown-version] (F:\jenkins\jenkins-slave\workspace\rces-plugin_MRRESOURCES-104-LGCBGPPUNLUBE2DYS4XSK7TMPVBNNKKJD5CX73QOJHAO4AO3H5JA@2\m\target\test-classes\run-only-at-execution-root\child2\pom.xml) has 1 error
[ERROR]     Non-resolvable parent POM for org.apache.maven.plugin.rresource.it.mrr41:parent:[unknown-version]: Failure to transfer org.apache.maven.plugin.rresource.it:it-parent:pom:1.6-SNAPSHOT from http://repository.apache.org/snapshots/ was cached in the local repository, resolution will not be reattempted until the update interval of apache-snapshots has elapsed or updates are forced. Original error: Could not transfer artifact org.apache.maven.plugin.rresource.it:it-parent:pom:1.6-SNAPSHOT from/to apache-snapshots (http://repository.apache.org/snapshots/): Connect to repository.apache.org:80 [repository.apache.org/207.244.88.140] failed: Connection timed out: connect and 'parent.relativePath' points at wrong local POM @ org.apache.maven.plugin.rresource.it.mrr41:parent:[unknown-version], F:\jenkins\jenkins-slave\workspace\rces-plugin_MRRESOURCES-104-LGCBGPPUNLUBE2DYS4XSK7TMPVBNNKKJD5CX73QOJHAO4AO3H5JA@2\m\target\test-classes\run-only-at-execution-root\pom.xml, line 24, column 11 -> [Help 2]
org.apache.maven.model.resolution.UnresolvableModelException: Failure to transfer org.apache.maven.plugin.rresource.it:it-parent:pom:1.6-SNAPSHOT from http://repository.apache.org/snapshots/ was cached in the local repository, resolution will not be reattempted until the update interval of apache-snapshots has elapsed or updates are forced. Original error: Could not transfer artifact org.apache.maven.plugin.rresource.it:it-parent:pom:1.6-SNAPSHOT from/to apache-snapshots (http://repository.apache.org/snapshots/): Connect to repository.apache.org:80 [repository.apache.org/207.244.88.140] failed: Connection timed out: connect
	at org.apache.maven.project.ProjectModelResolver.resolveModel(ProjectModelResolver.java:197)
	at org.apache.maven.project.ProjectModelResolver.resolveModel(ProjectModelResolver.java:243)
	at org.apache.maven.model.building.DefaultModelBuilder.readParentExternally(DefaultModelBuilder.java:1051)
	at org.apache.maven.model.building.DefaultModelBuilder.readParent(DefaultModelBuilder.java:851)
	at org.apache.maven.model.building.DefaultModelBuilder.build(DefaultModelBuilder.java:331)
	at org.apache.maven.project.DefaultProjectBuilder.build(DefaultProjectBuilder.java:429)
	at org.apache.maven.project.DefaultProjectBuilder.build(DefaultProjectBuilder.java:398)
	at org.apache.maven.project.DefaultProjectBuilder.build(DefaultProjectBuilder.java:515)
	at org.apache.maven.project.DefaultProjectBuilder.build(DefaultProjectBuilder.java:398)
	at org.apache.maven.project.DefaultProjectBuilder.build(DefaultProjectBuilder.java:361)
	at org.apache.maven.graph.DefaultGraphBuilder.collectProjects(DefaultGraphBuilder.java:400)
	at org.apache.maven.graph.DefaultGraphBuilder.getProjectsForMavenReactor(DefaultGraphBuilder.java:391)
	at org.apache.maven.graph.DefaultGraphBuilder.build(DefaultGraphBuilder.java:78)
	at org.apache.maven.DefaultMaven.buildGraph(DefaultMaven.java:511)
	at org.apache.maven.DefaultMaven.doExecute(DefaultMaven.java:221)
	at org.apache.maven.DefaultMaven.doExecute(DefaultMaven.java:194)
	at org.apache.maven.DefaultMaven.execute(DefaultMaven.java:107)
	at org.apache.maven.cli.MavenCli.execute(MavenCli.java:993)
	at org.apache.maven.cli.MavenCli.doMain(MavenCli.java:345)
	at org.apache.maven.cli.MavenCli.main(MavenCli.java:191)
	at java.base/jdk.internal.reflect.NativeMethodAccessorImpl.invoke0(Native Method)
	at java.base/jdk.internal.reflect.NativeMethodAccessorImpl.invoke(NativeMethodAccessorImpl.java:62)
	at java.base/jdk.internal.reflect.DelegatingMethodAccessorImpl.invoke(DelegatingMethodAccessorImpl.java:43)
	at java.base/java.lang.reflect.Method.invoke(Method.java:564)
	at org.codehaus.plexus.classworlds.launcher.Launcher.launchEnhanced(Launcher.java:289)
	at org.codehaus.plexus.classworlds.launcher.Launcher.launch(Launcher.java:229)
	at org.codehaus.plexus.classworlds.launcher.Launcher.mainWithExitCode(Launcher.java:415)
	at org.codehaus.plexus.classworlds.launcher.Launcher.main(Launcher.java:356)
Caused by: org.eclipse.aether.resolution.ArtifactResolutionException: Failure to transfer org.apache.maven.plugin.rresource.it:it-parent:pom:1.6-SNAPSHOT from http://repository.apache.org/snapshots/ was cached in the local repository, resolution will not be reattempted until the update interval of apache-snapshots has elapsed or updates are forced. Original error: Could not transfer artifact org.apache.maven.plugin.rresource.it:it-parent:pom:1.6-SNAPSHOT from/to apache-snapshots (http://repository.apache.org/snapshots/): Connect to repository.apache.org:80 [repository.apache.org/207.244.88.140] failed: Connection timed out: connect
	at org.eclipse.aether.internal.impl.DefaultArtifactResolver.resolve(DefaultArtifactResolver.java:453)
	at org.eclipse.aether.internal.impl.DefaultArtifactResolver.resolveArtifacts(DefaultArtifactResolver.java:255)
	at org.eclipse.aether.internal.impl.DefaultArtifactResolver.resolveArtifact(DefaultArtifactResolver.java:232)
	at org.eclipse.aether.internal.impl.DefaultRepositorySystem.resolveArtifact(DefaultRepositorySystem.java:303)
	at org.apache.maven.project.ProjectModelResolver.resolveModel(ProjectModelResolver.java:193)
	... 27 more
Caused by: org.eclipse.aether.transfer.ArtifactTransferException: Failure to transfer org.apache.maven.plugin.rresource.it:it-parent:pom:1.6-SNAPSHOT from http://repository.apache.org/snapshots/ was cached in the local repository, resolution will not be reattempted until the update interval of apache-snapshots has elapsed or updates are forced. Original error: Could not transfer artifact org.apache.maven.plugin.rresource.it:it-parent:pom:1.6-SNAPSHOT from/to apache-snapshots (http://repository.apache.org/snapshots/): Connect to repository.apache.org:80 [repository.apache.org/207.244.88.140] failed: Connection timed out: connect
	at org.eclipse.aether.internal.impl.DefaultUpdateCheckManager.newException(DefaultUpdateCheckManager.java:247)
	at org.eclipse.aether.internal.impl.DefaultUpdateCheckManager.checkArtifact(DefaultUpdateCheckManager.java:192)
	at org.eclipse.aether.internal.impl.DefaultArtifactResolver.gatherDownloads(DefaultArtifactResolver.java:594)
	at org.eclipse.aether.internal.impl.DefaultArtifactResolver.performDownloads(DefaultArtifactResolver.java:512)
	at org.eclipse.aether.internal.impl.DefaultArtifactResolver.resolve(DefaultArtifactResolver.java:430)
	... 31 more
[ERROR] 
[ERROR] Re-run Maven using the -X switch to enable full debug logging.
[ERROR] 
[ERROR] For more information about the errors and possible solutions, please read the following articles:
[ERROR] [Help 1] http://cwiki.apache.org/confluence/display/MAVEN/ProjectBuildingException
[ERROR] [Help 2] http://cwiki.apache.org/confluence/display/MAVEN/UnresolvableModelException

	at org.apache.maven.plugin.resources.remote.it.IT_RunOnlyAtExecutionRoot.test(IT_RunOnlyAtExecutionRoot.java:60)




Build log:
[...truncated 1.36 MB...]
[windows-jdk9] 	at org.apache.maven.graph.DefaultGraphBuilder.build(DefaultGraphBuilder.java:78)
[windows-jdk9] 	at org.apache.maven.DefaultMaven.buildGraph(DefaultMaven.java:511)
[windows-jdk9] 	at org.apache.maven.DefaultMaven.doExecute(DefaultMaven.java:221)
[windows-jdk9] 	at org.apache.maven.DefaultMaven.doExecute(DefaultMaven.java:194)
[windows-jdk9] 	at org.apache.maven.DefaultMaven.execute(DefaultMaven.java:107)
[windows-jdk9] 	at org.apache.maven.cli.MavenCli.execute(MavenCli.java:993)
[windows-jdk9] 	at org.apache.maven.cli.MavenCli.doMain(MavenCli.java:345)
[windows-jdk9] 	at org.apache.maven.cli.MavenCli.main(MavenCli.java:191)
[windows-jdk9] 	at java.base/jdk.internal.reflect.NativeMethodAccessorImpl.invoke0(Native Method)
[windows-jdk9] 	at java.base/jdk.internal.reflect.NativeMethodAccessorImpl.invoke(NativeMethodAccessorImpl.java:62)
[windows-jdk9] 	at java.base/jdk.internal.reflect.DelegatingMethodAccessorImpl.invoke(DelegatingMethodAccessorImpl.java:43)
[windows-jdk9] 	at java.base/java.lang.reflect.Method.invoke(Method.java:564)
[windows-jdk9] 	at org.codehaus.plexus.classworlds.launcher.Launcher.launchEnhanced(Launcher.java:289)
[windows-jdk9] 	at org.codehaus.plexus.classworlds.launcher.Launcher.launch(Launcher.java:229)
[windows-jdk9] 	at org.codehaus.plexus.classworlds.launcher.Launcher.mainWithExitCode(Launcher.java:415)
[windows-jdk9] 	at org.codehaus.plexus.classworlds.launcher.Launcher.main(Launcher.java:356)
[windows-jdk9] Caused by: org.eclipse.aether.resolution.ArtifactResolutionException: Failure to transfer org.apache.maven.plugin.rresource.it:it-parent:pom:1.6-SNAPSHOT from http://repository.apache.org/snapshots/ was cached in the local repository, resolution will not be reattempted until the update interval of apache-snapshots has elapsed or updates are forced. Original error: Could not transfer artifact org.apache.maven.plugin.rresource.it:it-parent:pom:1.6-SNAPSHOT from/to apache-snapshots (http://repository.apache.org/snapshots/): Connect to repository.apache.org:80 [repository.apache.org/207.244.88.140] failed: Connection timed out: connect
[windows-jdk9] 	at org.eclipse.aether.internal.impl.DefaultArtifactResolver.resolve(DefaultArtifactResolver.java:453)
[windows-jdk9] 	at org.eclipse.aether.internal.impl.DefaultArtifactResolver.resolveArtifacts(DefaultArtifactResolver.java:255)
[windows-jdk9] 	at org.eclipse.aether.internal.impl.DefaultArtifactResolver.resolveArtifact(DefaultArtifactResolver.java:232)
[windows-jdk9] 	at org.eclipse.aether.internal.impl.DefaultRepositorySystem.resolveArtifact(DefaultRepositorySystem.java:303)
[windows-jdk9] 	at org.apache.maven.project.ProjectModelResolver.resolveModel(ProjectModelResolver.java:193)
[windows-jdk9] 	... 27 more
[windows-jdk9] Caused by: org.eclipse.aether.transfer.ArtifactTransferException: Failure to transfer org.apache.maven.plugin.rresource.it:it-parent:pom:1.6-SNAPSHOT from http://repository.apache.org/snapshots/ was cached in the local repository, resolution will not be reattempted until the update interval of apache-snapshots has elapsed or updates are forced. Original error: Could not transfer artifact org.apache.maven.plugin.rresource.it:it-parent:pom:1.6-SNAPSHOT from/to apache-snapshots (http://repository.apache.org/snapshots/): Connect to repository.apache.org:80 [repository.apache.org/207.244.88.140] failed: Connection timed out: connect
[windows-jdk9] 	at org.eclipse.aether.internal.impl.DefaultUpdateCheckManager.newException(DefaultUpdateCheckManager.java:247)
[windows-jdk9] 	at org.eclipse.aether.internal.impl.DefaultUpdateCheckManager.checkArtifact(DefaultUpdateCheckManager.java:192)
[windows-jdk9] 	at org.eclipse.aether.internal.impl.DefaultArtifactResolver.gatherDownloads(DefaultArtifactResolver.java:594)
[windows-jdk9] 	at org.eclipse.aether.internal.impl.DefaultArtifactResolver.performDownloads(DefaultArtifactResolver.java:512)
[windows-jdk9] 	at org.eclipse.aether.internal.impl.DefaultArtifactResolver.resolve(DefaultArtifactResolver.java:430)
[windows-jdk9] 	... 31 more
[windows-jdk9] [ERROR] 
[windows-jdk9] [ERROR] Re-run Maven using the -X switch to enable full debug logging.
[windows-jdk9] [ERROR] 
[windows-jdk9] [ERROR] For more information about the errors and possible solutions, please read the following articles:
[windows-jdk9] [ERROR] [Help 1] http://cwiki.apache.org/confluence/display/MAVEN/ProjectBuildingException
[windows-jdk9] [ERROR] [Help 2] http://cwiki.apache.org/confluence/display/MAVEN/UnresolvableModelException
[windows-jdk9] 
[windows-jdk9] 	at org.apache.maven.plugin.resources.remote.it.IT_RunOnlyAtExecutionRoot.test(IT_RunOnlyAtExecutionRoot.java:60)
[windows-jdk9] 
[windows-jdk9] [INFO] Running org.apache.maven.plugin.resources.remote.it.IT_SupplementalArtifact
[windows-jdk10] [INFO] Tests run: 1, Failures: 0, Errors: 0, Skipped: 0, Time elapsed: 10.529 s - in org.apache.maven.plugin.resources.remote.it.IT_SupplementalArtifact
[windows-jdk10] [INFO] 
[windows-jdk10] [INFO] Results:
[windows-jdk10] [INFO] 
[windows-jdk10] [ERROR] Errors: 
[windows-jdk10] [ERROR]   IT_RunOnlyAtExecutionRoot.test:60 � Verification Exit code was non-zero: 1; co...
[windows-jdk10] [INFO] 
[windows-jdk10] [ERROR] Tests run: 9, Failures: 0, Errors: 1, Skipped: 0
[windows-jdk10] [INFO] 
[windows-jdk10] [INFO] 
[windows-jdk10] [INFO] --- maven-invoker-plugin:3.0.1:integration-test (integration-test) @ maven-remote-resources-plugin ---
[windows-jdk10] [INFO] Running Setup Jobs
[windows-jdk10] [INFO] Building: maven-remote-resources-test\pom.xml
[windows-jdk8] [INFO]           maven-remote-resources-test\pom.xml .............. SUCCESS (12.0 s)
[windows-jdk8] [INFO] 
[windows-jdk8] [INFO] --- maven-checkstyle-plugin:3.0.0:check (checkstyle-check) @ maven-remote-resources-plugin ---
[windows-jdk8] [INFO] 
[windows-jdk8] [INFO] --- maven-failsafe-plugin:2.21.0:verify (integration-tests) @ maven-remote-resources-plugin ---
[windows-jdk8] [ERROR] There are test failures.
[windows-jdk8] 
[windows-jdk8] Please refer to f:\jenkins\jenkins-slave\workspace\rces-plugin_MRRESOURCES-104-LGCBGPPUNLUBE2DYS4XSK7TMPVBNNKKJD5CX73QOJHAO4AO3H5JA\m\target\failsafe-reports for the individual test results.
[windows-jdk8] Please refer to dump files (if any exist) [date]-jvmRun[N].dump, [date].dumpstream and [date]-jvmRun[N].dumpstream.
[windows-jdk8] [INFO] 
[windows-jdk8] [INFO] --- maven-invoker-plugin:3.0.1:verify (integration-test) @ maven-remote-resources-plugin ---
[windows-jdk8] [INFO] -------------------------------------------------
[windows-jdk8] [INFO] Build Summary:
[windows-jdk8] [INFO]   Passed: 1, Failed: 0, Errors: 0, Skipped: 0
[windows-jdk8] [INFO] -------------------------------------------------
[windows-jdk8] [INFO] ------------------------------------------------------------------------
[windows-jdk8] [INFO] BUILD SUCCESS
[windows-jdk8] [INFO] ------------------------------------------------------------------------
[windows-jdk8] [INFO] Total time: 03:06 min
[windows-jdk8] [INFO] Finished at: 2018-04-07T22:25:46Z
[windows-jdk8] [INFO] Final Memory: 49M/870M
[windows-jdk8] [INFO] ------------------------------------------------------------------------
[windows-jdk8] [INFO] [jenkins-event-spy] Generated F:\jenkins\jenkins-slave\workspace\rces-plugin_MRRESOURCES-104-LGCBGPPUNLUBE2DYS4XSK7TMPVBNNKKJD5CX73QOJHAO4AO3H5JA@tmp\withMaven6e368b62\maven-spy-20180407-222239-8063988257016757102860.log
[windows-jdk8] Picked up JAVA_TOOL_OPTIONS: -Dmaven.ext.class.path="f:\jenkins\jenkins-slave\workspace\rces-plugin_MRRESOURCES-104-LGCBGPPUNLUBE2DYS4XSK7TMPVBNNKKJD5CX73QOJHAO4AO3H5JA@tmp\withMaven6e368b62\pipeline-maven-spy.jar" -Dorg.jenkinsci.plugins.pipeline.maven.reportsFolder="f:\jenkins\jenkins-slave\workspace\rces-plugin_MRRESOURCES-104-LGCBGPPUNLUBE2DYS4XSK7TMPVBNNKKJD5CX73QOJHAO4AO3H5JA@tmp\withMaven6e368b62" 
[windows-jdk9] [INFO] Tests run: 1, Failures: 0, Errors: 0, Skipped: 0, Time elapsed: 12.731 s - in org.apache.maven.plugin.resources.remote.it.IT_SupplementalArtifact
[windows-jdk9] [INFO] 
[windows-jdk9] [INFO] Results:
[windows-jdk9] [INFO] 
[windows-jdk9] [ERROR] Errors: 
[windows-jdk9] [ERROR]   IT_RunOnlyAtExecutionRoot.test:60 � Verification Exit code was non-zero: 1; co...
[windows-jdk9] [INFO] 
[windows-jdk9] [ERROR] Tests run: 9, Failures: 0, Errors: 1, Skipped: 0
[windows-jdk9] [INFO] 
[windows-jdk9] [INFO] 
[windows-jdk9] [INFO] --- maven-invoker-plugin:3.0.1:integration-test (integration-test) @ maven-remote-resources-plugin ---
[windows-jdk9] [INFO] Running Setup Jobs
[windows-jdk9] [INFO] Building: maven-remote-resources-test\pom.xml
[Pipeline] [windows-jdk8] }
[Pipeline] [windows-jdk8] // dir
[Pipeline] [windows-jdk8] }
[windows-jdk8] [withMaven] junitPublisher - Archive test results for Maven artifact org.apache.maven.plugins:maven-remote-resources-plugin:1.6-SNAPSHOT generated by maven-surefire-plugin:test (default-test): m\target\surefire-reports\*.xml
[windows-jdk8] [withMaven] junitPublisher - Jenkins JUnit Attachments Plugin not found, can't publish test attachments.Recording test results
[windows-jdk8] [withMaven] junitPublisher - Archive test results for Maven artifact org.apache.maven.plugins:maven-remote-resources-plugin:1.6-SNAPSHOT generated by maven-failsafe-plugin:integration-test (integration-tests): m\target\failsafe-reports\*.xml
[windows-jdk8] [withMaven] junitPublisher - Jenkins JUnit Attachments Plugin not found, can't publish test attachments.Recording test results
[Pipeline] [windows-jdk8] // withMaven
[Pipeline] [windows-jdk8] }
[Pipeline] [windows-jdk8] // stage
[Pipeline] [windows-jdk8] }
[Pipeline] [windows-jdk8] // node
[Pipeline] [windows-jdk8] }
[windows-jdk10] [INFO]           maven-remote-resources-test\pom.xml .............. SUCCESS (9.3 s)
[windows-jdk10] [INFO] 
[windows-jdk10] [INFO] --- maven-checkstyle-plugin:3.0.0:check (checkstyle-check) @ maven-remote-resources-plugin ---
[windows-jdk10] [INFO] 
[windows-jdk10] [INFO] --- maven-failsafe-plugin:2.21.0:verify (integration-tests) @ maven-remote-resources-plugin ---
[windows-jdk10] [ERROR] There are test failures.
[windows-jdk10] 
[windows-jdk10] Please refer to f:\jenkins\jenkins-slave\workspace\rces-plugin_MRRESOURCES-104-LGCBGPPUNLUBE2DYS4XSK7TMPVBNNKKJD5CX73QOJHAO4AO3H5JA\m\target\failsafe-reports for the individual test results.
[windows-jdk10] Please refer to dump files (if any exist) [date]-jvmRun[N].dump, [date].dumpstream and [date]-jvmRun[N].dumpstream.
[windows-jdk10] [INFO] 
[windows-jdk10] [INFO] --- maven-invoker-plugin:3.0.1:verify (integration-test) @ maven-remote-resources-plugin ---
[windows-jdk10] [INFO] -------------------------------------------------
[windows-jdk10] [INFO] Build Summary:
[windows-jdk10] [INFO]   Passed: 1, Failed: 0, Errors: 0, Skipped: 0
[windows-jdk10] [INFO] -------------------------------------------------
[windows-jdk10] [INFO] ------------------------------------------------------------------------
[windows-jdk10] [INFO] BUILD SUCCESS
[windows-jdk10] [INFO] ------------------------------------------------------------------------
[windows-jdk10] [INFO] Total time: 02:35 min
[windows-jdk10] [INFO] Finished at: 2018-04-07T22:25:51Z
[windows-jdk10] [INFO] Final Memory: 40M/144M
[windows-jdk10] [INFO] ------------------------------------------------------------------------
[windows-jdk10] [INFO] [jenkins-event-spy] Generated F:\jenkins\jenkins-slave\workspace\rces-plugin_MRRESOURCES-104-LGCBGPPUNLUBE2DYS4XSK7TMPVBNNKKJD5CX73QOJHAO4AO3H5JA@tmp\withMaven60baf391\maven-spy-20180407-222314-91412791743886785327530.log
[Pipeline] [windows-jdk10] }
[Pipeline] [windows-jdk10] // dir
[Pipeline] [windows-jdk10] }
[windows-jdk10] [withMaven] junitPublisher - Archive test results for Maven artifact org.apache.maven.plugins:maven-remote-resources-plugin:1.6-SNAPSHOT generated by maven-surefire-plugin:test (default-test): m\target\surefire-reports\*.xml
[windows-jdk10] [withMaven] junitPublisher - Jenkins JUnit Attachments Plugin not found, can't publish test attachments.Recording test results
[windows-jdk10] [withMaven] junitPublisher - Archive test results for Maven artifact org.apache.maven.plugins:maven-remote-resources-plugin:1.6-SNAPSHOT generated by maven-failsafe-plugin:integration-test (integration-tests): m\target\failsafe-reports\*.xml
[windows-jdk10] [withMaven] junitPublisher - Jenkins JUnit Attachments Plugin not found, can't publish test attachments.Recording test results
[Pipeline] [windows-jdk10] // withMaven
[Pipeline] [windows-jdk10] }
[Pipeline] [windows-jdk10] // stage
[Pipeline] [windows-jdk10] }
[Pipeline] [windows-jdk10] // node
[Pipeline] [windows-jdk10] }
[windows-jdk9] [INFO]           maven-remote-resources-test\pom.xml .............. SUCCESS (10.4 s)
[windows-jdk9] [INFO] 
[windows-jdk9] [INFO] --- maven-checkstyle-plugin:3.0.0:check (checkstyle-check) @ maven-remote-resources-plugin ---
[windows-jdk9] [INFO] Downloading: https://repo.maven.apache.org/maven2/org/apache/maven/shared/maven-shared-resources/2/maven-shared-resources-2.pom
[windows-jdk9] [INFO] Downloaded: https://repo.maven.apache.org/maven2/org/apache/maven/shared/maven-shared-resources/2/maven-shared-resources-2.pom (3.0 kB at 328 kB/s)
[windows-jdk9] [INFO] Downloading: https://repo.maven.apache.org/maven2/org/codehaus/plexus/plexus-utils/3.0.10/plexus-utils-3.0.10.pom
[windows-jdk9] [INFO] Downloaded: https://repo.maven.apache.org/maven2/org/codehaus/plexus/plexus-utils/3.0.10/plexus-utils-3.0.10.pom (3.1 kB at 393 kB/s)
[windows-jdk9] [INFO] Downloading: https://repo.maven.apache.org/maven2/org/codehaus/plexus/plexus/3.3/plexus-3.3.pom
[windows-jdk9] [INFO] Downloaded: https://repo.maven.apache.org/maven2/org/codehaus/plexus/plexus/3.3/plexus-3.3.pom (20 kB at 2.0 MB/s)
[windows-jdk9] [INFO] Downloading: https://repo.maven.apache.org/maven2/org/apache/maven/doxia/doxia-integration-tools/1.6/doxia-integration-tools-1.6.pom
[windows-jdk9] [INFO] Downloaded: https://repo.maven.apache.org/maven2/org/apache/maven/doxia/doxia-integration-tools/1.6/doxia-integration-tools-1.6.pom (7.0 kB at 870 kB/s)
[windows-jdk9] [INFO] Downloading: https://repo.maven.apache.org/maven2/org/apache/maven/doxia/doxia-tools/3/doxia-tools-3.pom
[windows-jdk9] [INFO] Downloaded: https://repo.maven.apache.org/maven2/org/apache/maven/doxia/doxia-tools/3/doxia-tools-3.pom (9.9 kB at 1.2 MB/s)
[windows-jdk9] [INFO] Downloading: https://repo.maven.apache.org/maven2/org/codehaus/plexus/plexus-resources/1.1.0/plexus-resources-1.1.0.pom
[windows-jdk9] [INFO] Downloaded: https://repo.maven.apache.org/maven2/org/codehaus/plexus/plexus-resources/1.1.0/plexus-resources-1.1.0.pom (3.2 kB at 138 kB/s)
[windows-jdk9] [INFO] Downloading: https://repo.maven.apache.org/maven2/com/puppycrawl/tools/checkstyle/6.18/checkstyle-6.18.pom
[windows-jdk9] [INFO] Downloaded: https://repo.maven.apache.org/maven2/com/puppycrawl/tools/checkstyle/6.18/checkstyle-6.18.pom (71 kB at 6.5 MB/s)
[windows-jdk9] [INFO] Downloading: https://repo.maven.apache.org/maven2/antlr/antlr/2.7.7/antlr-2.7.7.pom
[windows-jdk9] [INFO] Downloaded: https://repo.maven.apache.org/maven2/antlr/antlr/2.7.7/antlr-2.7.7.pom (632 B at 90 kB/s)
[windows-jdk9] [INFO] Downloading: https://repo.maven.apache.org/maven2/org/antlr/antlr4-runtime/4.5.3/antlr4-runtime-4.5.3.pom
[windows-jdk9] [INFO] Downloaded: https://repo.maven.apache.org/maven2/org/antlr/antlr4-runtime/4.5.3/antlr4-runtime-4.5.3.pom (2.3 kB at 289 kB/s)
[windows-jdk9] [INFO] Downloading: https://repo.maven.apache.org/maven2/org/antlr/antlr4-master/4.5.3/antlr4-master-4.5.3.pom
[windows-jdk9] [INFO] Downloaded: https://repo.maven.apache.org/maven2/org/antlr/antlr4-master/4.5.3/antlr4-master-4.5.3.pom (3.7 kB at 460 kB/s)
[windows-jdk9] [INFO] Downloading: https://repo.maven.apache.org/maven2/commons-beanutils/commons-beanutils/1.9.2/commons-beanutils-1.9.2.pom
[windows-jdk9] [INFO] Downloaded: https://repo.maven.apache.org/maven2/commons-beanutils/commons-beanutils/1.9.2/commons-beanutils-1.9.2.pom (14 kB at 2.0 MB/s)
[windows-jdk9] [INFO] Downloading: https://repo.maven.apache.org/maven2/org/apache/commons/commons-parent/33/commons-parent-33.pom
[windows-jdk9] [INFO] Downloaded: https://repo.maven.apache.org/maven2/org/apache/commons/commons-parent/33/commons-parent-33.pom (53 kB at 4.4 MB/s)
[windows-jdk9] [INFO] Downloading: https://repo.maven.apache.org/maven2/commons-cli/commons-cli/1.3.1/commons-cli-1.3.1.pom
[windows-jdk9] [INFO] Downloaded: https://repo.maven.apache.org/maven2/commons-cli/commons-cli/1.3.1/commons-cli-1.3.1.pom (10 kB at 1.3 MB/s)
[windows-jdk9] [INFO] Downloading: https://repo.maven.apache.org/maven2/com/google/guava/guava/19.0/guava-19.0.pom
[windows-jdk9] [INFO] Downloaded: https://repo.maven.apache.org/maven2/com/google/guava/guava/19.0/guava-19.0.pom (6.8 kB at 849 kB/s)
[windows-jdk9] [INFO] Downloading: https://repo.maven.apache.org/maven2/com/google/guava/guava-parent/19.0/guava-parent-19.0.pom
[windows-jdk9] [INFO] Downloaded: https://repo.maven.apache.org/maven2/com/google/guava/guava-parent/19.0/guava-parent-19.0.pom (9.9 kB at 1.2 MB/s)
[windows-jdk9] [INFO] Downloading: https://repo.maven.apache.org/maven2/org/sonatype/oss/oss-parent/7/oss-parent-7.pom
[windows-jdk9] [INFO] Downloaded: https://repo.maven.apache.org/maven2/org/sonatype/oss/oss-parent/7/oss-parent-7.pom (4.8 kB at 689 kB/s)
[windows-jdk9] [INFO] Downloading: https://repo.maven.apache.org/maven2/javax/xml/bind/jaxb-api/2.3.0/jaxb-api-2.3.0.pom
[windows-jdk9] [INFO] Downloaded: https://repo.maven.apache.org/maven2/javax/xml/bind/jaxb-api/2.3.0/jaxb-api-2.3.0.pom (23 kB at 2.6 MB/s)
[windows-jdk9] [INFO] Downloading: https://repo.maven.apache.org/maven2/javax/xml/bind/jaxb-api-parent/2.3.0/jaxb-api-parent-2.3.0.pom
[windows-jdk9] [INFO] Downloaded: https://repo.maven.apache.org/maven2/javax/xml/bind/jaxb-api-parent/2.3.0/jaxb-api-parent-2.3.0.pom (5.6 kB at 806 kB/s)
[windows-jdk9] [INFO] Downloading: https://repo.maven.apache.org/maven2/net/java/jvnet-parent/5/jvnet-parent-5.pom
[windows-jdk9] [INFO] Downloaded: https://repo.maven.apache.org/maven2/net/java/jvnet-parent/5/jvnet-parent-5.pom (8.9 kB at 1.3 MB/s)
[windows-jdk9] [INFO] Downloading: https://repo.maven.apache.org/maven2/org/apache/maven/shared/maven-shared-resources/2/maven-shared-resources-2.jar
[windows-jdk9] [INFO] Downloading: https://repo.maven.apache.org/maven2/org/apache/maven/doxia/doxia-core/1.2/doxia-core-1.2.jar
[windows-jdk9] [INFO] Downloading: https://repo.maven.apache.org/maven2/commons-logging/commons-logging/1.0.4/commons-logging-1.0.4.jar
[windows-jdk9] [INFO] Downloading: https://repo.maven.apache.org/maven2/commons-digester/commons-digester/1.6/commons-digester-1.6.jar
[windows-jdk9] [INFO] Downloading: https://repo.maven.apache.org/maven2/org/apache/maven/doxia/doxia-integration-tools/1.6/doxia-integration-tools-1.6.jar
[windows-jdk9] [INFO] Downloaded: https://repo.maven.apache.org/maven2/commons-logging/commons-logging/1.0.4/commons-logging-1.0.4.jar (38 kB at 2.7 MB/s)
[windows-jdk9] [INFO] Downloading: https://repo.maven.apache.org/maven2/commons-io/commons-io/1.4/commons-io-1.4.jar
[windows-jdk9] [INFO] Downloaded: https://repo.maven.apache.org/maven2/org/apache/maven/shared/maven-shared-resources/2/maven-shared-resources-2.jar (13 kB at 687 kB/s)
[windows-jdk9] [INFO] Downloading: https://repo.maven.apache.org/maven2/org/codehaus/plexus/plexus-resources/1.1.0/plexus-resources-1.1.0.jar
[windows-jdk9] [INFO] Downloaded: https://repo.maven.apache.org/maven2/org/apache/maven/doxia/doxia-core/1.2/doxia-core-1.2.jar (154 kB at 7.7 MB/s)
[windows-jdk9] [INFO] Downloading: https://repo.maven.apache.org/maven2/com/puppycrawl/tools/checkstyle/6.18/checkstyle-6.18.jar
[windows-jdk9] [INFO] Downloaded: https://repo.maven.apache.org/maven2/org/apache/maven/doxia/doxia-integration-tools/1.6/doxia-integration-tools-1.6.jar (45 kB at 2.2 MB/s)
[windows-jdk9] [INFO] Downloading: https://repo.maven.apache.org/maven2/antlr/antlr/2.7.7/antlr-2.7.7.jar
[windows-jdk9] [INFO] Downloaded: https://repo.maven.apache.org/maven2/commons-digester/commons-digester/1.6/commons-digester-1.6.jar (168 kB at 6.7 MB/s)
[windows-jdk9] [INFO] Downloading: https://repo.maven.apache.org/maven2/org/antlr/antlr4-runtime/4.5.3/antlr4-runtime-4.5.3.jar
[windows-jdk9] [INFO] Downloaded: https://repo.maven.apache.org/maven2/commons-io/commons-io/1.4/commons-io-1.4.jar (109 kB at 3.6 MB/s)
[windows-jdk9] [INFO] Downloading: https://repo.maven.apache.org/maven2/commons-beanutils/commons-beanutils/1.9.2/commons-beanutils-1.9.2.jar
[windows-jdk9] [INFO] Downloaded: https://repo.maven.apache.org/maven2/org/codehaus/plexus/plexus-resources/1.1.0/plexus-resources-1.1.0.jar (23 kB at 725 kB/s)
[windows-jdk9] [INFO] Downloading: https://repo.maven.apache.org/maven2/commons-cli/commons-cli/1.3.1/commons-cli-1.3.1.jar
[windows-jdk9] [INFO] Downloaded: https://repo.maven.apache.org/maven2/org/antlr/antlr4-runtime/4.5.3/antlr4-runtime-4.5.3.jar (302 kB at 6.2 MB/s)
[windows-jdk9] [INFO] Downloading: https://repo.maven.apache.org/maven2/com/google/guava/guava/19.0/guava-19.0.jar
[windows-jdk9] [INFO] Downloaded: https://repo.maven.apache.org/maven2/commons-cli/commons-cli/1.3.1/commons-cli-1.3.1.jar (53 kB at 1.1 MB/s)
[windows-jdk9] [INFO] Downloading: https://repo.maven.apache.org/maven2/commons-lang/commons-lang/2.1/commons-lang-2.1.jar
[windows-jdk9] [INFO] Downloaded: https://repo.maven.apache.org/maven2/commons-beanutils/commons-beanutils/1.9.2/commons-beanutils-1.9.2.jar (234 kB at 4.7 MB/s)
[windows-jdk9] [INFO] Downloading: https://repo.maven.apache.org/maven2/javax/xml/bind/jaxb-api/2.3.0/jaxb-api-2.3.0.jar
[windows-jdk9] [INFO] Downloaded: https://repo.maven.apache.org/maven2/antlr/antlr/2.7.7/antlr-2.7.7.jar (445 kB at 8.6 MB/s)
[windows-jdk9] [INFO] Downloaded: https://repo.maven.apache.org/maven2/javax/xml/bind/jaxb-api/2.3.0/jaxb-api-2.3.0.jar (126 kB at 2.0 MB/s)
[windows-jdk9] [INFO] Downloaded: https://repo.maven.apache.org/maven2/commons-lang/commons-lang/2.1/commons-lang-2.1.jar (208 kB at 3.2 MB/s)
[windows-jdk9] [INFO] Downloaded: https://repo.maven.apache.org/maven2/com/puppycrawl/tools/checkstyle/6.18/checkstyle-6.18.jar (1.2 MB at 16 MB/s)
[windows-jdk9] [INFO] Downloaded: https://repo.maven.apache.org/maven2/com/google/guava/guava/19.0/guava-19.0.jar (2.3 MB at 20 MB/s)
[windows-jdk9] [INFO] 
[windows-jdk9] [INFO] --- maven-failsafe-plugin:2.21.0:verify (integration-tests) @ maven-remote-resources-plugin ---
[windows-jdk9] [ERROR] There are test failures.
[windows-jdk9] 
[windows-jdk9] Please refer to f:\jenkins\jenkins-slave\workspace\rces-plugin_MRRESOURCES-104-LGCBGPPUNLUBE2DYS4XSK7TMPVBNNKKJD5CX73QOJHAO4AO3H5JA@2\m\target\failsafe-reports for the individual test results.
[windows-jdk9] Please refer to dump files (if any exist) [date]-jvmRun[N].dump, [date].dumpstream and [date]-jvmRun[N].dumpstream.
[windows-jdk9] [INFO] 
[windows-jdk9] [INFO] --- maven-invoker-plugin:3.0.1:verify (integration-test) @ maven-remote-resources-plugin ---
[windows-jdk9] [INFO] -------------------------------------------------
[windows-jdk9] [INFO] Build Summary:
[windows-jdk9] [INFO]   Passed: 1, Failed: 0, Errors: 0, Skipped: 0
[windows-jdk9] [INFO] -------------------------------------------------
[windows-jdk9] [INFO] ------------------------------------------------------------------------
[windows-jdk9] [INFO] BUILD SUCCESS
[windows-jdk9] [INFO] ------------------------------------------------------------------------
[windows-jdk9] [INFO] Total time: 03:09 min
[windows-jdk9] [INFO] Finished at: 2018-04-07T22:25:58Z
[windows-jdk9] [INFO] Final Memory: 48M/161M
[windows-jdk9] [INFO] ------------------------------------------------------------------------
[windows-jdk9] [INFO] [jenkins-event-spy] Generated F:\jenkins\jenkins-slave\workspace\rces-plugin_MRRESOURCES-104-LGCBGPPUNLUBE2DYS4XSK7TMPVBNNKKJD5CX73QOJHAO4AO3H5JA@2@tmp\withMaven76b8dc64\maven-spy-20180407-222248-88514155208380121692456.log
[Pipeline] [windows-jdk9] }
[Pipeline] [windows-jdk9] // dir
[Pipeline] [windows-jdk9] }
[windows-jdk9] [withMaven] junitPublisher - Archive test results for Maven artifact org.apache.maven.plugins:maven-remote-resources-plugin:1.6-SNAPSHOT generated by maven-surefire-plugin:test (default-test): m\target\surefire-reports\*.xml
[windows-jdk9] [withMaven] junitPublisher - Jenkins JUnit Attachments Plugin not found, can't publish test attachments.Recording test results
[windows-jdk9] [withMaven] junitPublisher - Archive test results for Maven artifact org.apache.maven.plugins:maven-remote-resources-plugin:1.6-SNAPSHOT generated by maven-failsafe-plugin:integration-test (integration-tests): m\target\failsafe-reports\*.xml
[windows-jdk9] [withMaven] junitPublisher - Jenkins JUnit Attachments Plugin not found, can't publish test attachments.Recording test results
[Pipeline] [windows-jdk9] // withMaven
[Pipeline] [windows-jdk9] }
[Pipeline] [windows-jdk9] // stage
[Pipeline] [windows-jdk9] }
[Pipeline] [windows-jdk9] // node
[Pipeline] [windows-jdk9] }
[Pipeline] // parallel
[Pipeline] stage
[Pipeline] { (Notifications)
[Pipeline] echo
Build result: UNSTABLE
[Pipeline] jiraIssueSelector
Mime
  • Unnamed multipart/mixed (inline, None, 0 bytes)
View raw message