maven-notifications mailing list archives

Site index · List index
Message view « Date » · « Thread »
Top « Date » · « Thread »
From Apache Jenkins Server <jenk...@builds.apache.org>
Subject Build failed in Jenkins: Maven TLP » maven-compiler-plugin » TEST_TO_FIX_MCOMPILER-192 #6
Date Sun, 25 Mar 2018 17:21:10 GMT
See https://builds.apache.org/job/maven-box/job/maven-compiler-plugin/job/TEST_TO_FIX_MCOMPILER-192/6/

Changes:

* Added some tests.
* Added some tests.
* Added some tests.
* Added some tests.

All tests passed

Build log:
[...truncated 461.02 KB...]
[linux-jdk7] [INFO] Building: MCOMPILER-190/pom.xml
[linux-jdk9] [INFO]           automodules-transitive-module/pom.xml ............ SUCCESS (3.9
s)
[linux-jdk9] [INFO] Building: MCOMPILER-268_modulepath/pom.xml
[windows-jdk9] [INFO] run post-build script verify.groovy
[windows-jdk9] [INFO]           mcompiler-120\pom.xml ............................ SUCCESS
(6.9 s)
[windows-jdk9] [INFO] Building: MCOMPILER-129\pom.xml
[Pipeline] [linux-jdk8] }
[linux-jdk8] [withMaven] junitPublisher - Archive test results for Maven artifact org.apache.maven.plugins:maven-compiler-plugin:3.7.1-SNAPSHOT
generated by maven-surefire-plugin:test (default-test): m/target/surefire-reports/*.xml
[linux-jdk8] [withMaven] junitPublisher - Jenkins JUnit Attachments Plugin not found, can't
publish test attachments.Recording test results
[Pipeline] [linux-jdk8] // withMaven
[Pipeline] [linux-jdk8] }
[Pipeline] [linux-jdk8] // stage
[Pipeline] [linux-jdk8] }
[Pipeline] [linux-jdk8] // node
[Pipeline] [linux-jdk8] }
[windows-jdk7] [INFO] run post-build script verify.groovy
[windows-jdk7] [INFO]           mcompiler-21_class-remove\pom.xml ................ SUCCESS
(11.1 s)
[windows-jdk7] [INFO] Building: mcompiler-21_methodname-change\pom.xml
[windows-jdk8] [INFO] run post-build script verify.groovy
[windows-jdk8] [INFO]           mcompiler-21_class-remove\pom.xml ................ SUCCESS
(10.4 s)
[windows-jdk8] [INFO] Building: mcompiler-21_methodname-change\pom.xml
[linux-jdk9] [INFO] run post-build script verify.groovy
[linux-jdk9] [INFO]           MCOMPILER-268_modulepath/pom.xml ................. SUCCESS (4.9
s)
[linux-jdk9] [INFO] Building: non-english-warnings/pom.xml
[linux-jdk7] [INFO]           MCOMPILER-190/pom.xml ............................ SUCCESS (4.8
s)
[linux-jdk7] [INFO] Building: MCOMPILER-294/pom.xml
[linux-jdk7] [INFO]           MCOMPILER-294/pom.xml ............................ SKIPPED due
to JRE version
[linux-jdk7] [INFO] Building: automodules-application/pom.xml
[linux-jdk7] [INFO]           automodules-application/pom.xml .................. SKIPPED due
to JRE version
[linux-jdk7] [INFO] 
[linux-jdk7] [INFO] --- maven-checkstyle-plugin:3.0.0:check (checkstyle-check) @ maven-compiler-plugin
---
[windows-jdk9] [INFO]           MCOMPILER-129\pom.xml ............................ SUCCESS
(5.2 s)
[windows-jdk9] [INFO] Building: mcompiler-135\pom.xml
[linux-jdk7] [INFO] There is 1 error reported by Checkstyle 6.18 with config/maven_checks.xml
ruleset.
[linux-jdk7] [INFO] Ignored 1 error, 0 violation remaining.
[linux-jdk7] [INFO] 
[linux-jdk7] [INFO] --- maven-invoker-plugin:3.0.1:verify (integration-test) @ maven-compiler-plugin
---
[linux-jdk7] [INFO] -------------------------------------------------
[linux-jdk7] [INFO] Build Summary:
[linux-jdk7] [INFO]   Passed: 24, Failed: 0, Errors: 0, Skipped: 19
[linux-jdk7] [INFO] -------------------------------------------------
[linux-jdk7] [INFO] ------------------------------------------------------------------------
[linux-jdk7] [INFO] BUILD SUCCESS
[linux-jdk7] [INFO] ------------------------------------------------------------------------
[linux-jdk7] [INFO] Total time: 02:33 min
[linux-jdk7] [INFO] Finished at: 2018-03-25T17:20:28Z
[linux-jdk7] [INFO] Final Memory: 71M/2602M
[linux-jdk7] [INFO] ------------------------------------------------------------------------
[linux-jdk7] [INFO] [jenkins-event-spy] Generated /home/jenkins/jenkins-slave/workspace/n_TEST_TO_FIX_MCOMPILER-192-EJZ35UAEPCX3IH57D2YA4NCSBBIRCVCD4L4Y7IFGSVZP6VXNNVFA@tmp/withMavena7d2ddc7/maven-spy-20180325-171755-3861674161585382186234.log
[Pipeline] [linux-jdk7] }
[Pipeline] [linux-jdk7] // dir
[linux-jdk9] [INFO] run post-build script verify.bsh
[linux-jdk9] [INFO]           non-english-warnings/pom.xml ..................... SUCCESS (3.7
s)
[linux-jdk9] [INFO] Building: mcompiler-21_class-remove/pom.xml
[Pipeline] [linux-jdk7] }
[linux-jdk7] [withMaven] artifactsPublisher - Archive artifact m/pom.xml under org/apache/maven/plugins/maven-compiler-plugin/3.7.1-SNAPSHOT/maven-compiler-plugin-3.7.1-SNAPSHOT.pom
[linux-jdk7] [withMaven] artifactsPublisher - Archive artifact m/target/maven-compiler-plugin-3.7.1-SNAPSHOT.jar
under org/apache/maven/plugins/maven-compiler-plugin/3.7.1-SNAPSHOT/maven-compiler-plugin-3.7.1-SNAPSHOT.jar
[linux-jdk7] [Fast Archiver] No prior successful build to compare, so performing full copy
of artifacts
[linux-jdk7] [withMaven] junitPublisher - Archive test results for Maven artifact org.apache.maven.plugins:maven-compiler-plugin:3.7.1-SNAPSHOT
generated by maven-surefire-plugin:test (default-test): m/target/surefire-reports/*.xml
[linux-jdk7] [withMaven] junitPublisher - Jenkins JUnit Attachments Plugin not found, can't
publish test attachments.Recording test results
[linux-jdk7] [withMaven] openTasksPublisher - Scan Tasks for Maven artifact org.apache.maven.plugins:maven-compiler-plugin:3.7.1-SNAPSHOT
in source directory m/src/main/java
[linux-jdk7] [TASKS] Scanning folder '/home/jenkins/jenkins-slave/workspace/n_TEST_TO_FIX_MCOMPILER-192-EJZ35UAEPCX3IH57D2YA4NCSBBIRCVCD4L4Y7IFGSVZP6VXNNVFA'
for files matching the pattern 'm/src/main/java/**/*' - excludes: null
[linux-jdk7] [TASKS] Found 9 files to scan for tasks
[linux-jdk7] [TASKS] Found 7 open tasks.
[linux-jdk7] Skipping warnings blame since pipelines do not have an SCM link.%n
[Pipeline] [linux-jdk7] // withMaven
[Pipeline] [linux-jdk7] }
[Pipeline] [linux-jdk7] // stage
[Pipeline] [linux-jdk7] }
[Pipeline] [linux-jdk7] // node
[Pipeline] [linux-jdk7] }
[windows-jdk9] [INFO]           mcompiler-135\pom.xml ............................ SUCCESS
(5.3 s)
[windows-jdk9] [INFO] Building: MCOMPILER-157\pom.xml
[windows-jdk7] [INFO] run post-build script verify.groovy
[windows-jdk7] [INFO]           mcompiler-21_methodname-change\pom.xml ........... SUCCESS
(11.4 s)
[windows-jdk7] [INFO] Building: MCOMPILER-224\pom.xml
[windows-jdk8] [INFO] run post-build script verify.groovy
[windows-jdk8] [INFO]           mcompiler-21_methodname-change\pom.xml ........... SUCCESS
(10.4 s)
[windows-jdk8] [INFO] Building: MCOMPILER-224\pom.xml
[windows-jdk7] [INFO] run post-build script verify.groovy
[windows-jdk7] [INFO]           MCOMPILER-224\pom.xml ............................ SUCCESS
(4.0 s)
[windows-jdk7] [INFO] Building: MCOMPILER-228\pom.xml
[windows-jdk7] [INFO]           MCOMPILER-228\pom.xml ............................ SKIPPED
due to JRE version
[windows-jdk7] [INFO] Building: MCOMPILER-260_customArguments\pom.xml
[windows-jdk8] [INFO] run post-build script verify.groovy
[windows-jdk8] [INFO]           MCOMPILER-224\pom.xml ............................ SUCCESS
(4.0 s)
[windows-jdk8] [INFO] Building: MCOMPILER-228\pom.xml
[windows-jdk7] [INFO]           MCOMPILER-260_customArguments\pom.xml ............ SUCCESS
(3.4 s)
[windows-jdk7] [INFO] Building: MCOMPILER-268_modulepath\pom.xml
[windows-jdk7] [INFO]           MCOMPILER-268_modulepath\pom.xml ................. SKIPPED
due to JRE version
[windows-jdk7] [INFO] Building: MCOMPILER-270_release\pom.xml
[windows-jdk7] [INFO]           MCOMPILER-270_release\pom.xml .................... SKIPPED
due to JRE version
[windows-jdk7] [INFO] Building: MCOMPILER-275_separate-moduleinfo\pom.xml
[windows-jdk7] [INFO]           MCOMPILER-275_separate-moduleinfo\pom.xml ........ SKIPPED
due to JRE version
[windows-jdk7] [INFO] Building: MCOMPILER-284\pom.xml
[linux-jdk9] [INFO] run post-build script verify.groovy
[linux-jdk9] [INFO]           mcompiler-21_class-remove/pom.xml ................ SUCCESS (11.5
s)
[linux-jdk9] [INFO] Building: MCOMPILER-270_release/pom.xml
[windows-jdk9] [INFO]           MCOMPILER-157\pom.xml ............................ SUCCESS
(9.6 s)
[windows-jdk9] [INFO] Building: MCOMPILER-170\pom.xml
[windows-jdk8] [INFO]           MCOMPILER-228\pom.xml ............................ SUCCESS
(3.3 s)
[windows-jdk8] [INFO] Building: MCOMPILER-260_customArguments\pom.xml
[windows-jdk7] [INFO] run post-build script verify.bsh
[windows-jdk7] [INFO]           MCOMPILER-284\pom.xml ............................ SUCCESS
(3.4 s)
[windows-jdk7] [INFO] Building: MCOMPILER-294\pom.xml
[windows-jdk7] [INFO]           MCOMPILER-294\pom.xml ............................ SKIPPED
due to JRE version
[windows-jdk7] [INFO] Building: MCOMPILER-298\pom.xml
[windows-jdk7] [INFO]           MCOMPILER-298\pom.xml ............................ SKIPPED
due to JRE version
[windows-jdk7] [INFO] Building: MCOMPILER-322_release10\pom.xml
[windows-jdk7] [INFO]           MCOMPILER-322_release10\pom.xml .................. SKIPPED
due to JRE version
[windows-jdk7] [INFO] Building: non-english-warnings\pom.xml
[linux-jdk9] [INFO] run post-build script verify.groovy
[linux-jdk9] [INFO]           MCOMPILER-270_release/pom.xml .................... SUCCESS (3.6
s)
[linux-jdk9] [INFO] Building: automodules-manifest/pom.xml
[windows-jdk8] [INFO]           MCOMPILER-260_customArguments\pom.xml ............ SUCCESS
(3.6 s)
[windows-jdk8] [INFO] Building: MCOMPILER-268_modulepath\pom.xml
[windows-jdk8] [INFO]           MCOMPILER-268_modulepath\pom.xml ................. SKIPPED
due to JRE version
[windows-jdk8] [INFO] Building: MCOMPILER-270_release\pom.xml
[windows-jdk8] [INFO]           MCOMPILER-270_release\pom.xml .................... SKIPPED
due to JRE version
[windows-jdk8] [INFO] Building: MCOMPILER-275_separate-moduleinfo\pom.xml
[windows-jdk8] [INFO]           MCOMPILER-275_separate-moduleinfo\pom.xml ........ SKIPPED
due to JRE version
[windows-jdk8] [INFO] Building: MCOMPILER-284\pom.xml
[windows-jdk9] [INFO]           MCOMPILER-170\pom.xml ............................ SUCCESS
(5.5 s)
[windows-jdk9] [INFO] Building: mcompiler-179\pom.xml
[linux-jdk9] [INFO] run post-build script verify.groovy
[linux-jdk9] [INFO]           automodules-manifest/pom.xml ..................... SUCCESS (3.7
s)
[linux-jdk9] [INFO] Building: MCOMPILER-170/pom.xml
[windows-jdk7] [INFO] run post-build script verify.bsh
[windows-jdk7] [INFO]           non-english-warnings\pom.xml ..................... SUCCESS
(3.6 s)
[windows-jdk7] [INFO] Building: test1\pom.xml
[windows-jdk8] [INFO] run post-build script verify.bsh
[windows-jdk8] [INFO]           MCOMPILER-284\pom.xml ............................ SUCCESS
(2.7 s)
[windows-jdk8] [INFO] Building: MCOMPILER-294\pom.xml
[windows-jdk8] [INFO]           MCOMPILER-294\pom.xml ............................ SKIPPED
due to JRE version
[windows-jdk8] [INFO] Building: MCOMPILER-298\pom.xml
[windows-jdk7] [INFO]           test1\pom.xml .................................... SUCCESS
(3.7 s)
[windows-jdk7] [INFO] 
[windows-jdk7] [INFO] --- maven-checkstyle-plugin:3.0.0:check (checkstyle-check) @ maven-compiler-plugin
---
[windows-jdk7] [INFO] There is 1 error reported by Checkstyle 6.18 with config/maven_checks.xml
ruleset.
[windows-jdk7] [INFO] Ignored 1 error, 0 violation remaining.
[windows-jdk7] [INFO] 
[windows-jdk7] [INFO] --- maven-invoker-plugin:3.0.1:verify (integration-test) @ maven-compiler-plugin
---
[windows-jdk7] [INFO] -------------------------------------------------
[windows-jdk7] [INFO] Build Summary:
[windows-jdk7] [INFO]   Passed: 23, Failed: 1, Errors: 0, Skipped: 19
[windows-jdk7] [INFO] -------------------------------------------------
[windows-jdk7] [ERROR] The following builds failed:
[windows-jdk7] [ERROR] *  MCOMPILER-192\pom.xml
[windows-jdk7] [INFO] -------------------------------------------------
[windows-jdk7] [INFO] ------------------------------------------------------------------------
[windows-jdk7] [INFO] BUILD FAILURE
[windows-jdk7] [INFO] ------------------------------------------------------------------------
[windows-jdk7] [INFO] Total time: 02:51 min
[windows-jdk7] [INFO] Finished at: 2018-03-25T17:20:54Z
[windows-jdk9] [INFO] run post-build script verify.groovy
[windows-jdk9] [INFO]           mcompiler-179\pom.xml ............................ SUCCESS
(4.6 s)
[windows-jdk9] [INFO] Building: mcompiler-182\pom.xml
[linux-jdk9] [INFO]           MCOMPILER-170/pom.xml ............................ SUCCESS (3.8
s)
[linux-jdk9] [INFO] Building: mcompiler-120/pom.xml
[windows-jdk7] [INFO] Final Memory: 135M/1230M
[windows-jdk7] [INFO] ------------------------------------------------------------------------
[windows-jdk7] [INFO] [jenkins-event-spy] Generated F:\jenkins\jenkins-slave\workspace\n_TEST_TO_FIX_MCOMPILER-192-EJZ35UAEPCX3IH57D2YA4NCSBBIRCVCD4L4Y7IFGSVZP6VXNNVFA@tmp\withMaven9edf1bce\maven-spy-20180325-171802-3964585184785300611103.log
[windows-jdk7] [ERROR] Failed to execute goal org.apache.maven.plugins:maven-invoker-plugin:3.0.1:verify
(integration-test) on project maven-compiler-plugin: 1 build failed. See console output above
for details. -> [Help 1]
[windows-jdk7] [ERROR] 
[windows-jdk7] [ERROR] To see the full stack trace of the errors, re-run Maven with the -e
switch.
[windows-jdk7] [ERROR] Re-run Maven using the -X switch to enable full debug logging.
[windows-jdk7] [ERROR] 
[windows-jdk7] [ERROR] For more information about the errors and possible solutions, please
read the following articles:
[windows-jdk7] [ERROR] [Help 1] http://cwiki.apache.org/confluence/display/MAVEN/MojoFailureException
[windows-jdk7] Picked up JAVA_TOOL_OPTIONS: -Dmaven.ext.class.path="f:\jenkins\jenkins-slave\workspace\n_TEST_TO_FIX_MCOMPILER-192-EJZ35UAEPCX3IH57D2YA4NCSBBIRCVCD4L4Y7IFGSVZP6VXNNVFA@tmp\withMaven9edf1bce\pipeline-maven-spy.jar"
-Dorg.jenkinsci.plugins.pipeline.maven.reportsFolder="f:\jenkins\jenkins-slave\workspace\n_TEST_TO_FIX_MCOMPILER-192-EJZ35UAEPCX3IH57D2YA4NCSBBIRCVCD4L4Y7IFGSVZP6VXNNVFA@tmp\withMaven9edf1bce"

[Pipeline] [windows-jdk7] }
[Pipeline] [windows-jdk7] // dir
[windows-jdk8] [INFO]           MCOMPILER-298\pom.xml ............................ SUCCESS
(7.3 s)
[windows-jdk8] [INFO] Building: MCOMPILER-322_release10\pom.xml
[windows-jdk8] [INFO]           MCOMPILER-322_release10\pom.xml .................. SKIPPED
due to JRE version
[windows-jdk8] [INFO] Building: non-english-warnings\pom.xml
[linux-jdk9] [INFO] run post-build script verify.groovy
[linux-jdk9] [INFO]           mcompiler-120/pom.xml ............................ SUCCESS (5.0
s)
[linux-jdk9] [INFO] Building: MCOMPILER-203-processorpath/pom.xml
[Pipeline] [windows-jdk7] }
[windows-jdk7] [withMaven] junitPublisher - Archive test results for Maven artifact org.apache.maven.plugins:maven-compiler-plugin:3.7.1-SNAPSHOT
generated by maven-surefire-plugin:test (default-test): m\target\surefire-reports\*.xml
[windows-jdk7] [withMaven] junitPublisher - Jenkins JUnit Attachments Plugin not found, can't
publish test attachments.Recording test results
[Pipeline] [windows-jdk7] // withMaven
[Pipeline] [windows-jdk7] echo
[windows-jdk7] [FAIL FAST] This is the first failure and likely root cause
[Pipeline] [windows-jdk7] }
[Pipeline] [windows-jdk7] // stage
[Pipeline] [windows-jdk7] }
[Pipeline] [windows-jdk7] // node
[Pipeline] [windows-jdk7] }
[windows-jdk7] Failed in branch windows-jdk7
[windows-jdk8] [INFO] run post-build script verify.bsh
[windows-jdk8] [INFO]           non-english-warnings\pom.xml ..................... SUCCESS
(2.7 s)
[windows-jdk8] [INFO] Building: test1\pom.xml
[linux-jdk9] Sending interrupt signal to process
[windows-jdk8] Sending interrupt signal to process
[windows-jdk9] Sending interrupt signal to process
[linux-jdk9] [INFO]           MCOMPILER-203-processorpath/pom.xml .............. FAILED (1.1
s)
[linux-jdk9] [INFO]   The build exited with code 143. See /home/jenkins/jenkins-slave/workspace/n_TEST_TO_FIX_MCOMPILER-192-EJZ35UAEPCX3IH57D2YA4NCSBBIRCVCD4L4Y7IFGSVZP6VXNNVFA/m/target/it/MCOMPILER-203-processorpath/build.log
for details.
[linux-jdk9] [INFO] Building: MCOMPILER-192/pom.xml
[linux-jdk9] Terminated
[Pipeline] [linux-jdk9] }
[Pipeline] [windows-jdk8] }
[Pipeline] [linux-jdk9] // dir
[Pipeline] [windows-jdk8] // dir
[Pipeline] [linux-jdk9] }
[linux-jdk9] [withMaven] One or multiple Maven executions have been ignored by the Jenkins
Pipeline Maven Plugin because they have been interrupted before completion (1). See Pipeline
Maven Plugin FAQ for more details.
[Pipeline] [windows-jdk8] }
[windows-jdk8] [withMaven] One or multiple Maven executions have been ignored by the Jenkins
Pipeline Maven Plugin because they have been interrupted before completion (1). See Pipeline
Maven Plugin FAQ for more details.
[Pipeline] [linux-jdk9] // withMaven
[Pipeline] [windows-jdk8] // withMaven
[Pipeline] [linux-jdk9] echo
[linux-jdk9] [FAIL FAST] windows-jdk7 had first failure, ignoring script returned exit code
143
[Pipeline] [linux-jdk9] }
[Pipeline] [windows-jdk8] }
[Pipeline] [linux-jdk9] // stage
[Pipeline] [windows-jdk8] // stage
[Pipeline] [linux-jdk9] }
[Pipeline] [windows-jdk8] }
[Pipeline] [linux-jdk9] // node
[Pipeline] [windows-jdk8] // node
[Pipeline] [linux-jdk9] }
[Pipeline] [windows-jdk8] }
[windows-jdk9] After 10s process did not stop
[Pipeline] [windows-jdk9] }
[Pipeline] [windows-jdk9] // dir
[Pipeline] [windows-jdk9] }
[windows-jdk9] [withMaven] One or multiple Maven executions have been ignored by the Jenkins
Pipeline Maven Plugin because they have been interrupted before completion (1). See Pipeline
Maven Plugin FAQ for more details.
[Pipeline] [windows-jdk9] // withMaven
[Pipeline] [windows-jdk9] echo
[windows-jdk9] [FAIL FAST] windows-jdk7 had first failure, ignoring null
[Pipeline] [windows-jdk9] }
[Pipeline] [windows-jdk9] // stage
[Pipeline] [windows-jdk9] }
[Pipeline] [windows-jdk9] // node
[Pipeline] [windows-jdk9] }
[Pipeline] // parallel
[Pipeline] echo
***** FAST FAILURE *****

Fast failure triggered by windows-jdk7

***** FAST FAILURE *****
[Pipeline] stage
[Pipeline] { (Notifications)
[Pipeline] echo
Build result: FAILURE
[Pipeline] jiraIssueSelector
[Pipeline] emailext
Mime
  • Unnamed multipart/mixed (inline, None, 0 bytes)
View raw message