maven-notifications mailing list archives

Site index · List index
Message view « Date » · « Thread »
Top « Date » · « Thread »
From Apache Jenkins Server <jenk...@builds.apache.org>
Subject Build unstable in Jenkins: Maven TLP » maven-release » Paths #1
Date Mon, 19 Mar 2018 19:19:25 GMT
See https://builds.apache.org/job/maven-box/job/maven-release/job/Paths/1/

No changes.

12 tests failed.
FAILED:  org.apache.maven.shared.release.util.ReleaseUtilTest.testGetCommonBasedirOfRegularMultiModuleWindowsPath

Error Message:
null

Stack Trace:
java.lang.NullPointerException
	at org.apache.maven.shared.release.util.ReleaseUtilTest.testGetCommonBasedirOfRegularMultiModuleWindowsPath(ReleaseUtilTest.java:152)


FAILED:  org.apache.maven.shared.release.util.ReleaseUtilTest.testGetCommonBasedirUppercaseLowerCaseWindows

Error Message:
null

Stack Trace:
java.lang.NullPointerException
	at org.apache.maven.shared.release.util.ReleaseUtilTest.testGetCommonBasedirUppercaseLowerCaseWindows(ReleaseUtilTest.java:94)


FAILED:  org.apache.maven.shared.release.util.ReleaseUtilTest.testGetCommonBasedirOfFlatMultiModuleSimilarArtifactIdsWindows

Error Message:
null

Stack Trace:
java.lang.NullPointerException
	at org.apache.maven.shared.release.util.ReleaseUtilTest.testGetCommonBasedirOfFlatMultiModuleSimilarArtifactIdsWindows(ReleaseUtilTest.java:119)


FAILED:  org.apache.maven.shared.release.util.ReleaseUtilTest.testGetCommonBasedirOfFlatMultiModuleWindows

Error Message:
null

Stack Trace:
java.lang.NullPointerException
	at org.apache.maven.shared.release.util.ReleaseUtilTest.testGetCommonBasedirOfFlatMultiModuleWindows(ReleaseUtilTest.java:83)


FAILED:  org.apache.maven.shared.release.util.ReleaseUtilTest.testGetCommonBasedirOfRegularMultiModuleWindowsPath

Error Message:
null

Stack Trace:
java.lang.NullPointerException
	at org.apache.maven.shared.release.util.ReleaseUtilTest.testGetCommonBasedirOfRegularMultiModuleWindowsPath(ReleaseUtilTest.java:151)


FAILED:  org.apache.maven.shared.release.util.ReleaseUtilTest.testGetCommonBasedirUppercaseLowerCaseWindows

Error Message:
null

Stack Trace:
java.lang.NullPointerException
	at org.apache.maven.shared.release.util.ReleaseUtilTest.testGetCommonBasedirUppercaseLowerCaseWindows(ReleaseUtilTest.java:93)


FAILED:  org.apache.maven.shared.release.util.ReleaseUtilTest.testGetCommonBasedirOfFlatMultiModuleSimilarArtifactIdsWindows

Error Message:
null

Stack Trace:
java.lang.NullPointerException
	at org.apache.maven.shared.release.util.ReleaseUtilTest.testGetCommonBasedirOfFlatMultiModuleSimilarArtifactIdsWindows(ReleaseUtilTest.java:118)


FAILED:  org.apache.maven.shared.release.util.ReleaseUtilTest.testGetCommonBasedirOfFlatMultiModuleWindows

Error Message:
null

Stack Trace:
java.lang.NullPointerException
	at org.apache.maven.shared.release.util.ReleaseUtilTest.testGetCommonBasedirOfFlatMultiModuleWindows(ReleaseUtilTest.java:82)


FAILED:  org.apache.maven.shared.release.util.ReleaseUtilTest.testGetCommonBasedirOfRegularMultiModuleWindowsPath

Error Message:
null

Stack Trace:
java.lang.NullPointerException
	at org.apache.maven.shared.release.util.ReleaseUtilTest.testGetCommonBasedirOfRegularMultiModuleWindowsPath(ReleaseUtilTest.java:152)


FAILED:  org.apache.maven.shared.release.util.ReleaseUtilTest.testGetCommonBasedirUppercaseLowerCaseWindows

Error Message:
null

Stack Trace:
java.lang.NullPointerException
	at org.apache.maven.shared.release.util.ReleaseUtilTest.testGetCommonBasedirUppercaseLowerCaseWindows(ReleaseUtilTest.java:94)


FAILED:  org.apache.maven.shared.release.util.ReleaseUtilTest.testGetCommonBasedirOfFlatMultiModuleSimilarArtifactIdsWindows

Error Message:
null

Stack Trace:
java.lang.NullPointerException
	at org.apache.maven.shared.release.util.ReleaseUtilTest.testGetCommonBasedirOfFlatMultiModuleSimilarArtifactIdsWindows(ReleaseUtilTest.java:119)


FAILED:  org.apache.maven.shared.release.util.ReleaseUtilTest.testGetCommonBasedirOfFlatMultiModuleWindows

Error Message:
null

Stack Trace:
java.lang.NullPointerException
	at org.apache.maven.shared.release.util.ReleaseUtilTest.testGetCommonBasedirOfFlatMultiModuleWindows(ReleaseUtilTest.java:83)




Build log:
[...truncated 2.80 MB...]
[linux-jdk9] [INFO] Building: projects/update-versions/MRELEASE-611/pom.xml
[linux-jdk9] [INFO] run script verify.groovy
[linux-jdk9] [INFO] ..SUCCESS (4.1 s)
[linux-jdk9] [INFO] Building: projects/update-versions/MRELEASE-783/pom.xml
[linux-jdk9] [INFO] ..SUCCESS (4.2 s)
[linux-jdk9] [INFO] -------------------------------------------------
[linux-jdk9] [INFO] Build Summary:
[linux-jdk9] [INFO]   Passed: 4, Failed: 0, Errors: 0, Skipped: 0
[linux-jdk9] [INFO] -------------------------------------------------
[linux-jdk9] [INFO] 
[linux-jdk9] [INFO] --- maven-checkstyle-plugin:2.15:check (checkstyle-check) @ maven-release-plugin
---
[linux-jdk9] [INFO] 
[linux-jdk9] [INFO] ------------------------------------------------------------------------
[linux-jdk9] [INFO] Building Maven Release Odd-Even Policy 3.0.0-SNAPSHOT
[linux-jdk9] [INFO] ------------------------------------------------------------------------
[linux-jdk9] [INFO] 
[linux-jdk9] [INFO] --- maven-clean-plugin:2.5:clean (default-clean) @ maven-release-oddeven-policy
---
[linux-jdk9] [INFO] 
[linux-jdk9] [INFO] --- maven-enforcer-plugin:1.3.1:enforce (enforce-bytecode-version) @ maven-release-oddeven-policy
---
[linux-jdk9] [INFO] 
[linux-jdk9] [INFO] --- maven-enforcer-plugin:1.3.1:enforce (ban-known-bad-maven-versions)
@ maven-release-oddeven-policy ---
[linux-jdk9] [INFO] 
[linux-jdk9] [INFO] --- apache-rat-plugin:0.11:check (rat-check) @ maven-release-oddeven-policy
---
[linux-jdk9] [INFO] 51 implicit excludes (use -debug for more details).
[linux-jdk9] [INFO] Exclude: .repository
[linux-jdk9] [INFO] Exclude: Jenkinsfile
[linux-jdk9] [INFO] Exclude: DEPENDENCIES
[linux-jdk9] [INFO] 4 resources included (use -debug for more details)
[linux-jdk9] [INFO] Rat check: Summary of files. Unapproved: 0 unknown: 0 generated: 0 approved:
4 licence.
[linux-jdk9] [INFO] 
[linux-jdk9] [INFO] --- maven-remote-resources-plugin:1.5:process (default) @ maven-release-oddeven-policy
---
[linux-jdk9] [INFO] 
[linux-jdk9] [INFO] --- maven-resources-plugin:2.7:resources (default-resources) @ maven-release-oddeven-policy
---
[linux-jdk9] [INFO] Using 'UTF-8' encoding to copy filtered resources.
[linux-jdk9] [INFO] skip non existing resourceDirectory /home/jenkins/jenkins-slave/workspace/ven-box_maven-release_Paths-4NCER2J3CQGVXOFK4LQQA4U443XQHIYPYZUL4VIPZ7OEZWI745ZA/m/maven-release-policies/maven-release-oddeven-policy/src/main/resources
[linux-jdk9] [INFO] Copying 3 resources
[linux-jdk9] [INFO] 
[linux-jdk9] [INFO] --- maven-compiler-plugin:3.2:compile (default-compile) @ maven-release-oddeven-policy
---
[linux-jdk9] [INFO] Changes detected - recompiling the module!
[linux-jdk9] [INFO] Compiling 2 source files to /home/jenkins/jenkins-slave/workspace/ven-box_maven-release_Paths-4NCER2J3CQGVXOFK4LQQA4U443XQHIYPYZUL4VIPZ7OEZWI745ZA/m/maven-release-policies/maven-release-oddeven-policy/target/classes
[linux-jdk9] [INFO] 
[linux-jdk9] [INFO] --- plexus-component-metadata:1.7.1:generate-metadata (process-classes)
@ maven-release-oddeven-policy ---
[linux-jdk9] [INFO] Discovered 1 component descriptors(s)
[linux-jdk9] [INFO] 
[linux-jdk9] [INFO] --- maven-resources-plugin:2.7:testResources (default-testResources) @
maven-release-oddeven-policy ---
[linux-jdk9] [INFO] Using 'UTF-8' encoding to copy filtered resources.
[linux-jdk9] [INFO] skip non existing resourceDirectory /home/jenkins/jenkins-slave/workspace/ven-box_maven-release_Paths-4NCER2J3CQGVXOFK4LQQA4U443XQHIYPYZUL4VIPZ7OEZWI745ZA/m/maven-release-policies/maven-release-oddeven-policy/src/test/resources
[linux-jdk9] [INFO] Copying 3 resources
[linux-jdk9] [INFO] 
[linux-jdk9] [INFO] --- maven-compiler-plugin:3.2:testCompile (default-testCompile) @ maven-release-oddeven-policy
---
[linux-jdk9] [INFO] Changes detected - recompiling the module!
[linux-jdk9] [INFO] Compiling 1 source file to /home/jenkins/jenkins-slave/workspace/ven-box_maven-release_Paths-4NCER2J3CQGVXOFK4LQQA4U443XQHIYPYZUL4VIPZ7OEZWI745ZA/m/maven-release-policies/maven-release-oddeven-policy/target/test-classes
[linux-jdk9] [INFO] 
[linux-jdk9] [INFO] --- maven-surefire-plugin:2.20.1:test (default-test) @ maven-release-oddeven-policy
---
[linux-jdk9] [INFO] 
[linux-jdk9] [INFO] -------------------------------------------------------
[linux-jdk9] [INFO]  T E S T S
[linux-jdk9] [INFO] -------------------------------------------------------
[linux-jdk9] [INFO] Running org.apache.maven.shared.release.policy.oddeven.OddEvenVersionPolicyTestCase
[linux-jdk9] [INFO] Tests run: 3, Failures: 0, Errors: 0, Skipped: 0, Time elapsed: 0.127
s - in org.apache.maven.shared.release.policy.oddeven.OddEvenVersionPolicyTestCase
[linux-jdk9] [INFO] 
[linux-jdk9] [INFO] Results:
[linux-jdk9] [INFO] 
[linux-jdk9] [INFO] Tests run: 3, Failures: 0, Errors: 0, Skipped: 0
[linux-jdk9] [INFO] 
[linux-jdk9] [INFO] 
[linux-jdk9] [INFO] --- maven-jar-plugin:2.5:jar (default-jar) @ maven-release-oddeven-policy
---
[linux-jdk9] [INFO] Building jar: /home/jenkins/jenkins-slave/workspace/ven-box_maven-release_Paths-4NCER2J3CQGVXOFK4LQQA4U443XQHIYPYZUL4VIPZ7OEZWI745ZA/m/maven-release-policies/maven-release-oddeven-policy/target/maven-release-oddeven-policy-3.0.0-SNAPSHOT.jar
[linux-jdk9] [INFO] 
[linux-jdk9] [INFO] --- maven-site-plugin:3.4:attach-descriptor (attach-descriptor) @ maven-release-oddeven-policy
---
[linux-jdk9] [INFO] 
[linux-jdk9] [INFO] --- maven-checkstyle-plugin:2.15:check (checkstyle-check) @ maven-release-oddeven-policy
---
[linux-jdk9] [INFO] 
[linux-jdk9] [INFO] ------------------------------------------------------------------------
[linux-jdk9] [INFO] Building Maven Release SemVer Policy 3.0.0-SNAPSHOT
[linux-jdk9] [INFO] ------------------------------------------------------------------------
[linux-jdk9] [INFO] Downloading from central: https://repo.maven.apache.org/maven2/org/semver/api/0.9.33/api-0.9.33.pom
[linux-jdk9] [INFO] Downloaded from central: https://repo.maven.apache.org/maven2/org/semver/api/0.9.33/api-0.9.33.pom
(2.8 kB at 157 kB/s)
[linux-jdk9] [INFO] Downloading from central: https://repo.maven.apache.org/maven2/org/semver/parent/0.9.33/parent-0.9.33.pom
[linux-jdk9] [INFO] Downloaded from central: https://repo.maven.apache.org/maven2/org/semver/parent/0.9.33/parent-0.9.33.pom
(1.3 kB at 105 kB/s)
[linux-jdk9] [INFO] Downloading from central: https://repo.maven.apache.org/maven2/com/github/jeluard/oss-parent/9/oss-parent-9.pom
[linux-jdk9] [INFO] Downloaded from central: https://repo.maven.apache.org/maven2/com/github/jeluard/oss-parent/9/oss-parent-9.pom
(12 kB at 499 kB/s)
[linux-jdk9] [INFO] Downloading from central: https://repo.maven.apache.org/maven2/com/google/code/findbugs/jsr305/2.0.0/jsr305-2.0.0.pom
[linux-jdk9] [INFO] Downloaded from central: https://repo.maven.apache.org/maven2/com/google/code/findbugs/jsr305/2.0.0/jsr305-2.0.0.pom
(965 B at 80 kB/s)
[linux-jdk9] [INFO] Downloading from central: https://repo.maven.apache.org/maven2/org/ow2/asm/asm/5.0.3/asm-5.0.3.pom
[linux-jdk9] [INFO] Downloaded from central: https://repo.maven.apache.org/maven2/org/ow2/asm/asm/5.0.3/asm-5.0.3.pom
(1.9 kB at 194 kB/s)
[linux-jdk9] [INFO] Downloading from central: https://repo.maven.apache.org/maven2/org/ow2/asm/asm-parent/5.0.3/asm-parent-5.0.3.pom
[linux-jdk9] [INFO] Downloaded from central: https://repo.maven.apache.org/maven2/org/ow2/asm/asm-parent/5.0.3/asm-parent-5.0.3.pom
(5.5 kB at 500 kB/s)
[linux-jdk9] [INFO] Downloading from central: https://repo.maven.apache.org/maven2/org/ow2/asm/asm-commons/5.0.3/asm-commons-5.0.3.pom
[linux-jdk9] [INFO] Downloaded from central: https://repo.maven.apache.org/maven2/org/ow2/asm/asm-commons/5.0.3/asm-commons-5.0.3.pom
(2.1 kB at 209 kB/s)
[linux-jdk9] [INFO] Downloading from central: https://repo.maven.apache.org/maven2/org/ow2/asm/asm-tree/5.0.3/asm-tree-5.0.3.pom
[linux-jdk9] [INFO] Downloaded from central: https://repo.maven.apache.org/maven2/org/ow2/asm/asm-tree/5.0.3/asm-tree-5.0.3.pom
(2.1 kB at 149 kB/s)
[linux-jdk9] [INFO] Downloading from central: https://repo.maven.apache.org/maven2/commons-lang/commons-lang/1.0/commons-lang-1.0.pom
[linux-jdk9] [INFO] Downloaded from central: https://repo.maven.apache.org/maven2/commons-lang/commons-lang/1.0/commons-lang-1.0.pom
(2.5 kB at 205 kB/s)
[linux-jdk9] [INFO] Downloading from central: https://repo.maven.apache.org/maven2/de/tototec/de.tototec.cmdoption/0.2.0/de.tototec.cmdoption-0.2.0.pom
[linux-jdk9] [INFO] Downloaded from central: https://repo.maven.apache.org/maven2/de/tototec/de.tototec.cmdoption/0.2.0/de.tototec.cmdoption-0.2.0.pom
(956 B at 80 kB/s)
[linux-jdk9] [INFO] Downloading from central: https://repo.maven.apache.org/maven2/org/semver/api/0.9.33/api-0.9.33.jar
[linux-jdk9] [INFO] Downloading from central: https://repo.maven.apache.org/maven2/com/google/code/findbugs/jsr305/2.0.0/jsr305-2.0.0.jar
[linux-jdk9] [INFO] Downloading from central: https://repo.maven.apache.org/maven2/org/ow2/asm/asm/5.0.3/asm-5.0.3.jar
[linux-jdk9] [INFO] Downloading from central: https://repo.maven.apache.org/maven2/org/ow2/asm/asm-commons/5.0.3/asm-commons-5.0.3.jar
[linux-jdk9] [INFO] Downloading from central: https://repo.maven.apache.org/maven2/org/ow2/asm/asm-tree/5.0.3/asm-tree-5.0.3.jar
[linux-jdk9] [INFO] Downloaded from central: https://repo.maven.apache.org/maven2/com/google/code/findbugs/jsr305/2.0.0/jsr305-2.0.0.jar
(32 kB at 1.7 MB/s)
[linux-jdk9] [INFO] Downloaded from central: https://repo.maven.apache.org/maven2/org/ow2/asm/asm/5.0.3/asm-5.0.3.jar
(53 kB at 3.0 MB/s)
[linux-jdk9] [INFO] Downloading from central: https://repo.maven.apache.org/maven2/commons-lang/commons-lang/1.0/commons-lang-1.0.jar
[linux-jdk9] [INFO] Downloading from central: https://repo.maven.apache.org/maven2/de/tototec/de.tototec.cmdoption/0.2.0/de.tototec.cmdoption-0.2.0.jar
[linux-jdk9] [INFO] Downloaded from central: https://repo.maven.apache.org/maven2/org/ow2/asm/asm-commons/5.0.3/asm-commons-5.0.3.jar
(42 kB at 2.2 MB/s)
[linux-jdk9] [INFO] Downloaded from central: https://repo.maven.apache.org/maven2/org/ow2/asm/asm-tree/5.0.3/asm-tree-5.0.3.jar
(29 kB at 1.5 MB/s)
[linux-jdk9] [INFO] Downloaded from central: https://repo.maven.apache.org/maven2/org/semver/api/0.9.33/api-0.9.33.jar
(64 kB at 2.0 MB/s)
[linux-jdk9] [INFO] Downloaded from central: https://repo.maven.apache.org/maven2/de/tototec/de.tototec.cmdoption/0.2.0/de.tototec.cmdoption-0.2.0.jar
(42 kB at 1.5 MB/s)
[linux-jdk9] [INFO] Downloaded from central: https://repo.maven.apache.org/maven2/commons-lang/commons-lang/1.0/commons-lang-1.0.jar
(64 kB at 2.1 MB/s)
[linux-jdk9] [INFO] 
[linux-jdk9] [INFO] --- maven-clean-plugin:2.5:clean (default-clean) @ maven-release-semver-policy
---
[linux-jdk9] [INFO] 
[linux-jdk9] [INFO] --- maven-enforcer-plugin:1.3.1:enforce (enforce-bytecode-version) @ maven-release-semver-policy
---
[linux-jdk9] [INFO] 
[linux-jdk9] [INFO] --- maven-enforcer-plugin:1.3.1:enforce (ban-known-bad-maven-versions)
@ maven-release-semver-policy ---
[linux-jdk9] [INFO] 
[linux-jdk9] [INFO] --- apache-rat-plugin:0.11:check (rat-check) @ maven-release-semver-policy
---
[linux-jdk9] [INFO] 51 implicit excludes (use -debug for more details).
[linux-jdk9] [INFO] Exclude: .repository
[linux-jdk9] [INFO] Exclude: Jenkinsfile
[linux-jdk9] [INFO] Exclude: DEPENDENCIES
[linux-jdk9] [INFO] 3 resources included (use -debug for more details)
[linux-jdk9] [INFO] Rat check: Summary of files. Unapproved: 0 unknown: 0 generated: 0 approved:
3 licence.
[linux-jdk9] [INFO] 
[linux-jdk9] [INFO] --- maven-remote-resources-plugin:1.5:process (default) @ maven-release-semver-policy
---
[linux-jdk9] [INFO] 
[linux-jdk9] [INFO] --- maven-resources-plugin:2.7:resources (default-resources) @ maven-release-semver-policy
---
[linux-jdk9] [INFO] Using 'UTF-8' encoding to copy filtered resources.
[linux-jdk9] [INFO] skip non existing resourceDirectory /home/jenkins/jenkins-slave/workspace/ven-box_maven-release_Paths-4NCER2J3CQGVXOFK4LQQA4U443XQHIYPYZUL4VIPZ7OEZWI745ZA/m/maven-release-policies/maven-release-semver-policy/src/main/resources
[linux-jdk9] [INFO] Copying 3 resources
[linux-jdk9] [INFO] 
[linux-jdk9] [INFO] --- maven-compiler-plugin:3.2:compile (default-compile) @ maven-release-semver-policy
---
[linux-jdk9] [INFO] Changes detected - recompiling the module!
[linux-jdk9] [INFO] Compiling 1 source file to /home/jenkins/jenkins-slave/workspace/ven-box_maven-release_Paths-4NCER2J3CQGVXOFK4LQQA4U443XQHIYPYZUL4VIPZ7OEZWI745ZA/m/maven-release-policies/maven-release-semver-policy/target/classes
[linux-jdk9] [INFO] 
[linux-jdk9] [INFO] --- plexus-component-metadata:1.7.1:generate-metadata (process-classes)
@ maven-release-semver-policy ---
[linux-jdk9] [INFO] Discovered 1 component descriptors(s)
[linux-jdk9] [INFO] 
[linux-jdk9] [INFO] --- maven-resources-plugin:2.7:testResources (default-testResources) @
maven-release-semver-policy ---
[linux-jdk9] [INFO] Using 'UTF-8' encoding to copy filtered resources.
[linux-jdk9] [INFO] skip non existing resourceDirectory /home/jenkins/jenkins-slave/workspace/ven-box_maven-release_Paths-4NCER2J3CQGVXOFK4LQQA4U443XQHIYPYZUL4VIPZ7OEZWI745ZA/m/maven-release-policies/maven-release-semver-policy/src/test/resources
[linux-jdk9] [INFO] Copying 3 resources
[linux-jdk9] [INFO] 
[linux-jdk9] [INFO] --- maven-compiler-plugin:3.2:testCompile (default-testCompile) @ maven-release-semver-policy
---
[linux-jdk9] [INFO] Changes detected - recompiling the module!
[linux-jdk9] [INFO] Compiling 1 source file to /home/jenkins/jenkins-slave/workspace/ven-box_maven-release_Paths-4NCER2J3CQGVXOFK4LQQA4U443XQHIYPYZUL4VIPZ7OEZWI745ZA/m/maven-release-policies/maven-release-semver-policy/target/test-classes
[linux-jdk9] [INFO] 
[linux-jdk9] [INFO] --- maven-surefire-plugin:2.20.1:test (default-test) @ maven-release-semver-policy
---
[linux-jdk9] [INFO] 
[linux-jdk9] [INFO] -------------------------------------------------------
[linux-jdk9] [INFO]  T E S T S
[linux-jdk9] [INFO] -------------------------------------------------------
[linux-jdk9] [INFO] Running org.apache.maven.shared.release.policy.semver.SemVerVersionPolicyTest
[linux-jdk9] [INFO] Tests run: 2, Failures: 0, Errors: 0, Skipped: 0, Time elapsed: 0.099
s - in org.apache.maven.shared.release.policy.semver.SemVerVersionPolicyTest
[linux-jdk9] [INFO] 
[linux-jdk9] [INFO] Results:
[linux-jdk9] [INFO] 
[linux-jdk9] [INFO] Tests run: 2, Failures: 0, Errors: 0, Skipped: 0
[linux-jdk9] [INFO] 
[linux-jdk9] [INFO] 
[linux-jdk9] [INFO] --- maven-jar-plugin:2.5:jar (default-jar) @ maven-release-semver-policy
---
[linux-jdk9] [INFO] Building jar: /home/jenkins/jenkins-slave/workspace/ven-box_maven-release_Paths-4NCER2J3CQGVXOFK4LQQA4U443XQHIYPYZUL4VIPZ7OEZWI745ZA/m/maven-release-policies/maven-release-semver-policy/target/maven-release-semver-policy-3.0.0-SNAPSHOT.jar
[linux-jdk9] [INFO] 
[linux-jdk9] [INFO] --- maven-site-plugin:3.4:attach-descriptor (attach-descriptor) @ maven-release-semver-policy
---
[linux-jdk9] [INFO] 
[linux-jdk9] [INFO] --- maven-checkstyle-plugin:2.15:check (checkstyle-check) @ maven-release-semver-policy
---
[linux-jdk9] [INFO] ------------------------------------------------------------------------
[linux-jdk9] [INFO] Reactor Summary:
[linux-jdk9] [INFO] 
[linux-jdk9] [INFO] Maven Release ...................................... SUCCESS [ 11.919
s]
[linux-jdk9] [INFO] Maven Release APIs ................................. SUCCESS [  4.441
s]
[linux-jdk9] [INFO] Maven Release Manager .............................. SUCCESS [01:35 min]
[linux-jdk9] [INFO] Maven Release Plugin ............................... SUCCESS [04:50 min]
[linux-jdk9] [INFO] Maven Release Odd-Even Policy ...................... SUCCESS [  1.749
s]
[linux-jdk9] [INFO] Maven Release SemVer Policy ........................ SUCCESS [  2.014
s]
[linux-jdk9] [INFO] ------------------------------------------------------------------------
[linux-jdk9] [INFO] BUILD SUCCESS
[linux-jdk9] [INFO] ------------------------------------------------------------------------
[linux-jdk9] [INFO] Total time: 06:46 min
[linux-jdk9] [INFO] Finished at: 2018-03-19T19:19:16Z
[linux-jdk9] [INFO] Final Memory: 76M/248M
[linux-jdk9] [INFO] ------------------------------------------------------------------------
[linux-jdk9] [INFO] [jenkins-event-spy] Generated /home/jenkins/jenkins-slave/workspace/ven-box_maven-release_Paths-4NCER2J3CQGVXOFK4LQQA4U443XQHIYPYZUL4VIPZ7OEZWI745ZA@tmp/withMaven485e74ad/maven-spy-20180319-191228-84018100903438525601031.log
[Pipeline] [linux-jdk9] }
[Pipeline] [linux-jdk9] // dir
[Pipeline] [linux-jdk9] }
[linux-jdk9] ERROR: [withMaven] WARNING Exception executing Maven reporter 'Invoker Publisher'
/ org.jenkinsci.plugins.pipeline.maven.publishers.InvokerRunsPublisher. Please report a bug
associated for the component 'pipeline-maven-plugin' at https://issues.jenkins-ci.org 
[linux-jdk9] java.lang.IllegalArgumentException: Cannot relativize 'src/it' relatively to
'/home/jenkins/jenkins-slave/workspace/ven-box_maven-release_Paths-4NCER2J3CQGVXOFK4LQQA4U443XQHIYPYZUL4VIPZ7OEZWI745ZA'
[linux-jdk9] 	at org.jenkinsci.plugins.pipeline.maven.util.XmlUtils.getPathInWorkspace(XmlUtils.java:396)
[linux-jdk9] 	at org.jenkinsci.plugins.pipeline.maven.publishers.InvokerRunsPublisher.expandAndRelativize(InvokerRunsPublisher.java:179)
[linux-jdk9] 	at org.jenkinsci.plugins.pipeline.maven.publishers.InvokerRunsPublisher.executeReporter(InvokerRunsPublisher.java:127)
[linux-jdk9] 	at org.jenkinsci.plugins.pipeline.maven.publishers.InvokerRunsPublisher.process(InvokerRunsPublisher.java:104)
[linux-jdk9] 	at org.jenkinsci.plugins.pipeline.maven.MavenSpyLogProcessor.processMavenSpyLogs(MavenSpyLogProcessor.java:114)
[linux-jdk9] 	at org.jenkinsci.plugins.pipeline.maven.WithMavenStepExecution$WorkspaceCleanupCallback.finished(WithMavenStepExecution.java:1015)
[linux-jdk9] 	at org.jenkinsci.plugins.workflow.steps.BodyExecutionCallback$TailCall.onSuccess(BodyExecutionCallback.java:114)
[linux-jdk9] 	at org.jenkinsci.plugins.workflow.cps.CpsBodyExecution$SuccessAdapter.receive(CpsBodyExecution.java:368)
[linux-jdk9] 	at com.cloudbees.groovy.cps.Outcome.resumeFrom(Outcome.java:73)
[linux-jdk9] 	at com.cloudbees.groovy.cps.Continuable$1.call(Continuable.java:166)
[linux-jdk9] 	at com.cloudbees.groovy.cps.Continuable$1.call(Continuable.java:163)
[linux-jdk9] 	at org.codehaus.groovy.runtime.GroovyCategorySupport$ThreadCategoryInfo.use(GroovyCategorySupport.java:122)
[linux-jdk9] 	at org.codehaus.groovy.runtime.GroovyCategorySupport.use(GroovyCategorySupport.java:261)
[linux-jdk9] 	at com.cloudbees.groovy.cps.Continuable.run0(Continuable.java:163)
[linux-jdk9] 	at org.jenkinsci.plugins.workflow.cps.SandboxContinuable.access$001(SandboxContinuable.java:19)
[linux-jdk9] 	at org.jenkinsci.plugins.workflow.cps.SandboxContinuable$1.call(SandboxContinuable.java:35)
[linux-jdk9] 	at org.jenkinsci.plugins.workflow.cps.SandboxContinuable$1.call(SandboxContinuable.java:32)
[linux-jdk9] 	at org.jenkinsci.plugins.scriptsecurity.sandbox.groovy.GroovySandbox.runInSandbox(GroovySandbox.java:108)
[linux-jdk9] 	at org.jenkinsci.plugins.workflow.cps.SandboxContinuable.run0(SandboxContinuable.java:32)
[linux-jdk9] 	at org.jenkinsci.plugins.workflow.cps.CpsThread.runNextChunk(CpsThread.java:174)
[linux-jdk9] 	at org.jenkinsci.plugins.workflow.cps.CpsThreadGroup.run(CpsThreadGroup.java:331)
[linux-jdk9] 	at org.jenkinsci.plugins.workflow.cps.CpsThreadGroup.access$200(CpsThreadGroup.java:82)
[linux-jdk9] 	at org.jenkinsci.plugins.workflow.cps.CpsThreadGroup$2.call(CpsThreadGroup.java:243)
[linux-jdk9] 	at org.jenkinsci.plugins.workflow.cps.CpsThreadGroup$2.call(CpsThreadGroup.java:231)
[linux-jdk9] 	at org.jenkinsci.plugins.workflow.cps.CpsVmExecutorService$2.call(CpsVmExecutorService.java:64)
[linux-jdk9] 	at java.util.concurrent.FutureTask.run(FutureTask.java:266)
[linux-jdk9] 	at hudson.remoting.SingleLaneExecutorService$1.run(SingleLaneExecutorService.java:112)
[linux-jdk9] 	at jenkins.util.ContextResettingExecutorService$1.run(ContextResettingExecutorService.java:28)
[linux-jdk9] 	at java.util.concurrent.Executors$RunnableAdapter.call(Executors.java:511)
[linux-jdk9] 	at java.util.concurrent.FutureTask.run(FutureTask.java:266)
[linux-jdk9] 	at java.util.concurrent.ThreadPoolExecutor.runWorker(ThreadPoolExecutor.java:1149)
[linux-jdk9] 	at java.util.concurrent.ThreadPoolExecutor$Worker.run(ThreadPoolExecutor.java:624)
[linux-jdk9] 	at java.lang.Thread.run(Thread.java:748)
[linux-jdk9] [withMaven] junitPublisher - Archive test results for Maven artifact org.apache.maven.release:maven-release-api:3.0.0-SNAPSHOT
generated by maven-surefire-plugin:test (default-test): m/maven-release-api/target/surefire-reports/*.xml
[linux-jdk9] [withMaven] junitPublisher - Jenkins JUnit Attachments Plugin not found, can't
publish test attachments.Recording test results
[linux-jdk9] None of the test reports contained any result
[linux-jdk9] [withMaven] junitPublisher - Archive test results for Maven artifact org.apache.maven.release:maven-release-manager:3.0.0-SNAPSHOT
generated by maven-surefire-plugin:test (default-test): m/maven-release-manager/target/surefire-reports/*.xml
[linux-jdk9] [withMaven] junitPublisher - Jenkins JUnit Attachments Plugin not found, can't
publish test attachments.Recording test results
[linux-jdk9] [withMaven] junitPublisher - Archive test results for Maven artifact org.apache.maven.plugins:maven-release-plugin:3.0.0-SNAPSHOT
generated by maven-surefire-plugin:test (default-test): m/maven-release-plugin/target/surefire-reports/*.xml
[linux-jdk9] [withMaven] junitPublisher - Jenkins JUnit Attachments Plugin not found, can't
publish test attachments.Recording test results
[linux-jdk9] [withMaven] junitPublisher - Archive test results for Maven artifact org.apache.maven.release:maven-release-oddeven-policy:3.0.0-SNAPSHOT
generated by maven-surefire-plugin:test (default-test): m/maven-release-policies/maven-release-oddeven-policy/target/surefire-reports/*.xml
[linux-jdk9] [withMaven] junitPublisher - Jenkins JUnit Attachments Plugin not found, can't
publish test attachments.Recording test results
[linux-jdk9] [withMaven] junitPublisher - Archive test results for Maven artifact org.apache.maven.release:maven-release-semver-policy:3.0.0-SNAPSHOT
generated by maven-surefire-plugin:test (default-test): m/maven-release-policies/maven-release-semver-policy/target/surefire-reports/*.xml
[linux-jdk9] [withMaven] junitPublisher - Jenkins JUnit Attachments Plugin not found, can't
publish test attachments.Recording test results
[linux-jdk9] [withMaven] junitPublisher - Archive test results for Maven artifact org.apache.maven.release:maven-release-manager:3.0.0-SNAPSHOT
generated by maven-failsafe-plugin:integration-test (default): m/maven-release-manager/target/failsafe-reports/*.xml
[linux-jdk9] [withMaven] junitPublisher - Jenkins JUnit Attachments Plugin not found, can't
publish test attachments.Recording test results
[linux-jdk9] [withMaven] One or multiple Maven executions have been ignored by the Jenkins
Pipeline Maven Plugin because they have been interrupted before completion (1). See Pipeline
Maven Plugin FAQ for more details.
[Pipeline] [linux-jdk9] // withMaven
[Pipeline] [linux-jdk9] }
[Pipeline] [linux-jdk9] // stage
[Pipeline] [linux-jdk9] }
[Pipeline] [linux-jdk9] // node
[Pipeline] [linux-jdk9] }
[Pipeline] // parallel
[Pipeline] stage
[Pipeline] { (Notifications)
[Pipeline] echo
Build result: UNSTABLE
[Pipeline] jiraIssueSelector
[Pipeline] emailext
Mime
  • Unnamed multipart/mixed (inline, None, 0 bytes)
View raw message