maven-notifications mailing list archives

Site index · List index
Message view « Date » · « Thread »
Top « Date » · « Thread »
From Apache Jenkins Server <jenk...@builds.apache.org>
Subject Build failed in Jenkins: Maven TLP » maven-invoker » master #6
Date Sat, 31 Mar 2018 08:31:35 GMT
See https://builds.apache.org/job/maven-box/job/maven-invoker/job/master/6/

Changes:

* get rid of svn legacy :-)
* get rid of svn legacy :-)
* get rid of svn legacy :-)
* get rid of svn legacy :-)
* get rid of svn legacy :-)

No tests ran.

Build log:
[...truncated 354.91 KB...]
[windows-jdk9] [INFO] Running org.apache.maven.shared.invoker.DefaultInvokerTest
[Pipeline] [linux-jdk10] }
[linux-jdk10] [withMaven] junitPublisher - Archive test results for Maven artifact org.apache.maven.shared:maven-invoker:3.0.1-SNAPSHOT
generated by maven-surefire-plugin:test (default-test): m/target/surefire-reports/*.xml
[linux-jdk10] [withMaven] junitPublisher - Jenkins JUnit Attachments Plugin not found, can't
publish test attachments.Recording test results
[linux-jdk10] None of the test reports contained any result
[Pipeline] [windows-jdk10] }
[Pipeline] [linux-jdk10] // withMaven
[Pipeline] [windows-jdk10] // node
[Pipeline] [windows-jdk10] }
[windows-jdk10] Failed in branch windows-jdk10
[Pipeline] [linux-jdk10] echo
[linux-jdk10] [FAIL FAST] windows-jdk10 had first failure, ignoring script returned exit code
1
[Pipeline] [linux-jdk10] }
[linux-jdk7] Sending interrupt signal to process
[linux-jdk8] Sending interrupt signal to process
[linux-jdk7] Terminated
[linux-jdk9] Sending interrupt signal to process
[windows-jdk8] Sending interrupt signal to process
[windows-jdk7] Sending interrupt signal to process
[linux-jdk8] Terminated
[linux-jdk9] Terminated
[windows-jdk8] [INFO] 
[windows-jdk8] [INFO] Results:
[windows-jdk8] [INFO] 
[windows-jdk8] [INFO] Tests run: 0, Failures: 0, Errors: 0, Skipped: 0
[windows-jdk8] [INFO] 
[windows-jdk8] [ERROR] There are test failures.
[windows-jdk8] 
[windows-jdk8] Please refer to f:\jenkins\jenkins-slave\workspace\en-box_maven-invoker_master-HCCXFEN7E5KTKIBJMTWTPYV3ORNOOJFR3C7M7PLGD3SIXRDHEEJQ@2\m\target\surefire-reports
for the individual test results.
[windows-jdk8] Please refer to dump files (if any exist) [date]-jvmRun[N].dump, [date].dumpstream
and [date]-jvmRun[N].dumpstream.
[windows-jdk8] The forked VM terminated without properly saying goodbye. VM crash or System.exit
called?
[windows-jdk8] Command was cmd.exe /X /C "f:\jenkins\tools\java\latest1.8\jre\bin\java -jar
C:\Users\jenkins\AppData\Local\Temp\1\surefire5102595100672122675\surefirebooter1395735548887418976.jar
C:\Users\jenkins\AppData\Local\Temp\1\surefire5102595100672122675 2018-03-31T08-31-05_718-jvmRun1
surefire8116670630186501382tmp surefire_08713483568656176859tmp"
[windows-jdk8] Error occurred in starting fork, check output in log
[windows-jdk8] Process Exit Code: -1
[windows-jdk8] Crashed tests:
[windows-jdk8] org.apache.maven.shared.invoker.DefaultInvokerTest
[windows-jdk8] org.apache.maven.surefire.booter.SurefireBooterForkException: The forked VM
terminated without properly saying goodbye. VM crash or System.exit called?
[windows-jdk7] [INFO] 
[windows-jdk7] [INFO] Results:
[windows-jdk7] [INFO] 
[windows-jdk7] [INFO] Tests run: 0, Failures: 0, Errors: 0, Skipped: 0
[windows-jdk7] [INFO] 
[windows-jdk7] [ERROR] There are test failures.
[windows-jdk7] 
[windows-jdk7] Please refer to f:\jenkins\jenkins-slave\workspace\en-box_maven-invoker_master-HCCXFEN7E5KTKIBJMTWTPYV3ORNOOJFR3C7M7PLGD3SIXRDHEEJQ\m\target\surefire-reports
for the individual test results.
[windows-jdk7] Please refer to dump files (if any exist) [date]-jvmRun[N].dump, [date].dumpstream
and [date]-jvmRun[N].dumpstream.
[windows-jdk7] The forked VM terminated without properly saying goodbye. VM crash or System.exit
called?
[windows-jdk7] Command was cmd.exe /X /C "f:\jenkins\tools\java\latest1.7\jre\bin\java -jar
C:\Users\jenkins\AppData\Local\Temp\1\surefire2592953921647671252\surefirebooter2982691432977375301.jar
C:\Users\jenkins\AppData\Local\Temp\1\surefire2592953921647671252 2018-03-31T08-30-54_240-jvmRun1
surefire837120775394059075tmp surefire_03055982589150166485tmp"
[windows-jdk7] Error occurred in starting fork, check output in log
[windows-jdk7] Process Exit Code: -1
[windows-jdk7] Crashed tests:
[windows-jdk7] org.apache.maven.shared.invoker.DefaultInvokerTest
[windows-jdk7] org.apache.maven.surefire.booter.SurefireBooterForkException: The forked VM
terminated without properly saying goodbye. VM crash or System.exit called?
[windows-jdk7] Command was cmd.exe /X /C "f:\jenkins\tools\java\latest1.7\jre\bin\java -jar
C:\Users\jenkins\AppData\Local\Temp\1\surefire2592953921647671252\surefirebooter2982691432977375301.jar
C:\Users\jenkins\AppData\Local\Temp\1\surefire2592953921647671252 2018-03-31T08-30-54_240-jvmRun1
surefire837120775394059075tmp surefire_03055982589150166485tmp"
[windows-jdk7] Error occurred in starting fork, check output in log
[windows-jdk7] Process Exit Code: -1
[windows-jdk7] Crashed tests:
[windows-jdk7] org.apache.maven.shared.invoker.DefaultInvokerTest
[windows-jdk7] 	at org.apache.maven.plugin.surefire.booterclient.ForkStarter.fork(ForkStarter.java:686)
[windows-jdk7] 	at org.apache.maven.plugin.surefire.booterclient.ForkStarter.fork(ForkStarter.java:535)
[windows-jdk7] 	at org.apache.maven.plugin.surefire.booterclient.ForkStarter.run(ForkStarter.java:280)
[windows-jdk7] 	at org.apache.maven.plugin.surefire.booterclient.ForkStarter.run(ForkStarter.java:245)
[windows-jdk7] 	at org.apache.maven.plugin.surefire.AbstractSurefireMojo.executeProvider(AbstractSurefireMojo.java:1124)
[windows-jdk7] 	at org.apache.maven.plugin.surefire.AbstractSurefireMojo.executeAfterPreconditionsChecked(AbstractSurefireMojo.java:954)
[windows-jdk7] 	at org.apache.maven.plugin.surefire.AbstractSurefireMojo.execute(AbstractSurefireMojo.java:832)
[windows-jdk7] 	at org.apache.maven.plugin.DefaultBuildPluginManager.executeMojo(DefaultBuildPluginManager.java:134)
[windows-jdk7] 	at org.apache.maven.lifecycle.internal.MojoExecutor.execute(MojoExecutor.java:208)
[windows-jdk7] 	at org.apache.maven.lifecycle.internal.MojoExecutor.execute(MojoExecutor.java:154)
[windows-jdk7] 	at org.apache.maven.lifecycle.internal.MojoExecutor.execute(MojoExecutor.java:146)
[windows-jdk7] 	at org.apache.maven.lifecycle.internal.LifecycleModuleBuilder.buildProject(LifecycleModuleBuilder.java:117)
[windows-jdk7] 	at org.apache.maven.lifecycle.internal.LifecycleModuleBuilder.buildProject(LifecycleModuleBuilder.java:81)
[windows-jdk7] 	at org.apache.maven.lifecycle.internal.builder.singlethreaded.SingleThreadedBuilder.build(SingleThreadedBuilder.java:51)
[windows-jdk7] 	at org.apache.maven.lifecycle.internal.LifecycleStarter.execute(LifecycleStarter.java:128)
[windows-jdk7] 	at org.apache.maven.DefaultMaven.doExecute(DefaultMaven.java:309)
[windows-jdk7] 	at org.apache.maven.DefaultMaven.doExecute(DefaultMaven.java:194)
[windows-jdk7] 	at org.apache.maven.DefaultMaven.execute(DefaultMaven.java:107)
[windows-jdk7] 	at org.apache.maven.cli.MavenCli.execute(MavenCli.java:993)
[windows-jdk7] 	at org.apache.maven.cli.MavenCli.doMain(MavenCli.java:345)
[windows-jdk7] 	at org.apache.maven.cli.MavenCli.main(MavenCli.java:191)
[windows-jdk7] 	at sun.reflect.NativeMethodAccessorImpl.invoke0(Native Method)
[windows-jdk7] 	at sun.reflect.NativeMethodAccessorImpl.invoke(NativeMethodAccessorImpl.java:57)
[windows-jdk7] 	at sun.reflect.DelegatingMethodAccessorImpl.invoke(DelegatingMethodAccessorImpl.java:43)
[windows-jdk7] 	at java.lang.reflect.Method.invoke(Method.java:606)
[windows-jdk7] 	at org.codehaus.plexus.classworlds.launcher.Launcher.launchEnhanced(Launcher.java:289)
[windows-jdk7] 	at org.codehaus.plexus.classworlds.launcher.Launcher.launch(Launcher.java:229)
[windows-jdk7] 	at org.codehaus.plexus.classworlds.launcher.Launcher.mainWithExitCode(Launcher.java:415)
[windows-jdk7] 	at org.codehaus.plexus.classworlds.launcher.Launcher.main(Launcher.java:356)
[windows-jdk7] 
[windows-jdk7] [INFO] 
[windows-jdk7] [INFO] --- maven-jar-plugin:3.0.2:jar (default-jar) @ maven-invoker ---
[windows-jdk9] Sending interrupt signal to process
[Pipeline] [linux-jdk10] // stage
[Pipeline] [linux-jdk10] }
[Pipeline] [windows-jdk7] }
[Pipeline] [linux-jdk8] }
[Pipeline] [linux-jdk7] }
[Pipeline] [linux-jdk9] }
[Pipeline] [windows-jdk8] }
[Pipeline] [linux-jdk10] // node
[Pipeline] [windows-jdk7] // dir
[Pipeline] [linux-jdk8] // dir
[Pipeline] [linux-jdk7] // dir
[Pipeline] [linux-jdk9] // dir
[Pipeline] [windows-jdk8] // dir
[windows-jdk9] [INFO] 
[windows-jdk9] [INFO] Results:
[windows-jdk9] [INFO] 
[windows-jdk9] [INFO] Tests run: 0, Failures: 0, Errors: 0, Skipped: 0
[windows-jdk9] [INFO] 
[windows-jdk9] [ERROR] There are test failures.
[windows-jdk9] 
[windows-jdk9] Please refer to f:\jenkins\jenkins-slave\workspace\en-box_maven-invoker_master-HCCXFEN7E5KTKIBJMTWTPYV3ORNOOJFR3C7M7PLGD3SIXRDHEEJQ\m\target\surefire-reports
for the individual test results.
[windows-jdk9] Please refer to dump files (if any exist) [date]-jvmRun[N].dump, [date].dumpstream
and [date]-jvmRun[N].dumpstream.
[windows-jdk9] The forked VM terminated without properly saying goodbye. VM crash or System.exit
called?
[windows-jdk9] Command was cmd.exe /X /C "f:\jenkins\tools\java\latest9\bin\java --add-modules
java.se.ee -jar C:\Users\jenkins\AppData\Local\Temp\1\surefire12720429438243322171\surefirebooter18084623158579534215.jar
C:\Users\jenkins\AppData\Local\Temp\1\surefire12720429438243322171 2018-03-31T08-31-13_660-jvmRun1
surefire5224912845685070748tmp surefire_018238287944653382831tmp"
[windows-jdk9] Error occurred in starting fork, check output in log
[windows-jdk9] Process Exit Code: -1
[windows-jdk9] Crashed tests:
[windows-jdk9] org.apache.maven.shared.invoker.DefaultInvokerTest
[windows-jdk9] org.apache.maven.surefire.booter.SurefireBooterForkException: The forked VM
terminated without properly saying goodbye. VM crash or System.exit called?
[windows-jdk9] Command was cmd.exe /X /C "f:\jenkins\tools\java\latest9\bin\java --add-modules
java.se.ee -jar C:\Users\jenkins\AppData\Local\Temp\1\surefire12720429438243322171\surefirebooter18084623158579534215.jar
C:\Users\jenkins\AppData\Local\Temp\1\surefire12720429438243322171 2018-03-31T08-31-13_660-jvmRun1
surefire5224912845685070748tmp surefire_018238287944653382831tmp"
[windows-jdk9] Error occurred in starting fork, check output in log
[windows-jdk9] Process Exit Code: -1
[windows-jdk9] Crashed tests:
[windows-jdk9] org.apache.maven.shared.invoker.DefaultInvokerTest
[windows-jdk9] 	at org.apache.maven.plugin.surefire.booterclient.ForkStarter.fork(ForkStarter.java:686)
[windows-jdk9] 	at org.apache.maven.plugin.surefire.booterclient.ForkStarter.fork(ForkStarter.java:535)
[windows-jdk9] 	at org.apache.maven.plugin.surefire.booterclient.ForkStarter.run(ForkStarter.java:280)
[windows-jdk9] 	at org.apache.maven.plugin.surefire.booterclient.ForkStarter.run(ForkStarter.java:245)
[windows-jdk9] 	at org.apache.maven.plugin.surefire.AbstractSurefireMojo.executeProvider(AbstractSurefireMojo.java:1124)
[windows-jdk9] 	at org.apache.maven.plugin.surefire.AbstractSurefireMojo.executeAfterPreconditionsChecked(AbstractSurefireMojo.java:954)
[windows-jdk9] 	at org.apache.maven.plugin.surefire.AbstractSurefireMojo.execute(AbstractSurefireMojo.java:832)
[windows-jdk9] 	at org.apache.maven.plugin.DefaultBuildPluginManager.executeMojo(DefaultBuildPluginManager.java:134)
[windows-jdk9] 	at org.apache.maven.lifecycle.internal.MojoExecutor.execute(MojoExecutor.java:208)
[windows-jdk9] 	at org.apache.maven.lifecycle.internal.MojoExecutor.execute(MojoExecutor.java:154)
[windows-jdk9] 	at org.apache.maven.lifecycle.internal.MojoExecutor.execute(MojoExecutor.java:146)
[windows-jdk9] 	at org.apache.maven.lifecycle.internal.LifecycleModuleBuilder.buildProject(LifecycleModuleBuilder.java:117)
[windows-jdk9] 	at org.apache.maven.lifecycle.internal.LifecycleModuleBuilder.buildProject(LifecycleModuleBuilder.java:81)
[windows-jdk9] 	at org.apache.maven.lifecycle.internal.builder.singlethreaded.SingleThreadedBuilder.build(SingleThreadedBuilder.java:51)
[windows-jdk9] 	at org.apache.maven.lifecycle.internal.LifecycleStarter.execute(LifecycleStarter.java:128)
[windows-jdk9] 	at org.apache.maven.DefaultMaven.doExecute(DefaultMaven.java:309)
[windows-jdk9] 	at org.apache.maven.DefaultMaven.doExecute(DefaultMaven.java:194)
[windows-jdk9] 	at org.apache.maven.DefaultMaven.execute(DefaultMaven.java:107)
[windows-jdk9] 	at org.apache.maven.cli.MavenCli.execute(MavenCli.java:993)
[windows-jdk9] 	at org.apache.maven.cli.MavenCli.doMain(MavenCli.java:345)
[windows-jdk9] 	at org.apache.maven.cli.MavenCli.main(MavenCli.java:191)
[windows-jdk9] 	at java.base/jdk.internal.reflect.NativeMethodAccessorImpl.invoke0(Native
Method)
[windows-jdk9] 	at java.base/jdk.internal.reflect.NativeMethodAccessorImpl.invoke(NativeMethodAccessorImpl.java:62)
[windows-jdk9] 	at java.base/jdk.internal.reflect.DelegatingMethodAccessorImpl.invoke(DelegatingMethodAccessorImpl.java:43)
[windows-jdk9] 	at java.base/java.lang.reflect.Method.invoke(Method.java:564)
[windows-jdk9] 	at org.codehaus.plexus.classworlds.launcher.Launcher.launchEnhanced(Launcher.java:289)
[windows-jdk9] 	at org.codehaus.plexus.classworlds.launcher.Launcher.launch(Launcher.java:229)
[windows-jdk9] 	at org.codehaus.plexus.classworlds.launcher.Launcher.mainWithExitCode(Launcher.java:415)
[windows-jdk9] 	at org.codehaus.plexus.classworlds.launcher.Launcher.main(Launcher.java:356)
[windows-jdk9] 
[windows-jdk9] [INFO] 
[windows-jdk9] [INFO] --- maven-jar-plugin:3.0.2:jar (default-jar) @ maven-invoker ---
[windows-jdk9] [INFO] Downloading: https://repo.maven.apache.org/maven2/org/apache/maven/maven-archiver/3.1.1/maven-archiver-3.1.1.pom
[windows-jdk9] [INFO] Downloaded: https://repo.maven.apache.org/maven2/org/apache/maven/maven-archiver/3.1.1/maven-archiver-3.1.1.pom
(4.3 kB at 435 kB/s)
[windows-jdk9] [INFO] Downloading: https://repo.maven.apache.org/maven2/org/apache/maven/shared/maven-shared-utils/3.0.1/maven-shared-utils-3.0.1.pom
[windows-jdk9] [INFO] Downloaded: https://repo.maven.apache.org/maven2/org/apache/maven/shared/maven-shared-utils/3.0.1/maven-shared-utils-3.0.1.pom
(4.6 kB at 509 kB/s)
[windows-jdk9] [INFO] Downloading: https://repo.maven.apache.org/maven2/org/codehaus/plexus/plexus-archiver/3.3/plexus-archiver-3.3.pom
[windows-jdk9] [INFO] Downloaded: https://repo.maven.apache.org/maven2/org/codehaus/plexus/plexus-archiver/3.3/plexus-archiver-3.3.pom
(5.3 kB at 592 kB/s)
[windows-jdk9] [INFO] Downloading: https://repo.maven.apache.org/maven2/org/codehaus/plexus/plexus/3.2/plexus-3.2.pom
[windows-jdk9] [INFO] Downloaded: https://repo.maven.apache.org/maven2/org/codehaus/plexus/plexus/3.2/plexus-3.2.pom
(19 kB at 1.9 MB/s)
[windows-jdk9] [INFO] Downloading: https://repo.maven.apache.org/maven2/org/codehaus/plexus/plexus-io/2.7.1/plexus-io-2.7.1.pom
[windows-jdk9] [INFO] Downloaded: https://repo.maven.apache.org/maven2/org/codehaus/plexus/plexus-io/2.7.1/plexus-io-2.7.1.pom
(4.9 kB at 615 kB/s)
[windows-jdk9] [INFO] Downloading: https://repo.maven.apache.org/maven2/org/apache/commons/commons-compress/1.11/commons-compress-1.11.pom
[windows-jdk9] [INFO] Downloaded: https://repo.maven.apache.org/maven2/org/apache/commons/commons-compress/1.11/commons-compress-1.11.pom
(13 kB at 1.4 MB/s)
[windows-jdk9] [INFO] Downloading: https://repo.maven.apache.org/maven2/org/iq80/snappy/snappy/0.4/snappy-0.4.pom
[windows-jdk9] [INFO] Downloaded: https://repo.maven.apache.org/maven2/org/iq80/snappy/snappy/0.4/snappy-0.4.pom
(15 kB at 1.3 MB/s)
[windows-jdk9] [INFO] Downloading: https://repo.maven.apache.org/maven2/org/tukaani/xz/1.5/xz-1.5.pom
[Pipeline] [linux-jdk10] }
[Pipeline] [windows-jdk7] }
[windows-jdk7] [withMaven] One or multiple Maven executions have been ignored by the Jenkins
Pipeline Maven Plugin because they have been interrupted before completion (1). See Pipeline
Maven Plugin FAQ for more details.
[Pipeline] [linux-jdk8] }
[linux-jdk8] [withMaven] One or multiple Maven executions have been ignored by the Jenkins
Pipeline Maven Plugin because they have been interrupted before completion (1). See Pipeline
Maven Plugin FAQ for more details.
[Pipeline] [linux-jdk7] }
[linux-jdk7] [withMaven] One or multiple Maven executions have been ignored by the Jenkins
Pipeline Maven Plugin because they have been interrupted before completion (1). See Pipeline
Maven Plugin FAQ for more details.
[Pipeline] [linux-jdk9] }
[linux-jdk9] [withMaven] One or multiple Maven executions have been ignored by the Jenkins
Pipeline Maven Plugin because they have been interrupted before completion (1). See Pipeline
Maven Plugin FAQ for more details.
[Pipeline] [windows-jdk8] }
[windows-jdk8] [withMaven] One or multiple Maven executions have been ignored by the Jenkins
Pipeline Maven Plugin because they have been interrupted before completion (1). See Pipeline
Maven Plugin FAQ for more details.
[Pipeline] [windows-jdk7] // withMaven
[Pipeline] [linux-jdk8] // withMaven
[Pipeline] [linux-jdk7] // withMaven
[Pipeline] [linux-jdk9] // withMaven
[Pipeline] [windows-jdk8] // withMaven
[Pipeline] [windows-jdk7] echo
[windows-jdk7] [FAIL FAST] windows-jdk10 had first failure, ignoring script returned exit
code -1
[Pipeline] [windows-jdk7] }
[Pipeline] [linux-jdk8] echo
[linux-jdk8] [FAIL FAST] windows-jdk10 had first failure, ignoring script returned exit code
143
[Pipeline] [linux-jdk8] }
[Pipeline] [linux-jdk7] echo
[linux-jdk7] [FAIL FAST] windows-jdk10 had first failure, ignoring script returned exit code
143
[Pipeline] [linux-jdk7] }
[Pipeline] [linux-jdk9] echo
[linux-jdk9] [FAIL FAST] windows-jdk10 had first failure, ignoring script returned exit code
143
[Pipeline] [linux-jdk9] }
[Pipeline] [windows-jdk8] echo
[windows-jdk8] [FAIL FAST] windows-jdk10 had first failure, ignoring script returned exit
code -1
[Pipeline] [windows-jdk8] }
[Pipeline] [windows-jdk7] // stage
[Pipeline] [linux-jdk8] // stage
[Pipeline] [linux-jdk7] // stage
[Pipeline] [linux-jdk9] // stage
[Pipeline] [windows-jdk8] // stage
[Pipeline] [linux-jdk7] }
[Pipeline] [linux-jdk8] }
[Pipeline] [linux-jdk9] }
[Pipeline] [windows-jdk7] }
[Pipeline] [windows-jdk8] }
[Pipeline] [linux-jdk7] // node
[Pipeline] [linux-jdk8] // node
[Pipeline] [linux-jdk9] // node
[Pipeline] [windows-jdk7] // node
[Pipeline] [windows-jdk8] // node
[Pipeline] [linux-jdk7] }
[Pipeline] [linux-jdk8] }
[Pipeline] [linux-jdk9] }
[Pipeline] [windows-jdk7] }
[Pipeline] [windows-jdk8] }
[windows-jdk9] After 10s process did not stop
[Pipeline] [windows-jdk9] }
[Pipeline] [windows-jdk9] // dir
[Pipeline] [windows-jdk9] }
[windows-jdk9] [withMaven] One or multiple Maven executions have been ignored by the Jenkins
Pipeline Maven Plugin because they have been interrupted before completion (1). See Pipeline
Maven Plugin FAQ for more details.
[Pipeline] [windows-jdk9] // withMaven
[Pipeline] [windows-jdk9] echo
[windows-jdk9] [FAIL FAST] windows-jdk10 had first failure, ignoring null
[Pipeline] [windows-jdk9] }
[Pipeline] [windows-jdk9] // stage
[Pipeline] [windows-jdk9] }
[Pipeline] [windows-jdk9] // node
[Pipeline] [windows-jdk9] }
[Pipeline] // parallel
[Pipeline] echo
***** FAST FAILURE *****

Fast failure triggered by windows-jdk10

***** FAST FAILURE *****
[Pipeline] stage
[Pipeline] { (Notifications)
[Pipeline] echo
Build result: FAILURE
[Pipeline] jiraIssueSelector
[Pipeline] emailext
Mime
  • Unnamed multipart/mixed (inline, None, 0 bytes)
View raw message