maven-notifications mailing list archives

Site index · List index
Message view « Date » · « Thread »
Top « Date » · « Thread »
From Apache Jenkins Server <jenk...@builds.apache.org>
Subject Build failed in Jenkins: Maven TLP » maven-compiler-plugin » TEST_TO_FIX_MCOMPILER-192 #15
Date Sun, 25 Mar 2018 19:02:55 GMT
See https://builds.apache.org/job/maven-box/job/maven-compiler-plugin/job/TEST_TO_FIX_MCOMPILER-192/15/

Changes:

* Try to fix MCOMPILER-197
* Try to fix MCOMPILER-197
* Try to fix MCOMPILER-197
* Try to fix MCOMPILER-197

All tests passed

Build log:
[...truncated 374.70 KB...]
[windows-jdk7] [INFO] There is 1 error reported by Checkstyle 6.18 with config/maven_checks.xml
ruleset.
[windows-jdk7] [INFO] Ignored 1 error, 0 violation remaining.
[windows-jdk7] [INFO] 
[windows-jdk7] [INFO] --- maven-invoker-plugin:3.0.1:verify (integration-test) @ maven-compiler-plugin
---
[windows-jdk7] [INFO] -------------------------------------------------
[windows-jdk7] [INFO] Build Summary:
[windows-jdk7] [INFO]   Passed: 24, Failed: 0, Errors: 0, Skipped: 19
[windows-jdk7] [INFO] -------------------------------------------------
[windows-jdk7] [INFO] ------------------------------------------------------------------------
[windows-jdk7] [INFO] BUILD SUCCESS
[windows-jdk7] [INFO] ------------------------------------------------------------------------
[windows-jdk7] [INFO] Total time: 02:52 min
[windows-jdk7] [INFO] Finished at: 2018-03-25T19:00:30Z
[windows-jdk7] [INFO] Final Memory: 60M/1041M
[windows-jdk7] [INFO] ------------------------------------------------------------------------
[windows-jdk7] [INFO] [jenkins-event-spy] Generated F:\jenkins\jenkins-slave\workspace\n_TEST_TO_FIX_MCOMPILER-192-EJZ35UAEPCX3IH57D2YA4NCSBBIRCVCD4L4Y7IFGSVZP6VXNNVFA@tmp\withMaven1694896c\maven-spy-20180325-185737-8196174034280960459403.log
[windows-jdk8] [INFO] run post-build script verify.bsh
[windows-jdk8] [INFO]           MCOMPILER-284\pom.xml ............................ SUCCESS
(2.8 s)
[windows-jdk8] [INFO] Building: MCOMPILER-294\pom.xml
[windows-jdk8] [INFO]           MCOMPILER-294\pom.xml ............................ SKIPPED
due to JRE version
[windows-jdk8] [INFO] Building: MCOMPILER-298\pom.xml
[windows-jdk7] Picked up JAVA_TOOL_OPTIONS: -Dmaven.ext.class.path="f:\jenkins\jenkins-slave\workspace\n_TEST_TO_FIX_MCOMPILER-192-EJZ35UAEPCX3IH57D2YA4NCSBBIRCVCD4L4Y7IFGSVZP6VXNNVFA@tmp\withMaven1694896c\pipeline-maven-spy.jar"
-Dorg.jenkinsci.plugins.pipeline.maven.reportsFolder="f:\jenkins\jenkins-slave\workspace\n_TEST_TO_FIX_MCOMPILER-192-EJZ35UAEPCX3IH57D2YA4NCSBBIRCVCD4L4Y7IFGSVZP6VXNNVFA@tmp\withMaven1694896c"

[Pipeline] [windows-jdk7] }
[Pipeline] [windows-jdk7] // dir
[Pipeline] [windows-jdk7] }
[windows-jdk7] [withMaven] junitPublisher - Archive test results for Maven artifact org.apache.maven.plugins:maven-compiler-plugin:3.7.1-SNAPSHOT
generated by maven-surefire-plugin:test (default-test): m\target\surefire-reports\*.xml
[windows-jdk7] [withMaven] junitPublisher - Jenkins JUnit Attachments Plugin not found, can't
publish test attachments.Recording test results
[Pipeline] [windows-jdk7] // withMaven
[Pipeline] [windows-jdk7] }
[Pipeline] [windows-jdk7] // stage
[Pipeline] [windows-jdk7] }
[Pipeline] [windows-jdk7] // node
[Pipeline] [windows-jdk7] }
[windows-jdk9] [INFO]           MCOMPILER-170\pom.xml ............................ SUCCESS
(5.1 s)
[windows-jdk9] [INFO] Building: mcompiler-179\pom.xml
[linux-jdk9] [INFO]           MCOMPILER-203-processorpath/pom.xml .............. SUCCESS (9.2
s)
[linux-jdk9] [INFO] Building: MCOMPILER-192/pom.xml
[windows-jdk8] [INFO]           MCOMPILER-298\pom.xml ............................ SUCCESS
(6.4 s)
[windows-jdk8] [INFO] Building: MCOMPILER-322_release10\pom.xml
[windows-jdk8] [INFO]           MCOMPILER-322_release10\pom.xml .................. SKIPPED
due to JRE version
[windows-jdk8] [INFO] Building: non-english-warnings\pom.xml
[linux-jdk9] [INFO] run post-build script verify.groovy
[linux-jdk9] [INFO]           MCOMPILER-192/pom.xml ............................ SUCCESS (3.3
s)
[linux-jdk9] [INFO] Building: jdk16-annotation/pom.xml
[windows-jdk8] [INFO] run post-build script verify.bsh
[windows-jdk8] [INFO]           non-english-warnings\pom.xml ..................... SUCCESS
(2.6 s)
[windows-jdk8] [INFO] Building: test1\pom.xml
[windows-jdk9] [INFO] run post-build script verify.groovy
[windows-jdk9] [INFO]           mcompiler-179\pom.xml ............................ SUCCESS
(4.3 s)
[windows-jdk9] [INFO] Building: mcompiler-182\pom.xml
[linux-jdk9] [INFO] run post-build script verify.bsh
[windows-jdk8] [INFO]           test1\pom.xml .................................... SUCCESS
(2.7 s)
[windows-jdk8] [INFO] 
[windows-jdk8] [INFO] --- maven-checkstyle-plugin:3.0.0:check (checkstyle-check) @ maven-compiler-plugin
---
[linux-jdk9] [INFO]           jdk16-annotation/pom.xml ......................... SUCCESS (3.8
s)
[linux-jdk9] [INFO] Building: default-incremental-disable/pom.xml
[windows-jdk8] [INFO] There is 1 error reported by Checkstyle 6.18 with config/maven_checks.xml
ruleset.
[windows-jdk8] [INFO] Ignored 1 error, 0 violation remaining.
[windows-jdk8] [INFO] 
[windows-jdk8] [INFO] --- maven-invoker-plugin:3.0.1:verify (integration-test) @ maven-compiler-plugin
---
[windows-jdk8] [INFO] -------------------------------------------------
[windows-jdk8] [INFO] Build Summary:
[windows-jdk8] [INFO]   Passed: 27, Failed: 0, Errors: 0, Skipped: 16
[windows-jdk8] [INFO] -------------------------------------------------
[windows-jdk8] [INFO] ------------------------------------------------------------------------
[windows-jdk8] [INFO] BUILD SUCCESS
[windows-jdk8] [INFO] ------------------------------------------------------------------------
[windows-jdk8] [INFO] Total time: 03:02 min
[windows-jdk8] [INFO] Finished at: 2018-03-25T19:00:41Z
[windows-jdk8] [INFO] Final Memory: 61M/880M
[windows-jdk8] [INFO] ------------------------------------------------------------------------
[windows-jdk8] [INFO] [jenkins-event-spy] Generated F:\jenkins\jenkins-slave\workspace\n_TEST_TO_FIX_MCOMPILER-192-EJZ35UAEPCX3IH57D2YA4NCSBBIRCVCD4L4Y7IFGSVZP6VXNNVFA@2@tmp\withMavenbef9a8c2\maven-spy-20180325-185739-4681583821798034912998.log
[windows-jdk8] Picked up JAVA_TOOL_OPTIONS: -Dmaven.ext.class.path="f:\jenkins\jenkins-slave\workspace\n_TEST_TO_FIX_MCOMPILER-192-EJZ35UAEPCX3IH57D2YA4NCSBBIRCVCD4L4Y7IFGSVZP6VXNNVFA@2@tmp\withMavenbef9a8c2\pipeline-maven-spy.jar"
-Dorg.jenkinsci.plugins.pipeline.maven.reportsFolder="f:\jenkins\jenkins-slave\workspace\n_TEST_TO_FIX_MCOMPILER-192-EJZ35UAEPCX3IH57D2YA4NCSBBIRCVCD4L4Y7IFGSVZP6VXNNVFA@2@tmp\withMavenbef9a8c2"

[Pipeline] [windows-jdk8] }
[Pipeline] [windows-jdk8] // dir
[Pipeline] [windows-jdk8] }
[windows-jdk8] [withMaven] junitPublisher - Archive test results for Maven artifact org.apache.maven.plugins:maven-compiler-plugin:3.7.1-SNAPSHOT
generated by maven-surefire-plugin:test (default-test): m\target\surefire-reports\*.xml
[windows-jdk8] [withMaven] junitPublisher - Jenkins JUnit Attachments Plugin not found, can't
publish test attachments.Recording test results
[Pipeline] [windows-jdk8] // withMaven
[Pipeline] [windows-jdk8] }
[Pipeline] [windows-jdk8] // stage
[Pipeline] [windows-jdk8] }
[Pipeline] [windows-jdk8] // node
[Pipeline] [windows-jdk8] }
[linux-jdk9] [INFO] run post-build script verify.groovy
[linux-jdk9] [INFO]           default-incremental-disable/pom.xml .............. SUCCESS (6.6
s)
[linux-jdk9] [INFO] Building: jpms_patch-module/pom.xml
[linux-jdk9] [INFO] run post-build script verify.groovy
[linux-jdk9] [INFO]           jpms_patch-module/pom.xml ........................ SUCCESS (3.7
s)
[linux-jdk9] [INFO] Building: includes-excludes/pom.xml
[linux-jdk9] [INFO] run post-build script verify.bsh
[linux-jdk9] [INFO]           includes-excludes/pom.xml ........................ SUCCESS (3.4
s)
[linux-jdk9] [INFO] Building: default/pom.xml
[windows-jdk9] [INFO] run post-build script verify.groovy
[windows-jdk9] [INFO]           mcompiler-182\pom.xml ............................ SUCCESS
(18.7 s)
[windows-jdk9] [INFO] Building: MCOMPILER-190\pom.xml
[linux-jdk9] [INFO] run post-build script verify.bsh
[linux-jdk9] [INFO]           default/pom.xml .................................. SUCCESS (3.5
s)
[linux-jdk9] [INFO] Building: MCOMPILER-228/pom.xml
[windows-jdk9] [INFO]           MCOMPILER-190\pom.xml ............................ SUCCESS
(5.5 s)
[windows-jdk9] [INFO] Building: MCOMPILER-192\pom.xml
[linux-jdk9] [INFO]           MCOMPILER-228/pom.xml ............................ SUCCESS (3.5
s)
[linux-jdk9] [INFO] Building: MCOMPILER-224/pom.xml
[linux-jdk9] [INFO] run post-build script verify.groovy
[linux-jdk9] [INFO]           MCOMPILER-224/pom.xml ............................ SUCCESS (4.1
s)
[linux-jdk9] [INFO] Building: jpms_add-exports/pom.xml
[windows-jdk9] [INFO] run post-build script verify.groovy
[windows-jdk9] [INFO]           MCOMPILER-192\pom.xml ............................ SUCCESS
(4.8 s)
[windows-jdk9] [INFO] Building: MCOMPILER-197\pom.xml
[linux-jdk9] [INFO] run post-build script verify.groovy
[linux-jdk9] [INFO]           jpms_add-exports/pom.xml ......................... SUCCESS (3.8
s)
[linux-jdk9] [INFO] Building: MCOMPILER-294/pom.xml
[windows-jdk9] [INFO] run post-build script verify.groovy
[windows-jdk9] [INFO]           MCOMPILER-197\pom.xml ............................ FAILED
(5.2 s)
[windows-jdk9] [INFO]   The post-build script did not succeed. assert sourceFile.exists()
[windows-jdk9]        |          |
[windows-jdk9]        |          false
[windows-jdk9]        f:\jenkins\jenkins-slave\workspace\n_TEST_TO_FIX_MCOMPILER-192-EJZ35UAEPCX3IH57D2YA4NCSBBIRCVCD4L4Y7IFGSVZP6VXNNVFA\m\target\it\MCOMPILER-197\target\generated-sources\org\issue\Person_.java
[windows-jdk9] [INFO] Building: MCOMPILER-203-processorpath\pom.xml
[linux-jdk9] [INFO]           MCOMPILER-294/pom.xml ............................ SUCCESS (3.8
s)
[linux-jdk9] [INFO] Building: MCOMPILER-322_release10/pom.xml
[linux-jdk9] [INFO]           MCOMPILER-322_release10/pom.xml .................. SKIPPED due
to JRE version
[linux-jdk9] [INFO] 
[linux-jdk9] [INFO] --- maven-checkstyle-plugin:3.0.0:check (checkstyle-check) @ maven-compiler-plugin
---
[linux-jdk9] [INFO] There is 1 error reported by Checkstyle 6.18 with config/maven_checks.xml
ruleset.
[linux-jdk9] [INFO] Ignored 1 error, 0 violation remaining.
[linux-jdk9] [INFO] 
[linux-jdk9] [INFO] --- maven-invoker-plugin:3.0.1:verify (integration-test) @ maven-compiler-plugin
---
[linux-jdk9] [INFO] -------------------------------------------------
[linux-jdk9] [INFO] Build Summary:
[linux-jdk9] [INFO]   Passed: 40, Failed: 2, Errors: 0, Skipped: 1
[linux-jdk9] [INFO] -------------------------------------------------
[linux-jdk9] [ERROR] The following builds failed:
[linux-jdk9] [ERROR] *  MCOMPILER-197/pom.xml
[linux-jdk9] [ERROR] *  groovy-project-with-new-plexus-compiler/pom.xml
[linux-jdk9] [INFO] -------------------------------------------------
[linux-jdk9] [INFO] ------------------------------------------------------------------------
[linux-jdk9] [INFO] BUILD FAILURE
[linux-jdk9] [INFO] ------------------------------------------------------------------------
[linux-jdk9] [INFO] Total time: 03:42 min
[linux-jdk9] [INFO] Finished at: 2018-03-25T19:01:14Z
[linux-jdk9] [INFO] Final Memory: 62M/208M
[linux-jdk9] [INFO] ------------------------------------------------------------------------
[linux-jdk9] [INFO] [jenkins-event-spy] Generated /home/jenkins/jenkins-slave/workspace/n_TEST_TO_FIX_MCOMPILER-192-EJZ35UAEPCX3IH57D2YA4NCSBBIRCVCD4L4Y7IFGSVZP6VXNNVFA@tmp/withMaven0d8cd6e7/maven-spy-20180325-185731-8804113213304973800946.log
[linux-jdk9] [ERROR] Failed to execute goal org.apache.maven.plugins:maven-invoker-plugin:3.0.1:verify
(integration-test) on project maven-compiler-plugin: 2 builds failed. See console output above
for details. -> [Help 1]
[linux-jdk9] [ERROR] 
[linux-jdk9] [ERROR] To see the full stack trace of the errors, re-run Maven with the -e switch.
[linux-jdk9] [ERROR] Re-run Maven using the -X switch to enable full debug logging.
[linux-jdk9] [ERROR] 
[linux-jdk9] [ERROR] For more information about the errors and possible solutions, please
read the following articles:
[linux-jdk9] [ERROR] [Help 1] http://cwiki.apache.org/confluence/display/MAVEN/MojoFailureException
[Pipeline] [linux-jdk9] }
[Pipeline] [linux-jdk9] // dir
[Pipeline] [linux-jdk9] }
[linux-jdk9] [withMaven] junitPublisher - Archive test results for Maven artifact org.apache.maven.plugins:maven-compiler-plugin:3.7.1-SNAPSHOT
generated by maven-surefire-plugin:test (default-test): m/target/surefire-reports/*.xml
[linux-jdk9] [withMaven] junitPublisher - Jenkins JUnit Attachments Plugin not found, can't
publish test attachments.Recording test results
[Pipeline] [linux-jdk9] // withMaven
[Pipeline] [linux-jdk9] }
[Pipeline] [linux-jdk9] // stage
[Pipeline] [linux-jdk9] }
[Pipeline] [linux-jdk9] // node
[Pipeline] [linux-jdk9] }
[linux-jdk9] Failed in branch linux-jdk9
[windows-jdk9] [INFO]           MCOMPILER-203-processorpath\pom.xml .............. SUCCESS
(11.7 s)
[windows-jdk9] [INFO] Building: mcompiler-21_class-remove\pom.xml
[windows-jdk9] [INFO] run post-build script verify.groovy
[windows-jdk9] [INFO]           mcompiler-21_class-remove\pom.xml ................ SUCCESS
(14.6 s)
[windows-jdk9] [INFO] Building: mcompiler-21_methodname-change\pom.xml
[windows-jdk9] [INFO] run post-build script verify.groovy
[windows-jdk9] [INFO]           mcompiler-21_methodname-change\pom.xml ........... SUCCESS
(15.1 s)
[windows-jdk9] [INFO] Building: MCOMPILER-224\pom.xml
[windows-jdk9] [INFO] run post-build script verify.groovy
[windows-jdk9] [INFO]           MCOMPILER-224\pom.xml ............................ SUCCESS
(5.0 s)
[windows-jdk9] [INFO] Building: MCOMPILER-228\pom.xml
[windows-jdk9] [INFO]           MCOMPILER-228\pom.xml ............................ SUCCESS
(5.0 s)
[windows-jdk9] [INFO] Building: MCOMPILER-260_customArguments\pom.xml
[windows-jdk9] [INFO]           MCOMPILER-260_customArguments\pom.xml ............ SUCCESS
(4.2 s)
[windows-jdk9] [INFO] Building: MCOMPILER-268_modulepath\pom.xml
[windows-jdk9] [INFO] run post-build script verify.groovy
[windows-jdk9] [INFO]           MCOMPILER-268_modulepath\pom.xml ................. SUCCESS
(6.5 s)
[windows-jdk9] [INFO] Building: MCOMPILER-270_release\pom.xml
[windows-jdk9] [INFO] run post-build script verify.groovy
[windows-jdk9] [INFO]           MCOMPILER-270_release\pom.xml .................... SUCCESS
(4.8 s)
[windows-jdk9] [INFO] Building: MCOMPILER-275_separate-moduleinfo\pom.xml
[windows-jdk9] [INFO] run post-build script verify.groovy
[windows-jdk9] [INFO]           MCOMPILER-275_separate-moduleinfo\pom.xml ........ SUCCESS
(4.7 s)
[windows-jdk9] [INFO] Building: MCOMPILER-284\pom.xml
[windows-jdk9] [INFO] run post-build script verify.bsh
[windows-jdk9] [INFO]           MCOMPILER-284\pom.xml ............................ SUCCESS
(4.3 s)
[windows-jdk9] [INFO] Building: MCOMPILER-294\pom.xml
[windows-jdk9] [INFO]           MCOMPILER-294\pom.xml ............................ SUCCESS
(5.4 s)
[windows-jdk9] [INFO] Building: MCOMPILER-298\pom.xml
[windows-jdk9] [INFO]           MCOMPILER-298\pom.xml ............................ SUCCESS
(7.0 s)
[windows-jdk9] [INFO] Building: MCOMPILER-322_release10\pom.xml
[windows-jdk9] [INFO]           MCOMPILER-322_release10\pom.xml .................. SKIPPED
due to JRE version
[windows-jdk9] [INFO] Building: non-english-warnings\pom.xml
[windows-jdk9] [INFO] run post-build script verify.bsh
[windows-jdk9] [INFO]           non-english-warnings\pom.xml ..................... SUCCESS
(5.1 s)
[windows-jdk9] [INFO] Building: test1\pom.xml
[windows-jdk9] [INFO]           test1\pom.xml .................................... SUCCESS
(5.2 s)
[windows-jdk9] [INFO] 
[windows-jdk9] [INFO] --- maven-checkstyle-plugin:3.0.0:check (checkstyle-check) @ maven-compiler-plugin
---
[windows-jdk9] [INFO] There is 1 error reported by Checkstyle 6.18 with config/maven_checks.xml
ruleset.
[windows-jdk9] [INFO] Ignored 1 error, 0 violation remaining.
[windows-jdk9] [INFO] 
[windows-jdk9] [INFO] --- maven-invoker-plugin:3.0.1:verify (integration-test) @ maven-compiler-plugin
---
[windows-jdk9] [INFO] -------------------------------------------------
[windows-jdk9] [INFO] Build Summary:
[windows-jdk9] [INFO]   Passed: 40, Failed: 2, Errors: 0, Skipped: 1
[windows-jdk9] [INFO] -------------------------------------------------
[windows-jdk9] [ERROR] The following builds failed:
[windows-jdk9] [ERROR] *  groovy-project-with-new-plexus-compiler\pom.xml
[windows-jdk9] [ERROR] *  MCOMPILER-197\pom.xml
[windows-jdk9] [INFO] -------------------------------------------------
[windows-jdk9] [INFO] ------------------------------------------------------------------------
[windows-jdk9] [INFO] BUILD FAILURE
[windows-jdk9] [INFO] ------------------------------------------------------------------------
[windows-jdk9] [INFO] Total time: 05:10 min
[windows-jdk9] [INFO] Finished at: 2018-03-25T19:02:51Z
[windows-jdk9] [INFO] Final Memory: 54M/179M
[windows-jdk9] [INFO] ------------------------------------------------------------------------
[windows-jdk9] [INFO] [jenkins-event-spy] Generated F:\jenkins\jenkins-slave\workspace\n_TEST_TO_FIX_MCOMPILER-192-EJZ35UAEPCX3IH57D2YA4NCSBBIRCVCD4L4Y7IFGSVZP6VXNNVFA@tmp\withMaven599d9abc\maven-spy-20180325-185741-15215149287758594558420.log
[windows-jdk9] [ERROR] Failed to execute goal org.apache.maven.plugins:maven-invoker-plugin:3.0.1:verify
(integration-test) on project maven-compiler-plugin: 2 builds failed. See console output above
for details. -> [Help 1]
[windows-jdk9] [ERROR] 
[windows-jdk9] [ERROR] To see the full stack trace of the errors, re-run Maven with the -e
switch.
[windows-jdk9] [ERROR] Re-run Maven using the -X switch to enable full debug logging.
[windows-jdk9] [ERROR] 
[windows-jdk9] [ERROR] For more information about the errors and possible solutions, please
read the following articles:
[windows-jdk9] [ERROR] [Help 1] http://cwiki.apache.org/confluence/display/MAVEN/MojoFailureException
[Pipeline] [windows-jdk9] }
[Pipeline] [windows-jdk9] // dir
[Pipeline] [windows-jdk9] }
[windows-jdk9] [withMaven] junitPublisher - Archive test results for Maven artifact org.apache.maven.plugins:maven-compiler-plugin:3.7.1-SNAPSHOT
generated by maven-surefire-plugin:test (default-test): m\target\surefire-reports\*.xml
[windows-jdk9] [withMaven] junitPublisher - Jenkins JUnit Attachments Plugin not found, can't
publish test attachments.Recording test results
[Pipeline] [windows-jdk9] // withMaven
[Pipeline] [windows-jdk9] }
[Pipeline] [windows-jdk9] // stage
[Pipeline] [windows-jdk9] }
[Pipeline] [windows-jdk9] // node
[Pipeline] [windows-jdk9] }
[windows-jdk9] Failed in branch windows-jdk9
[Pipeline] // parallel
[Pipeline] stage
[Pipeline] { (Notifications)
[Pipeline] echo
Build result: FAILURE
[Pipeline] jiraIssueSelector
[Pipeline] jiraComment
[Pipeline] emailext
Mime
  • Unnamed multipart/mixed (inline, None, 0 bytes)
View raw message