maven-notifications mailing list archives

Site index · List index
Message view « Date » · « Thread »
Top « Date » · « Thread »
From Apache Jenkins Server <jenk...@builds.apache.org>
Subject Build failed in Jenkins: Maven TLP » maven-compiler-plugin » TEST_TO_FIX_MCOMPILER-192 #9
Date Sun, 25 Mar 2018 18:04:49 GMT
See https://builds.apache.org/job/maven-box/job/maven-compiler-plugin/job/TEST_TO_FIX_MCOMPILER-192/9/

Changes:

* Trying to fix groovy-project-with-new-plexus-compiler
* Trying to fix groovy-project-with-new-plexus-compiler
* Trying to fix groovy-project-with-new-plexus-compiler
* Trying to fix groovy-project-with-new-plexus-compiler
* Trying to fix groovy-project-with-new-plexus-compiler
* Trying to fix groovy-project-with-new-plexus-compiler

No tests ran.

Build log:
[...truncated 61.62 KB...]
[windows-jdk9] [INFO] Rat check: Summary over all files. Unapproved: 1, unknown: 1, generated:
0, approved: 317 licenses.
[windows-jdk9] [INFO] ------------------------------------------------------------------------
[windows-jdk9] [INFO] BUILD FAILURE
[windows-jdk9] [INFO] ------------------------------------------------------------------------
[windows-jdk9] [INFO] Total time: 5.296 s
[windows-jdk9] [INFO] Finished at: 2018-03-25T18:04:39Z
[windows-jdk9] [INFO] Final Memory: 20M/68M
[windows-jdk9] [INFO] ------------------------------------------------------------------------
[windows-jdk9] [INFO] [jenkins-event-spy] Generated F:\jenkins\jenkins-slave\workspace\n_TEST_TO_FIX_MCOMPILER-192-EJZ35UAEPCX3IH57D2YA4NCSBBIRCVCD4L4Y7IFGSVZP6VXNNVFA@tmp\withMaven565d1b83\maven-spy-20180325-180433-5363880651489185576983.log
[windows-jdk9] [ERROR] Failed to execute goal org.apache.rat:apache-rat-plugin:0.12:check
(rat-check) on project maven-compiler-plugin: Too many files with unapproved license: 1 See
RAT report in: f:\jenkins\jenkins-slave\workspace\n_TEST_TO_FIX_MCOMPILER-192-EJZ35UAEPCX3IH57D2YA4NCSBBIRCVCD4L4Y7IFGSVZP6VXNNVFA\m\target\rat.txt
-> [Help 1]
[windows-jdk9] [ERROR] 
[windows-jdk9] [ERROR] To see the full stack trace of the errors, re-run Maven with the -e
switch.
[windows-jdk9] [ERROR] Re-run Maven using the -X switch to enable full debug logging.
[windows-jdk9] [ERROR] 
[windows-jdk9] [ERROR] For more information about the errors and possible solutions, please
read the following articles:
[windows-jdk9] [ERROR] [Help 1] http://cwiki.apache.org/confluence/display/MAVEN/MojoFailureException
[linux-jdk7] [INFO] 
[linux-jdk7] [INFO] --- maven-enforcer-plugin:1.4.1:enforce (enforce-maven-version) @ maven-compiler-plugin
---
[linux-jdk7] [INFO] 
[linux-jdk7] [INFO] --- maven-enforcer-plugin:1.4.1:enforce (ban-known-bad-maven-versions)
@ maven-compiler-plugin ---
[linux-jdk7] [INFO] 
[linux-jdk7] [INFO] --- maven-enforcer-plugin:1.4.1:enforce (ensure-no-container-api) @ maven-compiler-plugin
---
[linux-jdk7] [WARNING] Failure to transfer org.codehaus.groovy:groovy-eclipse-batch/maven-metadata.xml
from http://repository.codehaus.org was cached in the local repository, resolution will not
be reattempted until the update interval of codehaus.org has elapsed or updates are forced.
Original error: Could not transfer metadata org.codehaus.groovy:groovy-eclipse-batch/maven-metadata.xml
from/to codehaus.org (http://repository.codehaus.org): repository.codehaus.org: Name or service
not known
[linux-jdk7] [WARNING] Failure to transfer org.codehaus.groovy:groovy-eclipse-batch/maven-metadata.xml
from http://nexus.codehaus.org/snapshots/ was cached in the local repository, resolution will
not be reattempted until the update interval of codehaus-snapshots has elapsed or updates
are forced. Original error: Could not transfer metadata org.codehaus.groovy:groovy-eclipse-batch/maven-metadata.xml
from/to codehaus-snapshots (http://nexus.codehaus.org/snapshots/): nexus.codehaus.org: Name
or service not known
[Pipeline] [linux-jdk9] isUnix
[Pipeline] [linux-jdk9] sh
[linux-jdk9] [m] Running shell script
[linux-jdk9] + mvn -P+run-its -Dmaven.test.failure.ignore=true -Dfindbugs.failOnError=false
-Dfindbugs.skip=true clean verify
[linux-jdk9] ----- withMaven Wrapper script -----
[linux-jdk9] Picked up JAVA_TOOL_OPTIONS: -Dmaven.ext.class.path="/home/jenkins/jenkins-slave/workspace/n_TEST_TO_FIX_MCOMPILER-192-EJZ35UAEPCX3IH57D2YA4NCSBBIRCVCD4L4Y7IFGSVZP6VXNNVFA@tmp/withMavenacf1db9b/pipeline-maven-spy.jar"
-Dorg.jenkinsci.plugins.pipeline.maven.reportsFolder="/home/jenkins/jenkins-slave/workspace/n_TEST_TO_FIX_MCOMPILER-192-EJZ35UAEPCX3IH57D2YA4NCSBBIRCVCD4L4Y7IFGSVZP6VXNNVFA@tmp/withMavenacf1db9b"

[linux-jdk9] Apache Maven 3.5.2 (138edd61fd100ec658bfa2d307c43b76940a5d7d; 2017-10-18T07:58:13Z)
[linux-jdk9] Maven home: /home/jenkins/tools/maven/apache-maven-3.5.2
[linux-jdk9] Java version: 9.0.1, vendor: Oracle Corporation
[linux-jdk9] Java home: /usr/local/asfpackages/java/jdk-9.0.1
[linux-jdk9] Default locale: en_US, platform encoding: ISO-8859-1
[linux-jdk9] OS name: "linux", version: "4.4.0-43-generic", arch: "amd64", family: "unix"
[Pipeline] [windows-jdk7] isUnix
[Pipeline] [windows-jdk7] bat
[windows-jdk7] [m] Running batch script
[windows-jdk7] 
[windows-jdk7] f:\jenkins\jenkins-slave\workspace\n_TEST_TO_FIX_MCOMPILER-192-EJZ35UAEPCX3IH57D2YA4NCSBBIRCVCD4L4Y7IFGSVZP6VXNNVFA\m>mvn
-P+run-its -Dmaven.test.failure.ignore=true -Dfindbugs.failOnError=false -Dfindbugs.skip=true
clean verify 
[windows-jdk7] ----- withMaven Wrapper script -----
[windows-jdk7] Apache Maven 3.5.0 (ff8f5e7444045639af65f6095c62210b5713f426; 2017-04-03T19:39:06Z)
[windows-jdk7] Maven home: F:\jenkins\tools\maven\apache-maven-3.5.0\bin\..
[windows-jdk7] Java version: 1.7.0_79, vendor: Oracle Corporation
[windows-jdk7] Java home: f:\jenkins\tools\java\latest1.7\jre
[windows-jdk7] Default locale: en_US, platform encoding: Cp1252
[windows-jdk7] OS name: "windows server 2012 r2", version: "6.3", arch: "amd64", family: "windows"
[Pipeline] [windows-jdk8] isUnix
[Pipeline] [windows-jdk8] bat
[linux-jdk8] [INFO] 
[linux-jdk8] [INFO] --- maven-enforcer-plugin:1.4.1:enforce (enforce-maven-version) @ maven-compiler-plugin
---
[linux-jdk8] [INFO] 
[linux-jdk8] [INFO] --- maven-enforcer-plugin:1.4.1:enforce (ban-known-bad-maven-versions)
@ maven-compiler-plugin ---
[linux-jdk8] [INFO] 
[linux-jdk8] [INFO] --- maven-enforcer-plugin:1.4.1:enforce (ensure-no-container-api) @ maven-compiler-plugin
---
[linux-jdk8] [WARNING] Failure to transfer org.codehaus.groovy:groovy-eclipse-batch/maven-metadata.xml
from http://repository.codehaus.org was cached in the local repository, resolution will not
be reattempted until the update interval of codehaus.org has elapsed or updates are forced.
Original error: Could not transfer metadata org.codehaus.groovy:groovy-eclipse-batch/maven-metadata.xml
from/to codehaus.org (http://repository.codehaus.org): repository.codehaus.org: Name or service
not known
[linux-jdk8] [WARNING] Failure to transfer org.codehaus.groovy:groovy-eclipse-batch/maven-metadata.xml
from http://nexus.codehaus.org/snapshots/ was cached in the local repository, resolution will
not be reattempted until the update interval of codehaus-snapshots has elapsed or updates
are forced. Original error: Could not transfer metadata org.codehaus.groovy:groovy-eclipse-batch/maven-metadata.xml
from/to codehaus-snapshots (http://nexus.codehaus.org/snapshots/): nexus.codehaus.org: Name
or service not known
[linux-jdk8] [INFO] 
[linux-jdk8] [INFO] --- apache-rat-plugin:0.12:check (rat-check) @ maven-compiler-plugin ---
[windows-jdk8] [m] Running batch script
[Pipeline] [windows-jdk9] }
[Pipeline] [windows-jdk9] // dir
[linux-jdk7] [INFO] 
[linux-jdk7] [INFO] --- apache-rat-plugin:0.12:check (rat-check) @ maven-compiler-plugin ---
[linux-jdk7] [INFO] Enabled default license matchers.
[linux-jdk7] [INFO] Will parse SCM ignores for exclusions...
[linux-jdk7] [INFO] Parsing exclusions from /home/jenkins/jenkins-slave/workspace/n_TEST_TO_FIX_MCOMPILER-192-EJZ35UAEPCX3IH57D2YA4NCSBBIRCVCD4L4Y7IFGSVZP6VXNNVFA/m/.gitignore
[linux-jdk7] [INFO] Finished adding exclusions from SCM ignore files.
[linux-jdk7] [INFO] 71 implicit excludes (use -debug for more details).
[linux-jdk7] [INFO] Exclude: .java-version
[linux-jdk7] [INFO] Exclude: .repository/**
[linux-jdk7] [INFO] Exclude: .maven/spy.log
[linux-jdk7] [INFO] Exclude: dependency-reduced-pom.xml
[linux-jdk7] [INFO] Exclude: .java-version
[linux-jdk7] [INFO] 319 resources included (use -debug for more details)
[Pipeline] [windows-jdk9] }
[Pipeline] [windows-jdk9] // withMaven
[Pipeline] [windows-jdk9] echo
[windows-jdk9] [FAIL FAST] This is the first failure and likely root cause
[Pipeline] [windows-jdk9] }
[Pipeline] [windows-jdk9] // stage
[Pipeline] [windows-jdk9] }
[Pipeline] [windows-jdk9] // node
[Pipeline] [windows-jdk9] }
[windows-jdk8] 
[windows-jdk8] f:\jenkins\jenkins-slave\workspace\n_TEST_TO_FIX_MCOMPILER-192-EJZ35UAEPCX3IH57D2YA4NCSBBIRCVCD4L4Y7IFGSVZP6VXNNVFA@2\m>mvn
-P+run-its -Dmaven.test.failure.ignore=true -Dfindbugs.failOnError=false -Dfindbugs.skip=true
clean verify 
[windows-jdk8] ----- withMaven Wrapper script -----
[windows-jdk8] Apache Maven 3.5.0 (ff8f5e7444045639af65f6095c62210b5713f426; 2017-04-03T19:39:06Z)
[windows-jdk8] Maven home: F:\jenkins\tools\maven\apache-maven-3.5.0\bin\..
[windows-jdk8] Java version: 1.8.0_152, vendor: Oracle Corporation
[windows-jdk8] Java home: f:\jenkins\tools\java\latest1.8\jre
[windows-jdk8] Default locale: en_US, platform encoding: Cp1252
[windows-jdk8] OS name: "windows server 2016", version: "10.0", arch: "amd64", family: "windows"
[windows-jdk9] Failed in branch windows-jdk9
[linux-jdk8] [INFO] Enabled default license matchers.
[linux-jdk8] [INFO] Will parse SCM ignores for exclusions...
[linux-jdk8] [INFO] Parsing exclusions from /home/jenkins/jenkins-slave/workspace/n_TEST_TO_FIX_MCOMPILER-192-EJZ35UAEPCX3IH57D2YA4NCSBBIRCVCD4L4Y7IFGSVZP6VXNNVFA@2/m/.gitignore
[linux-jdk8] [INFO] Finished adding exclusions from SCM ignore files.
[linux-jdk8] [INFO] 71 implicit excludes (use -debug for more details).
[linux-jdk8] [INFO] Exclude: .java-version
[linux-jdk8] [INFO] Exclude: .repository/**
[linux-jdk8] [INFO] Exclude: .maven/spy.log
[linux-jdk8] [INFO] Exclude: dependency-reduced-pom.xml
[linux-jdk8] [INFO] Exclude: .java-version
[linux-jdk8] [INFO] 319 resources included (use -debug for more details)
[linux-jdk8] [INFO] Rat check: Summary over all files. Unapproved: 1, unknown: 1, generated:
0, approved: 317 licenses.
[linux-jdk8] [INFO] ------------------------------------------------------------------------
[linux-jdk8] [INFO] BUILD FAILURE
[linux-jdk8] [INFO] ------------------------------------------------------------------------
[linux-jdk8] [INFO] Total time: 3.961 s
[linux-jdk8] [INFO] Finished at: 2018-03-25T18:04:41Z
[linux-jdk8] [INFO] Final Memory: 52M/1147M
[linux-jdk8] [INFO] ------------------------------------------------------------------------
[linux-jdk8] [INFO] [jenkins-event-spy] Generated /home/jenkins/jenkins-slave/workspace/n_TEST_TO_FIX_MCOMPILER-192-EJZ35UAEPCX3IH57D2YA4NCSBBIRCVCD4L4Y7IFGSVZP6VXNNVFA@2@tmp/withMavenffd288f5/maven-spy-20180325-180437-6136743371326791182552.log
[linux-jdk8] [ERROR] Failed to execute goal org.apache.rat:apache-rat-plugin:0.12:check (rat-check)
on project maven-compiler-plugin: Too many files with unapproved license: 1 See RAT report
in: /home/jenkins/jenkins-slave/workspace/n_TEST_TO_FIX_MCOMPILER-192-EJZ35UAEPCX3IH57D2YA4NCSBBIRCVCD4L4Y7IFGSVZP6VXNNVFA@2/m/target/rat.txt
-> [Help 1]
[linux-jdk8] [ERROR] 
[linux-jdk8] [ERROR] To see the full stack trace of the errors, re-run Maven with the -e switch.
[linux-jdk8] [ERROR] Re-run Maven using the -X switch to enable full debug logging.
[linux-jdk8] [ERROR] 
[linux-jdk8] [ERROR] For more information about the errors and possible solutions, please
read the following articles:
[linux-jdk8] [ERROR] [Help 1] http://cwiki.apache.org/confluence/display/MAVEN/MojoFailureException
[linux-jdk9] [INFO] [jenkins-event-spy] Generate /home/jenkins/jenkins-slave/workspace/n_TEST_TO_FIX_MCOMPILER-192-EJZ35UAEPCX3IH57D2YA4NCSBBIRCVCD4L4Y7IFGSVZP6VXNNVFA@tmp/withMavenacf1db9b/maven-spy-20180325-180441-63816146044958406371118.log.tmp
...
[linux-jdk9] [INFO] Scanning for projects...
[linux-jdk9] [INFO] 
[linux-jdk9] [INFO] ------------------------------------------------------------------------
[linux-jdk9] [INFO] Building Apache Maven Compiler Plugin 3.7.1-SNAPSHOT
[linux-jdk9] [INFO] ------------------------------------------------------------------------
[windows-jdk7] [INFO] [jenkins-event-spy] Generate F:\jenkins\jenkins-slave\workspace\n_TEST_TO_FIX_MCOMPILER-192-EJZ35UAEPCX3IH57D2YA4NCSBBIRCVCD4L4Y7IFGSVZP6VXNNVFA@tmp\withMaven3f34d2c6\maven-spy-20180325-180441-9752639065472332810363.log.tmp
...
[windows-jdk7] [INFO] Scanning for projects...
[linux-jdk7] Sending interrupt signal to process
[linux-jdk7] [INFO] Rat check: Summary over all files. Unapproved: 1, unknown: 1, generated:
0, approved: 317 licenses.
[linux-jdk7] [INFO] ------------------------------------------------------------------------
[linux-jdk7] [INFO] BUILD FAILURE
[linux-jdk7] [INFO] ------------------------------------------------------------------------
[linux-jdk7] [INFO] Total time: 5.825 s
[linux-jdk7] [INFO] Finished at: 2018-03-25T18:04:41Z
[linux-jdk7] [INFO] Final Memory: 96M/1447M
[linux-jdk7] [INFO] ------------------------------------------------------------------------
[linux-jdk8] Sending interrupt signal to process
[linux-jdk9] Sending interrupt signal to process
[windows-jdk7] [INFO] 
[windows-jdk7] [INFO] ------------------------------------------------------------------------
[windows-jdk7] [INFO] Building Apache Maven Compiler Plugin 3.7.1-SNAPSHOT
[windows-jdk7] [INFO] ------------------------------------------------------------------------
[windows-jdk8] [INFO] [jenkins-event-spy] Generate F:\jenkins\jenkins-slave\workspace\n_TEST_TO_FIX_MCOMPILER-192-EJZ35UAEPCX3IH57D2YA4NCSBBIRCVCD4L4Y7IFGSVZP6VXNNVFA@2@tmp\withMaven5ec86aa5\maven-spy-20180325-180442-4211701685908816077116.log.tmp
...
[windows-jdk8] [INFO] Scanning for projects...
[windows-jdk8] [INFO] 
[windows-jdk8] [INFO] ------------------------------------------------------------------------
[windows-jdk8] [INFO] Building Apache Maven Compiler Plugin 3.7.1-SNAPSHOT
[windows-jdk8] [INFO] ------------------------------------------------------------------------
[linux-jdk9] [INFO] Downloading from codehaus.org: http://repository.codehaus.org/org/codehaus/groovy/groovy-eclipse-batch/maven-metadata.xml
[linux-jdk9] [INFO] Downloading from codehaus-snapshots: http://nexus.codehaus.org/snapshots/org/codehaus/groovy/groovy-eclipse-batch/maven-metadata.xml
[linux-jdk9] [WARNING] Could not transfer metadata org.codehaus.groovy:groovy-eclipse-batch/maven-metadata.xml
from/to codehaus.org (http://repository.codehaus.org): repository.codehaus.org: Name or service
not known
[linux-jdk9] [WARNING] Could not transfer metadata org.codehaus.groovy:groovy-eclipse-batch/maven-metadata.xml
from/to codehaus-snapshots (http://nexus.codehaus.org/snapshots/): nexus.codehaus.org: Name
or service not known
[linux-jdk9] [INFO] 
[linux-jdk9] [INFO] --- maven-clean-plugin:3.0.0:clean (default-clean) @ maven-compiler-plugin
---
[linux-jdk9] [INFO] 
[linux-jdk9] [INFO] --- maven-enforcer-plugin:1.4.1:enforce (enforce-bytecode-version) @ maven-compiler-plugin
---
[windows-jdk7] [INFO] Downloading: http://repository.codehaus.org/org/codehaus/groovy/groovy-eclipse-batch/maven-metadata.xml
[windows-jdk7] [INFO] Downloading: http://nexus.codehaus.org/snapshots/org/codehaus/groovy/groovy-eclipse-batch/maven-metadata.xml
[windows-jdk7] [WARNING] Could not transfer metadata org.codehaus.groovy:groovy-eclipse-batch/maven-metadata.xml
from/to codehaus.org (http://repository.codehaus.org): repository.codehaus.org
[windows-jdk7] [WARNING] Could not transfer metadata org.codehaus.groovy:groovy-eclipse-batch/maven-metadata.xml
from/to codehaus-snapshots (http://nexus.codehaus.org/snapshots/): nexus.codehaus.org
[windows-jdk7] Sending interrupt signal to process
[windows-jdk7] [INFO] 
[windows-jdk7] [INFO] --- maven-clean-plugin:3.0.0:clean (default-clean) @ maven-compiler-plugin
---
[windows-jdk7] [INFO] 
[windows-jdk7] [INFO] --- maven-enforcer-plugin:1.4.1:enforce (enforce-bytecode-version) @
maven-compiler-plugin ---
[windows-jdk8] [INFO] Downloading: http://repository.codehaus.org/org/codehaus/groovy/groovy-eclipse-batch/maven-metadata.xml
[windows-jdk8] [INFO] Downloading: http://nexus.codehaus.org/snapshots/org/codehaus/groovy/groovy-eclipse-batch/maven-metadata.xml
[windows-jdk8] Sending interrupt signal to process
[windows-jdk8] [WARNING] Could not transfer metadata org.codehaus.groovy:groovy-eclipse-batch/maven-metadata.xml
from/to codehaus.org (http://repository.codehaus.org): repository.codehaus.org
[windows-jdk8] [WARNING] Could not transfer metadata org.codehaus.groovy:groovy-eclipse-batch/maven-metadata.xml
from/to codehaus-snapshots (http://nexus.codehaus.org/snapshots/): nexus.codehaus.org
[windows-jdk8] [INFO] 
[windows-jdk8] [INFO] --- maven-clean-plugin:3.0.0:clean (default-clean) @ maven-compiler-plugin
---
[windows-jdk8] [INFO] 
[windows-jdk8] [INFO] --- maven-enforcer-plugin:1.4.1:enforce (enforce-bytecode-version) @
maven-compiler-plugin ---
[Pipeline] [linux-jdk7] }
[Pipeline] [linux-jdk8] }
[Pipeline] [linux-jdk9] }
[Pipeline] [windows-jdk7] }
[Pipeline] [linux-jdk7] // dir
[Pipeline] [linux-jdk8] // dir
[Pipeline] [linux-jdk9] // dir
[Pipeline] [windows-jdk7] // dir
[Pipeline] [linux-jdk7] }
[linux-jdk7] [withMaven] One or multiple Maven executions have been ignored by the Jenkins
Pipeline Maven Plugin because they have been interrupted before completion (1). See Pipeline
Maven Plugin FAQ for more details.
[Pipeline] [linux-jdk8] }
[Pipeline] [linux-jdk9] }
[linux-jdk9] [withMaven] One or multiple Maven executions have been ignored by the Jenkins
Pipeline Maven Plugin because they have been interrupted before completion (1). See Pipeline
Maven Plugin FAQ for more details.
[Pipeline] [windows-jdk7] }
[windows-jdk7] [withMaven] One or multiple Maven executions have been ignored by the Jenkins
Pipeline Maven Plugin because they have been interrupted before completion (1). See Pipeline
Maven Plugin FAQ for more details.
[Pipeline] [linux-jdk7] // withMaven
[Pipeline] [linux-jdk8] // withMaven
[Pipeline] [linux-jdk9] // withMaven
[Pipeline] [windows-jdk7] // withMaven
[Pipeline] [linux-jdk7] echo
[linux-jdk7] [FAIL FAST] windows-jdk9 had first failure, ignoring script returned exit code
143
[Pipeline] [linux-jdk7] }
[Pipeline] [linux-jdk8] echo
[linux-jdk8] [FAIL FAST] windows-jdk9 had first failure, ignoring script returned exit code
1
[Pipeline] [linux-jdk8] }
[Pipeline] [linux-jdk9] echo
[linux-jdk9] [FAIL FAST] windows-jdk9 had first failure, ignoring script returned exit code
143
[Pipeline] [linux-jdk9] }
[Pipeline] [windows-jdk7] echo
[windows-jdk7] [FAIL FAST] windows-jdk9 had first failure, ignoring script returned exit code
-1
[Pipeline] [windows-jdk7] }
[Pipeline] [windows-jdk8] }
[Pipeline] [linux-jdk7] // stage
[Pipeline] [linux-jdk8] // stage
[Pipeline] [linux-jdk9] // stage
[Pipeline] [windows-jdk7] // stage
[Pipeline] [windows-jdk8] // dir
[Pipeline] [linux-jdk7] }
[Pipeline] [linux-jdk9] }
[Pipeline] [linux-jdk8] }
[Pipeline] [windows-jdk7] }
[Pipeline] [windows-jdk8] }
[windows-jdk8] [withMaven] One or multiple Maven executions have been ignored by the Jenkins
Pipeline Maven Plugin because they have been interrupted before completion (1). See Pipeline
Maven Plugin FAQ for more details.
[Pipeline] [linux-jdk7] // node
[Pipeline] [linux-jdk9] // node
[Pipeline] [linux-jdk8] // node
[Pipeline] [windows-jdk7] // node
[Pipeline] [windows-jdk8] // withMaven
[Pipeline] [linux-jdk7] }
[Pipeline] [linux-jdk8] }
[Pipeline] [linux-jdk9] }
[Pipeline] [windows-jdk7] }
[Pipeline] [windows-jdk8] echo
[windows-jdk8] [FAIL FAST] windows-jdk9 had first failure, ignoring script returned exit code
-1
[Pipeline] [windows-jdk8] }
[Pipeline] [windows-jdk8] // stage
[Pipeline] [windows-jdk8] }
[Pipeline] [windows-jdk8] // node
[Pipeline] [windows-jdk8] }
[Pipeline] // parallel
[Pipeline] echo
***** FAST FAILURE *****

Fast failure triggered by windows-jdk9

***** FAST FAILURE *****
[Pipeline] stage
[Pipeline] { (Notifications)
[Pipeline] echo
Build result: FAILURE
[Pipeline] jiraIssueSelector
[Pipeline] emailext
Mime
  • Unnamed multipart/mixed (inline, None, 0 bytes)
View raw message