maven-notifications mailing list archives

Site index · List index
Message view « Date » · « Thread »
Top « Date » · « Thread »
From Apache Jenkins Server <jenk...@builds.apache.org>
Subject Build failed in Jenkins: Maven TLP » maven-javadoc-plugin » MJAVADOC-515 #1
Date Tue, 13 Feb 2018 19:18:20 GMT
See https://builds.apache.org/job/maven-box/job/maven-javadoc-plugin/job/MJAVADOC-515/1/

No changes.

All tests passed

Build log:
[...truncated 1.09 MB...]
[windows-jdk8] [INFO] Building: MJAVADOC-320\pom.xml
[windows-jdk7] [INFO] run post-build script verify.bsh
[windows-jdk7] [INFO]           dependencySource-4\pom.xml ....................... SUCCESS
(25.1 s)
[windows-jdk7] [INFO] Building: detectLinks\pom.xml
[windows-jdk8] [INFO] run post-build script verify.bsh
[windows-jdk8] [INFO]           MJAVADOC-320\pom.xml ............................. SUCCESS
(8.5 s)
[windows-jdk8] [INFO] Building: MJAVADOC-325\pom.xml
[windows-jdk9] [INFO] run post-build script verify.bsh
[windows-jdk9] [INFO]           dependencySource-4\pom.xml ....................... SUCCESS
(21.7 s)
[windows-jdk9] [INFO] Building: detectLinks\pom.xml
[windows-jdk8] [INFO] run post-build script verify.bsh
[windows-jdk8] [INFO]           MJAVADOC-325\pom.xml ............................. SUCCESS
(4.0 s)
[windows-jdk8] [INFO] Building: MJAVADOC-365\pom.xml
[windows-jdk8] [INFO] run post-build script verify.bsh
[windows-jdk8] [INFO]           MJAVADOC-365\pom.xml ............................. SUCCESS
(3.9 s)
[windows-jdk8] [INFO] Building: MJAVADOC-369\pom.xml
[windows-jdk8] [INFO] run post-build script verify.bsh
[windows-jdk8] [INFO]           MJAVADOC-369\pom.xml ............................. SUCCESS
(8.8 s)
[windows-jdk8] [INFO] Building: MJAVADOC-384\pom.xml
[windows-jdk8] [INFO] run post-build script verify.bsh
[windows-jdk8] [INFO]           MJAVADOC-384\pom.xml ............................. SUCCESS
(3.8 s)
[windows-jdk8] [INFO] Building: MJAVADOC-407\pom.xml
[windows-jdk7] [INFO] run post-build script verify.bsh
[windows-jdk7] [INFO]           detectLinks\pom.xml .............................. FAILED
(25.7 s)
[windows-jdk7] [INFO]   The post-build script returned false.
[windows-jdk7] [INFO] Building: javadoc-fix\pom.xml
[windows-jdk8] [INFO] run post-build script verify.bsh
[windows-jdk8] [INFO]           MJAVADOC-407\pom.xml ............................. SUCCESS
(5.2 s)
[windows-jdk8] [INFO] Building: MJAVADOC-414\pom.xml
[windows-jdk9] [INFO] run post-build script verify.bsh
[windows-jdk9] [INFO]           detectLinks\pom.xml .............................. FAILED
(21.4 s)
[windows-jdk9] [INFO]   The post-build script returned false.
[windows-jdk9] [INFO] Building: javadoc-fix\pom.xml
[windows-jdk7] [INFO] run post-build script verify.bsh
[windows-jdk7] [INFO]           javadoc-fix\pom.xml .............................. SUCCESS
(8.0 s)
[windows-jdk7] [INFO] Building: MJAVADOC-110\pom.xml
[windows-jdk9] [INFO] run post-build script verify.bsh
[windows-jdk9] [INFO]           javadoc-fix\pom.xml .............................. SUCCESS
(6.5 s)
[windows-jdk9] [INFO] Building: MJAVADOC-110\pom.xml
[windows-jdk8] [INFO] run post-build script verify.bsh
[windows-jdk8] [INFO]           MJAVADOC-414\pom.xml ............................. SUCCESS
(4.9 s)
[windows-jdk8] [INFO] Building: MJAVADOC-437\pom.xml
[windows-jdk8] [INFO] run post-build script verify.bsh
[windows-jdk8] [INFO]           MJAVADOC-437\pom.xml ............................. SUCCESS
(5.2 s)
[windows-jdk8] [INFO] Building: MJAVADOC-494_aggregate-repositories\pom.xml
[windows-jdk7] [INFO] run post-build script verify.bsh
[windows-jdk7] [INFO]           MJAVADOC-110\pom.xml ............................. SUCCESS
(10.0 s)
[windows-jdk7] [INFO] Building: MJAVADOC-126\pom.xml
[windows-jdk9] [INFO] run post-build script verify.bsh
[windows-jdk9] [INFO]           MJAVADOC-110\pom.xml ............................. SUCCESS
(9.1 s)
[windows-jdk9] [INFO] Building: MJAVADOC-126\pom.xml
[windows-jdk8] [INFO]           MJAVADOC-494_aggregate-repositories\pom.xml ...... SUCCESS
(5.3 s)
[windows-jdk8] [INFO] Building: MJAVADOC-497\pom.xml
[windows-jdk8] [INFO] run post-build script verify.bsh
[windows-jdk8] [INFO]           MJAVADOC-497\pom.xml ............................. SUCCESS
(4.8 s)
[windows-jdk8] [INFO] Building: MJAVADOC-498_aggr_modulepath\pom.xml
[windows-jdk8] [INFO]           MJAVADOC-498_aggr_modulepath\pom.xml ............. SKIPPED
due to JRE version
[windows-jdk8] [INFO] Building: MJAVADOC-498_mm_modulepath\pom.xml
[windows-jdk8] [INFO]           MJAVADOC-498_mm_modulepath\pom.xml ............... SKIPPED
due to JRE version
[windows-jdk8] [INFO] Building: MJAVADOC-498_modulepath\pom.xml
[windows-jdk8] [INFO]           MJAVADOC-498_modulepath\pom.xml .................. SKIPPED
due to JRE version
[windows-jdk8] [INFO] Building: MJAVADOC-508\pom.xml
[windows-jdk7] [INFO] run post-build script verify.bsh
[windows-jdk7] [INFO]           MJAVADOC-126\pom.xml ............................. SUCCESS
(9.9 s)
[windows-jdk7] [INFO] Building: MJAVADOC-137\pom.xml
[windows-jdk8] [INFO]           MJAVADOC-508\pom.xml ............................. SUCCESS
(3.9 s)
[windows-jdk8] [INFO] Building: site-failOnError\pom.xml
[windows-jdk9] [INFO] run post-build script verify.bsh
[windows-jdk9] [INFO]           MJAVADOC-126\pom.xml ............................. SUCCESS
(10.7 s)
[windows-jdk9] [INFO] Building: MJAVADOC-137\pom.xml
[windows-jdk7] [INFO] run post-build script verify.bsh
[windows-jdk7] [INFO]           MJAVADOC-137\pom.xml ............................. SUCCESS
(10.8 s)
[windows-jdk7] [INFO] Building: MJAVADOC-172\pom.xml
[windows-jdk8] [INFO]           site-failOnError\pom.xml ......................... SUCCESS
(9.6 s)
[windows-jdk8] [INFO] 
[windows-jdk8] [INFO] --- mrm-maven-plugin:1.1.0:stop (repository) @ maven-javadoc-plugin
---
[windows-jdk8] [INFO] Stopping Mock Repository Manager on http://localhost:63328
[windows-jdk8] [INFO] Stopped SocketConnector@0.0.0.0:63328
[windows-jdk8] [INFO] Mock Repository Manager http://localhost:63328 is stopped.
[windows-jdk8] [INFO] 
[windows-jdk8] [INFO] --- mrm-maven-plugin:1.1.0:stop (3rdparty) @ maven-javadoc-plugin ---
[windows-jdk8] [INFO] Stopping Mock Repository Manager on http://localhost:63329
[windows-jdk8] [INFO] Stopped SocketConnector@0.0.0.0:63329
[windows-jdk8] [INFO] Mock Repository Manager http://localhost:63329 is stopped.
[windows-jdk8] [INFO] 
[windows-jdk8] [INFO] --- maven-checkstyle-plugin:3.0.0:check (checkstyle-check) @ maven-javadoc-plugin
---
[windows-jdk8] [INFO] Downloading: https://repo.maven.apache.org/maven2/org/apache/maven/shared/maven-shared-resources/2/maven-shared-resources-2.pom
[windows-jdk8] [INFO] Downloaded: https://repo.maven.apache.org/maven2/org/apache/maven/shared/maven-shared-resources/2/maven-shared-resources-2.pom
(3.0 kB at 174 kB/s)
[windows-jdk8] [INFO] Downloading: https://repo.maven.apache.org/maven2/org/codehaus/plexus/plexus-utils/3.0.10/plexus-utils-3.0.10.pom
[windows-jdk8] [INFO] Downloaded: https://repo.maven.apache.org/maven2/org/codehaus/plexus/plexus-utils/3.0.10/plexus-utils-3.0.10.pom
(3.1 kB at 225 kB/s)
[windows-jdk8] [INFO] Downloading: https://repo.maven.apache.org/maven2/org/codehaus/plexus/plexus/3.3/plexus-3.3.pom
[windows-jdk8] [INFO] Downloaded: https://repo.maven.apache.org/maven2/org/codehaus/plexus/plexus/3.3/plexus-3.3.pom
(20 kB at 1.4 MB/s)
[windows-jdk8] [INFO] Downloading: https://repo.maven.apache.org/maven2/org/apache/maven/doxia/doxia-integration-tools/1.6/doxia-integration-tools-1.6.pom
[windows-jdk8] [INFO] Downloaded: https://repo.maven.apache.org/maven2/org/apache/maven/doxia/doxia-integration-tools/1.6/doxia-integration-tools-1.6.pom
(7.0 kB at 632 kB/s)
[windows-jdk8] [INFO] Downloading: https://repo.maven.apache.org/maven2/org/apache/maven/doxia/doxia-tools/3/doxia-tools-3.pom
[windows-jdk8] [INFO] Downloaded: https://repo.maven.apache.org/maven2/org/apache/maven/doxia/doxia-tools/3/doxia-tools-3.pom
(9.9 kB at 827 kB/s)
[windows-jdk8] [INFO] Downloading: https://repo.maven.apache.org/maven2/org/codehaus/plexus/plexus-resources/1.1.0/plexus-resources-1.1.0.pom
[windows-jdk8] [INFO] Downloaded: https://repo.maven.apache.org/maven2/org/codehaus/plexus/plexus-resources/1.1.0/plexus-resources-1.1.0.pom
(3.2 kB at 199 kB/s)
[windows-jdk8] [INFO] Downloading: https://repo.maven.apache.org/maven2/com/puppycrawl/tools/checkstyle/6.18/checkstyle-6.18.pom
[windows-jdk8] [INFO] Downloaded: https://repo.maven.apache.org/maven2/com/puppycrawl/tools/checkstyle/6.18/checkstyle-6.18.pom
(71 kB at 3.6 MB/s)
[windows-jdk8] [INFO] Downloading: https://repo.maven.apache.org/maven2/antlr/antlr/2.7.7/antlr-2.7.7.pom
[windows-jdk8] [INFO] Downloaded: https://repo.maven.apache.org/maven2/antlr/antlr/2.7.7/antlr-2.7.7.pom
(632 B at 57 kB/s)
[windows-jdk8] [INFO] Downloading: https://repo.maven.apache.org/maven2/org/antlr/antlr4-runtime/4.5.3/antlr4-runtime-4.5.3.pom
[windows-jdk8] [INFO] Downloaded: https://repo.maven.apache.org/maven2/org/antlr/antlr4-runtime/4.5.3/antlr4-runtime-4.5.3.pom
(2.3 kB at 210 kB/s)
[windows-jdk8] [INFO] Downloading: https://repo.maven.apache.org/maven2/org/antlr/antlr4-master/4.5.3/antlr4-master-4.5.3.pom
[windows-jdk8] [INFO] Downloaded: https://repo.maven.apache.org/maven2/org/antlr/antlr4-master/4.5.3/antlr4-master-4.5.3.pom
(3.7 kB at 307 kB/s)
[windows-jdk8] [INFO] Downloading: https://repo.maven.apache.org/maven2/commons-beanutils/commons-beanutils/1.9.2/commons-beanutils-1.9.2.pom
[windows-jdk8] [INFO] Downloaded: https://repo.maven.apache.org/maven2/commons-beanutils/commons-beanutils/1.9.2/commons-beanutils-1.9.2.pom
(14 kB at 1.1 MB/s)
[windows-jdk8] [INFO] Downloading: https://repo.maven.apache.org/maven2/org/apache/commons/commons-parent/33/commons-parent-33.pom
[windows-jdk8] [INFO] Downloaded: https://repo.maven.apache.org/maven2/org/apache/commons/commons-parent/33/commons-parent-33.pom
(53 kB at 3.5 MB/s)
[windows-jdk8] [INFO] Downloading: https://repo.maven.apache.org/maven2/commons-cli/commons-cli/1.3.1/commons-cli-1.3.1.pom
[windows-jdk8] [INFO] Downloaded: https://repo.maven.apache.org/maven2/commons-cli/commons-cli/1.3.1/commons-cli-1.3.1.pom
(10 kB at 866 kB/s)
[windows-jdk8] [INFO] Downloading: https://repo.maven.apache.org/maven2/com/google/guava/guava/19.0/guava-19.0.pom
[windows-jdk8] [INFO] Downloaded: https://repo.maven.apache.org/maven2/com/google/guava/guava/19.0/guava-19.0.pom
(6.8 kB at 424 kB/s)
[windows-jdk8] [INFO] Downloading: https://repo.maven.apache.org/maven2/com/google/guava/guava-parent/19.0/guava-parent-19.0.pom
[windows-jdk8] [INFO] Downloaded: https://repo.maven.apache.org/maven2/com/google/guava/guava-parent/19.0/guava-parent-19.0.pom
(9.9 kB at 760 kB/s)
[windows-jdk8] [INFO] Downloading: https://repo.maven.apache.org/maven2/org/sonatype/oss/oss-parent/7/oss-parent-7.pom
[windows-jdk8] [INFO] Downloaded: https://repo.maven.apache.org/maven2/org/sonatype/oss/oss-parent/7/oss-parent-7.pom
(4.8 kB at 402 kB/s)
[windows-jdk8] [INFO] Downloading: https://repo.maven.apache.org/maven2/org/apache/maven/doxia/doxia-core/1.2/doxia-core-1.2.jar
[windows-jdk8] [INFO] Downloading: https://repo.maven.apache.org/maven2/commons-logging/commons-logging/1.0.4/commons-logging-1.0.4.jar
[windows-jdk8] [INFO] Downloading: https://repo.maven.apache.org/maven2/commons-digester/commons-digester/1.6/commons-digester-1.6.jar
[windows-jdk8] [INFO] Downloading: https://repo.maven.apache.org/maven2/org/apache/maven/doxia/doxia-integration-tools/1.6/doxia-integration-tools-1.6.jar
[windows-jdk8] [INFO] Downloading: https://repo.maven.apache.org/maven2/org/apache/maven/shared/maven-shared-resources/2/maven-shared-resources-2.jar
[windows-jdk8] [INFO] Downloaded: https://repo.maven.apache.org/maven2/commons-logging/commons-logging/1.0.4/commons-logging-1.0.4.jar
(38 kB at 1.3 MB/s)
[windows-jdk8] [INFO] Downloading: https://repo.maven.apache.org/maven2/commons-io/commons-io/1.4/commons-io-1.4.jar
[windows-jdk8] [INFO] Downloaded: https://repo.maven.apache.org/maven2/commons-io/commons-io/1.4/commons-io-1.4.jar
(109 kB at 2.4 MB/s)
[windows-jdk8] [INFO] Downloading: https://repo.maven.apache.org/maven2/org/codehaus/plexus/plexus-resources/1.1.0/plexus-resources-1.1.0.jar
[windows-jdk8] [INFO] Downloaded: https://repo.maven.apache.org/maven2/org/apache/maven/doxia/doxia-core/1.2/doxia-core-1.2.jar
(154 kB at 2.3 MB/s)
[windows-jdk8] [INFO] Downloading: https://repo.maven.apache.org/maven2/com/puppycrawl/tools/checkstyle/6.18/checkstyle-6.18.jar
[windows-jdk8] [INFO] Downloaded: https://repo.maven.apache.org/maven2/commons-digester/commons-digester/1.6/commons-digester-1.6.jar
(168 kB at 2.3 MB/s)
[windows-jdk8] [INFO] Downloading: https://repo.maven.apache.org/maven2/antlr/antlr/2.7.7/antlr-2.7.7.jar
[windows-jdk8] [INFO] Downloaded: https://repo.maven.apache.org/maven2/com/puppycrawl/tools/checkstyle/6.18/checkstyle-6.18.jar
(1.2 MB at 9.3 MB/s)
[windows-jdk8] [INFO] Downloading: https://repo.maven.apache.org/maven2/org/antlr/antlr4-runtime/4.5.3/antlr4-runtime-4.5.3.jar
[windows-jdk8] [INFO] Downloaded: https://repo.maven.apache.org/maven2/org/apache/maven/shared/maven-shared-resources/2/maven-shared-resources-2.jar
(13 kB at 93 kB/s)
[windows-jdk8] [INFO] Downloading: https://repo.maven.apache.org/maven2/commons-beanutils/commons-beanutils/1.9.2/commons-beanutils-1.9.2.jar
[windows-jdk8] [INFO] Downloaded: https://repo.maven.apache.org/maven2/org/codehaus/plexus/plexus-resources/1.1.0/plexus-resources-1.1.0.jar
(23 kB at 135 kB/s)
[windows-jdk8] [INFO] Downloading: https://repo.maven.apache.org/maven2/commons-cli/commons-cli/1.3.1/commons-cli-1.3.1.jar
[windows-jdk8] [INFO] Downloaded: https://repo.maven.apache.org/maven2/commons-beanutils/commons-beanutils/1.9.2/commons-beanutils-1.9.2.jar
(234 kB at 1.3 MB/s)
[windows-jdk8] [INFO] Downloading: https://repo.maven.apache.org/maven2/com/google/guava/guava/19.0/guava-19.0.jar
[windows-jdk8] [INFO] Downloaded: https://repo.maven.apache.org/maven2/antlr/antlr/2.7.7/antlr-2.7.7.jar
(445 kB at 2.4 MB/s)
[windows-jdk8] [INFO] Downloading: https://repo.maven.apache.org/maven2/commons-lang/commons-lang/2.1/commons-lang-2.1.jar
[windows-jdk8] [INFO] Downloaded: https://repo.maven.apache.org/maven2/commons-cli/commons-cli/1.3.1/commons-cli-1.3.1.jar
(53 kB at 255 kB/s)
[windows-jdk8] [INFO] Downloaded: https://repo.maven.apache.org/maven2/commons-lang/commons-lang/2.1/commons-lang-2.1.jar
(208 kB at 931 kB/s)
[windows-jdk8] [INFO] Downloaded: https://repo.maven.apache.org/maven2/org/antlr/antlr4-runtime/4.5.3/antlr4-runtime-4.5.3.jar
(302 kB at 1.2 MB/s)
[windows-jdk8] [INFO] Downloaded: https://repo.maven.apache.org/maven2/org/apache/maven/doxia/doxia-integration-tools/1.6/doxia-integration-tools-1.6.jar
(45 kB at 170 kB/s)
[windows-jdk8] [INFO] Downloaded: https://repo.maven.apache.org/maven2/com/google/guava/guava/19.0/guava-19.0.jar
(2.3 MB at 8.5 MB/s)
[windows-jdk8] [INFO] There are 6 errors reported by Checkstyle 6.18 with config/maven_checks.xml
ruleset.
[windows-jdk8] [ERROR] src\main\java\org\apache\maven\plugins\javadoc\AbstractFixJavadocMojo.java:[3684,9]
(modifier) RedundantModifier: Redundant 'public' modifier.
[windows-jdk8] [ERROR] src\main\java\org\apache\maven\plugins\javadoc\JavadocUtil.java:[1391,9]
(modifier) RedundantModifier: Redundant 'public' modifier.
[windows-jdk8] [INFO] Ignored 4 errors, 2 violations remaining.
[windows-jdk8] [INFO] ------------------------------------------------------------------------
[windows-jdk8] [INFO] BUILD FAILURE
[windows-jdk8] [INFO] ------------------------------------------------------------------------
[windows-jdk8] [INFO] Total time: 06:47 min
[windows-jdk8] [INFO] Finished at: 2018-02-13T19:17:27Z
[windows-jdk8] [INFO] Final Memory: 68M/1095M
[windows-jdk8] [INFO] ------------------------------------------------------------------------
[windows-jdk8] [INFO] [jenkins-event-spy] Generated F:\jenkins\jenkins-slave\workspace\javadoc-plugin_MJAVADOC-515-B55ESPLZJXU5ECAWKWIVPDGGDPEBAS2CZXJ3KWVUGGBWF6MWWHIQ@tmp\withMavenf704595b\maven-spy-20180213-191040-3664677758894070543539.log
[windows-jdk8] [ERROR] Failed to execute goal org.apache.maven.plugins:maven-checkstyle-plugin:3.0.0:check
(checkstyle-check) on project maven-javadoc-plugin: You have 2 Checkstyle violations. ->
[Help 1]
[windows-jdk8] [ERROR] 
[windows-jdk8] [ERROR] To see the full stack trace of the errors, re-run Maven with the -e
switch.
[windows-jdk8] [ERROR] Re-run Maven using the -X switch to enable full debug logging.
[windows-jdk8] [ERROR] 
[windows-jdk8] [ERROR] For more information about the errors and possible solutions, please
read the following articles:
[windows-jdk8] [ERROR] [Help 1] http://cwiki.apache.org/confluence/display/MAVEN/MojoFailureException
[windows-jdk8] Picked up JAVA_TOOL_OPTIONS: -Dmaven.ext.class.path="f:\jenkins\jenkins-slave\workspace\javadoc-plugin_MJAVADOC-515-B55ESPLZJXU5ECAWKWIVPDGGDPEBAS2CZXJ3KWVUGGBWF6MWWHIQ@tmp\withMavenf704595b\pipeline-maven-spy.jar"
-Dorg.jenkinsci.plugins.pipeline.maven.reportsFolder="f:\jenkins\jenkins-slave\workspace\javadoc-plugin_MJAVADOC-515-B55ESPLZJXU5ECAWKWIVPDGGDPEBAS2CZXJ3KWVUGGBWF6MWWHIQ@tmp\withMavenf704595b"

[Pipeline] [windows-jdk8] }
[Pipeline] [windows-jdk8] // dir
[windows-jdk9] [INFO] run post-build script verify.bsh
[windows-jdk9] [INFO]           MJAVADOC-137\pom.xml ............................. SUCCESS
(13.4 s)
[windows-jdk9] [INFO] Building: MJAVADOC-172\pom.xml
[windows-jdk7] [INFO] run post-build script verify.bsh
[windows-jdk7] [INFO]           MJAVADOC-172\pom.xml ............................. SUCCESS
(9.6 s)
[windows-jdk7] [INFO] Building: MJAVADOC-180\pom.xml
[windows-jdk9] [INFO] run post-build script verify.bsh
[windows-jdk9] [INFO]           MJAVADOC-172\pom.xml ............................. SUCCESS
(10.4 s)
[windows-jdk9] [INFO] Building: MJAVADOC-180\pom.xml
[windows-jdk7] [INFO] run post-build script verify.bsh
[windows-jdk7] [INFO]           MJAVADOC-180\pom.xml ............................. SUCCESS
(8.9 s)
[windows-jdk7] [INFO] Building: MJAVADOC-194\pom.xml
[windows-jdk9] [INFO] run post-build script verify.bsh
[windows-jdk9] [INFO]           MJAVADOC-180\pom.xml ............................. SUCCESS
(9.9 s)
[windows-jdk9] [INFO] Building: MJAVADOC-194\pom.xml
[windows-jdk7] [INFO] run post-build script verify.bsh
[windows-jdk7] [INFO]           MJAVADOC-194\pom.xml ............................. SUCCESS
(10.5 s)
[windows-jdk7] [INFO] Building: MJAVADOC-250\pom.xml
[Pipeline] [windows-jdk8] }
[windows-jdk8] [withMaven] Skip 'Generated Artifacts Publisher' disabled by configuration
[windows-jdk8] [withMaven] junitPublisher - Archive test results for Maven artifact org.apache.maven.plugins:maven-javadoc-plugin:3.0.1-SNAPSHOT
generated by maven-surefire-plugin:test (default-test): m\target\surefire-reports\*.xml
[windows-jdk8] [withMaven] junitPublisher - Jenkins JUnit Attachments Plugin not found, can't
publish test attachments.Recording test results
[windows-jdk8] [withMaven] Skip 'Findbugs Publisher' disabled by configuration
[windows-jdk8] [withMaven] Skip 'Open Task Scanner Publisher' disabled by configuration
[Pipeline] [windows-jdk8] // withMaven
[Pipeline] [windows-jdk8] echo
[windows-jdk8] [FAIL FAST] This is the first failure and likely root cause
[Pipeline] [windows-jdk8] }
[Pipeline] [windows-jdk8] // stage
[Pipeline] [windows-jdk8] }
[Pipeline] [windows-jdk8] // node
[Pipeline] [windows-jdk8] }
[windows-jdk7] Sending interrupt signal to process
[windows-jdk9] Sending interrupt signal to process
[windows-jdk8] Failed in branch windows-jdk8
[Pipeline] [linux-jdk7] // node
[Pipeline] [linux-jdk8] // node
[Pipeline] [linux-jdk9] // node
[Pipeline] [linux-jdk7] }
[linux-jdk7] Failed in branch linux-jdk7
[Pipeline] [linux-jdk8] }
[linux-jdk8] Failed in branch linux-jdk8
[Pipeline] [linux-jdk9] }
[linux-jdk9] Failed in branch linux-jdk9
[Pipeline] [windows-jdk7] }
[Pipeline] [windows-jdk7] // dir
[Pipeline] [windows-jdk7] }
[windows-jdk7] [withMaven] One or multiple Maven executions have been ignored by the Jenkins
Pipeline Maven Plugin because they have been interrupted before completion (1). See Pipeline
Maven Plugin FAQ for more details.
[Pipeline] [windows-jdk7] // withMaven
[Pipeline] [windows-jdk7] echo
[windows-jdk7] [FAIL FAST] windows-jdk8 had first failure, ignoring script returned exit code
-1
[Pipeline] [windows-jdk7] }
[Pipeline] [windows-jdk7] // stage
[Pipeline] [windows-jdk7] }
[Pipeline] [windows-jdk7] // node
[Pipeline] [windows-jdk7] }
[windows-jdk9] After 10s process did not stop
[Pipeline] [windows-jdk9] }
[Pipeline] [windows-jdk9] // dir
[Pipeline] [windows-jdk9] }
[windows-jdk9] [withMaven] One or multiple Maven executions have been ignored by the Jenkins
Pipeline Maven Plugin because they have been interrupted before completion (1). See Pipeline
Maven Plugin FAQ for more details.
[Pipeline] [windows-jdk9] // withMaven
[Pipeline] [windows-jdk9] echo
[windows-jdk9] [FAIL FAST] windows-jdk8 had first failure, ignoring null
[Pipeline] [windows-jdk9] }
[Pipeline] [windows-jdk9] // stage
[Pipeline] [windows-jdk9] }
[Pipeline] [windows-jdk9] // node
[Pipeline] [windows-jdk9] }
[Pipeline] // parallel
[Pipeline] echo
***** FAST FAILURE *****

Fast failure triggered by windows-jdk8

***** FAST FAILURE *****
[Pipeline] stage
[Pipeline] { (Notifications)
[Pipeline] echo
Build result: FAILURE
[Pipeline] jiraIssueSelector
Mime
  • Unnamed multipart/mixed (inline, None, 0 bytes)
View raw message