maven-notifications mailing list archives

Site index · List index
Message view « Date » · « Thread »
Top « Date » · « Thread »
From Apache Jenkins Server <jenk...@builds.apache.org>
Subject Build failed in Jenkins: Maven TLP » maven-resolver-ant-tasks » master #5
Date Thu, 15 Feb 2018 18:51:15 GMT
See https://builds.apache.org/job/maven-box/job/maven-resolver-ant-tasks/job/master/5/

Changes:

* Noting INFRA-15651
* Typowq
* [CLOSES INFRA-15651] ubuntu-4 is confirmed fixed
* Stop commenting on INFRA tickets
* Add JDK 10 b37 (early access build) (Windows Only)
* Better fail-fast diagnostics (hopefully)
* Better fail-fast diagnostics (hopefully)
* fix scoping
* Correctly attribute fast failure root node
* Correctly attribute fast failure root node
* Handle other parts of the parallel being interrupted by fast fail
* suppress duplicate changelogs
* take 2 on changelog optimization
* debug
* Seems we have to live with duplicate changelogs
* Set resolverVersion to 1.1.1
* Set resolverVersion to 1.1.1
* Set resolverVersion to 1.1.1
* Set resolverVersion to 1.1.1
* Set resolverVersion to 1.1.1

No tests ran.

Build log:
[...truncated 81.29 KB...]
[windows-jdk8] [withMaven] Available options: 
[windows-jdk8] [withMaven] use JDK installation JDK 1.8 (latest)
[windows-jdk8] [withMaven] use Maven installation 'Maven 3.5.0 (Windows)'
[Pipeline] [windows-jdk8] {
[Pipeline] [linux-jdk7] dir
[linux-jdk7] Running in /home/jenkins/jenkins-slave/workspace/n-resolver-ant-tasks_master-PZI36OPNRAJBXJOAPEQN5EKT3YVHZTR3KX72Y4FQGBMQE6GFTARQ/m
[Pipeline] [linux-jdk7] {
[Pipeline] [linux-jdk8] dir
[linux-jdk8] Running in /home/jenkins/jenkins-slave/workspace/n-resolver-ant-tasks_master-PZI36OPNRAJBXJOAPEQN5EKT3YVHZTR3KX72Y4FQGBMQE6GFTARQ/m
[Pipeline] [linux-jdk8] {
[Pipeline] [linux-jdk9] dir
[linux-jdk9] Running in /home/jenkins/jenkins-slave/workspace/n-resolver-ant-tasks_master-PZI36OPNRAJBXJOAPEQN5EKT3YVHZTR3KX72Y4FQGBMQE6GFTARQ/m
[Pipeline] [linux-jdk9] {
[Pipeline] [windows-jdk8] dir
[windows-jdk8] Running in f:\jenkins\jenkins-slave\workspace\n-resolver-ant-tasks_master-PZI36OPNRAJBXJOAPEQN5EKT3YVHZTR3KX72Y4FQGBMQE6GFTARQ@2\m
[Pipeline] [windows-jdk8] {
[windows-jdk7] [INFO] Downloaded: https://repo.maven.apache.org/maven2/org/apache/ant/ant-testutil/1.8.2/ant-testutil-1.8.2.jar
(15 kB at 37 kB/s)
[windows-jdk7] [INFO] Downloaded: https://repo.maven.apache.org/maven2/com/google/guava/guava/20.0/guava-20.0.jar
(2.4 MB at 2.9 MB/s)
[windows-jdk7] [INFO] ------------------------------------------------------------------------
[windows-jdk7] [INFO] BUILD FAILURE
[windows-jdk7] [INFO] ------------------------------------------------------------------------
[windows-jdk7] [INFO] Total time: 5.714 s
[windows-jdk7] [INFO] Finished at: 2018-02-15T18:51:05Z
[windows-jdk7] [INFO] Final Memory: 12M/368M
[windows-jdk7] [INFO] ------------------------------------------------------------------------
[windows-jdk7] [INFO] [jenkins-event-spy] Generated F:\jenkins\jenkins-slave\workspace\n-resolver-ant-tasks_master-PZI36OPNRAJBXJOAPEQN5EKT3YVHZTR3KX72Y4FQGBMQE6GFTARQ@tmp\withMaven3e48a40f\maven-spy-20180215-185058-7868606823583326797825.log
[windows-jdk7] [ERROR] Failed to execute goal on project maven-resolver-ant-tasks: Could not
resolve dependencies for project org.apache.maven.resolver:maven-resolver-ant-tasks:jar:1.1.0-SNAPSHOT:
The following artifacts could not be resolved: org.apache.maven.resolver:maven-resolver-api:jar:1.1.1,
org.apache.maven.resolver:maven-resolver-util:jar:1.1.1, org.apache.maven.resolver:maven-resolver-impl:jar:1.1.1,
org.apache.maven.resolver:maven-resolver-connector-basic:jar:1.1.1, org.apache.maven.resolver:maven-resolver-transport-classpath:jar:1.1.1,
org.apache.maven.resolver:maven-resolver-transport-file:jar:1.1.1, org.apache.maven.resolver:maven-resolver-transport-http:jar:1.1.1,
org.apache.maven.resolver:maven-resolver-test-util:jar:1.1.1: Could not find artifact org.apache.maven.resolver:maven-resolver-api:jar:1.1.1
in central (https://repo.maven.apache.org/maven2) -> [Help 1]
[windows-jdk7] [ERROR] 
[windows-jdk7] [ERROR] To see the full stack trace of the errors, re-run Maven with the -e
switch.
[windows-jdk7] [ERROR] Re-run Maven using the -X switch to enable full debug logging.
[windows-jdk7] [ERROR] 
[windows-jdk7] [ERROR] For more information about the errors and possible solutions, please
read the following articles:
[windows-jdk7] [ERROR] [Help 1] http://cwiki.apache.org/confluence/display/MAVEN/DependencyResolutionException
[windows-jdk7] Picked up JAVA_TOOL_OPTIONS: -Dmaven.ext.class.path="f:\jenkins\jenkins-slave\workspace\n-resolver-ant-tasks_master-PZI36OPNRAJBXJOAPEQN5EKT3YVHZTR3KX72Y4FQGBMQE6GFTARQ@tmp\withMaven3e48a40f\pipeline-maven-spy.jar"
-Dorg.jenkinsci.plugins.pipeline.maven.reportsFolder="f:\jenkins\jenkins-slave\workspace\n-resolver-ant-tasks_master-PZI36OPNRAJBXJOAPEQN5EKT3YVHZTR3KX72Y4FQGBMQE6GFTARQ@tmp\withMaven3e48a40f"

[Pipeline] [linux-jdk7] isUnix
[Pipeline] [linux-jdk7] sh
[linux-jdk7] [m] Running shell script
[linux-jdk7] + mvn -P+run-its -Dmaven.test.failure.ignore=true -Dfindbugs.failOnError=false
clean verify
[linux-jdk7] ----- withMaven Wrapper script -----
[linux-jdk7] Picked up JAVA_TOOL_OPTIONS: -Dmaven.ext.class.path="/home/jenkins/jenkins-slave/workspace/n-resolver-ant-tasks_master-PZI36OPNRAJBXJOAPEQN5EKT3YVHZTR3KX72Y4FQGBMQE6GFTARQ@tmp/withMaven38252779/pipeline-maven-spy.jar"
-Dorg.jenkinsci.plugins.pipeline.maven.reportsFolder="/home/jenkins/jenkins-slave/workspace/n-resolver-ant-tasks_master-PZI36OPNRAJBXJOAPEQN5EKT3YVHZTR3KX72Y4FQGBMQE6GFTARQ@tmp/withMaven38252779"

[linux-jdk7] Apache Maven 3.5.2 (138edd61fd100ec658bfa2d307c43b76940a5d7d; 2017-10-18T07:58:13Z)
[linux-jdk7] Maven home: /home/jenkins/tools/maven/apache-maven-3.5.2
[linux-jdk7] Java version: 1.7.0_80, vendor: Oracle Corporation
[linux-jdk7] Java home: /usr/local/asfpackages/java/jdk1.7.0_80/jre
[linux-jdk7] Default locale: en_US, platform encoding: ISO-8859-1
[linux-jdk7] OS name: "linux", version: "4.4.0-109-generic", arch: "amd64", family: "unix"
[linux-jdk7] [INFO] [jenkins-event-spy] Generate /home/jenkins/jenkins-slave/workspace/n-resolver-ant-tasks_master-PZI36OPNRAJBXJOAPEQN5EKT3YVHZTR3KX72Y4FQGBMQE6GFTARQ@tmp/withMaven38252779/maven-spy-20180215-185107-8758588656624036023835.log.tmp
...
[Pipeline] [linux-jdk8] isUnix
[Pipeline] [linux-jdk8] sh
[linux-jdk8] [m] Running shell script
[linux-jdk8] + mvn -P+run-its -Dmaven.test.failure.ignore=true -Dfindbugs.failOnError=false
-Dfindbugs.skip=true clean verify
[linux-jdk8] ----- withMaven Wrapper script -----
[linux-jdk8] Picked up JAVA_TOOL_OPTIONS: -Dmaven.ext.class.path="/home/jenkins/jenkins-slave/workspace/n-resolver-ant-tasks_master-PZI36OPNRAJBXJOAPEQN5EKT3YVHZTR3KX72Y4FQGBMQE6GFTARQ@tmp/withMavene2413bb7/pipeline-maven-spy.jar"
-Dorg.jenkinsci.plugins.pipeline.maven.reportsFolder="/home/jenkins/jenkins-slave/workspace/n-resolver-ant-tasks_master-PZI36OPNRAJBXJOAPEQN5EKT3YVHZTR3KX72Y4FQGBMQE6GFTARQ@tmp/withMavene2413bb7"

[linux-jdk8] Apache Maven 3.5.2 (138edd61fd100ec658bfa2d307c43b76940a5d7d; 2017-10-18T07:58:13Z)
[linux-jdk8] Maven home: /home/jenkins/tools/maven/apache-maven-3.5.2
[linux-jdk8] Java version: 1.8.0_152, vendor: Oracle Corporation
[linux-jdk8] Java home: /usr/local/asfpackages/java/jdk1.8.0_152/jre
[linux-jdk8] Default locale: en_US, platform encoding: ISO-8859-1
[linux-jdk8] OS name: "linux", version: "4.4.0-98-generic", arch: "amd64", family: "unix"
[Pipeline] [linux-jdk9] isUnix
[Pipeline] [linux-jdk9] sh
[linux-jdk9] [m] Running shell script
[Pipeline] [windows-jdk8] isUnix
[Pipeline] [windows-jdk8] bat
[windows-jdk8] [m] Running batch script
[Pipeline] [windows-jdk9] {
[linux-jdk7] [INFO] Scanning for projects...
[linux-jdk7] [INFO] Downloading from central: https://repo.maven.apache.org/maven2/org/apache/maven/maven-parent/30/maven-parent-30.pom
[Pipeline] [windows-jdk9] stage
[Pipeline] [windows-jdk9] { (Checkout windows-jdk9)
[Pipeline] [windows-jdk9] dir
[windows-jdk9] Running in f:\jenkins\jenkins-slave\workspace\n-resolver-ant-tasks_master-PZI36OPNRAJBXJOAPEQN5EKT3YVHZTR3KX72Y4FQGBMQE6GFTARQ\m
[Pipeline] [windows-jdk9] {
[Pipeline] [windows-jdk9] checkout
[Pipeline] [windows-jdk7] }
[Pipeline] [windows-jdk7] // dir
[linux-jdk9] + mvn -P+run-its -Dmaven.test.failure.ignore=true -Dfindbugs.failOnError=false
-Dfindbugs.skip=true clean verify
[linux-jdk9] ----- withMaven Wrapper script -----
[linux-jdk9] Picked up JAVA_TOOL_OPTIONS: -Dmaven.ext.class.path="/home/jenkins/jenkins-slave/workspace/n-resolver-ant-tasks_master-PZI36OPNRAJBXJOAPEQN5EKT3YVHZTR3KX72Y4FQGBMQE6GFTARQ@tmp/withMaven640e149c/pipeline-maven-spy.jar"
-Dorg.jenkinsci.plugins.pipeline.maven.reportsFolder="/home/jenkins/jenkins-slave/workspace/n-resolver-ant-tasks_master-PZI36OPNRAJBXJOAPEQN5EKT3YVHZTR3KX72Y4FQGBMQE6GFTARQ@tmp/withMaven640e149c"

[linux-jdk9] Apache Maven 3.5.2 (138edd61fd100ec658bfa2d307c43b76940a5d7d; 2017-10-18T07:58:13Z)
[linux-jdk9] Maven home: /home/jenkins/tools/maven/apache-maven-3.5.2
[linux-jdk9] Java version: 9.0.1, vendor: Oracle Corporation
[linux-jdk9] Java home: /usr/local/asfpackages/java/jdk-9.0.1
[linux-jdk9] Default locale: en_US, platform encoding: ISO-8859-1
[linux-jdk9] OS name: "linux", version: "4.4.0-98-generic", arch: "amd64", family: "unix"
[windows-jdk8] 
[windows-jdk8] f:\jenkins\jenkins-slave\workspace\n-resolver-ant-tasks_master-PZI36OPNRAJBXJOAPEQN5EKT3YVHZTR3KX72Y4FQGBMQE6GFTARQ@2\m>mvn
-P+run-its -Dmaven.test.failure.ignore=true -Dfindbugs.failOnError=false -Dfindbugs.skip=true
clean verify 
[windows-jdk8] ----- withMaven Wrapper script -----
[windows-jdk9] Cloning the remote Git repository
[windows-jdk9] Cloning with configured refspecs honoured and without tags
[windows-jdk9] Cloning repository https://gitbox.apache.org/repos/asf/maven-resolver-ant-tasks.git
[windows-jdk9]  > git init f:\jenkins\jenkins-slave\workspace\n-resolver-ant-tasks_master-PZI36OPNRAJBXJOAPEQN5EKT3YVHZTR3KX72Y4FQGBMQE6GFTARQ\m
# timeout=10
[windows-jdk9] Fetching upstream changes from https://gitbox.apache.org/repos/asf/maven-resolver-ant-tasks.git
[windows-jdk9]  > git --version # timeout=10
[windows-jdk9]  > git fetch --no-tags --progress https://gitbox.apache.org/repos/asf/maven-resolver-ant-tasks.git
+refs/heads/*:refs/remotes/origin/*
[Pipeline] [windows-jdk7] }
[windows-jdk7] [withMaven] Skip 'Generated Artifacts Publisher' disabled by configuration
[windows-jdk7] [withMaven] Skip 'Findbugs Publisher' disabled by configuration
[windows-jdk7] [withMaven] Skip 'Open Task Scanner Publisher' disabled by configuration
[Pipeline] [windows-jdk7] // withMaven
[Pipeline] [windows-jdk7] echo
[windows-jdk7] [FAIL FAST] This is the first failure and likely root cause
[Pipeline] [windows-jdk7] }
[Pipeline] [windows-jdk7] // stage
[Pipeline] [windows-jdk7] }
[Pipeline] [windows-jdk7] // node
[Pipeline] [windows-jdk7] }
[linux-jdk7] Sending interrupt signal to process
[linux-jdk7] [INFO] Downloaded from central: https://repo.maven.apache.org/maven2/org/apache/maven/maven-parent/30/maven-parent-30.pom
(41 kB at 51 kB/s)
[linux-jdk7] [INFO] Downloading from central: https://repo.maven.apache.org/maven2/org/apache/apache/18/apache-18.pom
[linux-jdk7] [INFO] Downloaded from central: https://repo.maven.apache.org/maven2/org/apache/apache/18/apache-18.pom
(16 kB at 603 kB/s)
[linux-jdk8] [INFO] [jenkins-event-spy] Generate /home/jenkins/jenkins-slave/workspace/n-resolver-ant-tasks_master-PZI36OPNRAJBXJOAPEQN5EKT3YVHZTR3KX72Y4FQGBMQE6GFTARQ@tmp/withMavene2413bb7/maven-spy-20180215-185109-297240807629018680505.log.tmp
...
[linux-jdk8] [INFO] Scanning for projects...
[windows-jdk8] Apache Maven 3.5.0 (ff8f5e7444045639af65f6095c62210b5713f426; 2017-04-03T19:39:06Z)
[windows-jdk8] Maven home: F:\jenkins\tools\maven\apache-maven-3.5.0\bin\..
[windows-jdk8] Java version: 1.8.0_152, vendor: Oracle Corporation
[windows-jdk8] Java home: f:\jenkins\tools\java\latest1.8\jre
[windows-jdk8] Default locale: en_US, platform encoding: Cp1252
[windows-jdk8] OS name: "windows server 2012 r2", version: "6.3", arch: "amd64", family: "windows"
[windows-jdk7] Failed in branch windows-jdk7
[linux-jdk7] [INFO] 
[linux-jdk7] [INFO] ------------------------------------------------------------------------
[linux-jdk7] [INFO] Building Maven Artifact Resolver Ant Tasks 1.1.0-SNAPSHOT
[linux-jdk7] [INFO] ------------------------------------------------------------------------
[linux-jdk7] [INFO] Downloading from central: https://repo.maven.apache.org/maven2/org/apache/maven/plugins/maven-remote-resources-plugin/1.5/maven-remote-resources-plugin-1.5.pom
[linux-jdk7] [INFO] Downloaded from central: https://repo.maven.apache.org/maven2/org/apache/maven/plugins/maven-remote-resources-plugin/1.5/maven-remote-resources-plugin-1.5.pom
(13 kB at 636 kB/s)
[linux-jdk7] [INFO] Downloading from central: https://repo.maven.apache.org/maven2/org/apache/maven/plugins/maven-plugins/24/maven-plugins-24.pom
[linux-jdk7] [INFO] Downloaded from central: https://repo.maven.apache.org/maven2/org/apache/maven/plugins/maven-plugins/24/maven-plugins-24.pom
(11 kB at 491 kB/s)
[linux-jdk7] [INFO] Downloading from central: https://repo.maven.apache.org/maven2/org/apache/maven/maven-parent/23/maven-parent-23.pom
[linux-jdk7] [INFO] Downloaded from central: https://repo.maven.apache.org/maven2/org/apache/maven/maven-parent/23/maven-parent-23.pom
(33 kB at 1.4 MB/s)
[linux-jdk7] [INFO] Downloading from central: https://repo.maven.apache.org/maven2/org/apache/apache/13/apache-13.pom
[linux-jdk8] [INFO] Downloading from central: https://repo.maven.apache.org/maven2/org/apache/maven/maven-parent/30/maven-parent-30.pom
[windows-jdk9]  > git config remote.origin.url https://gitbox.apache.org/repos/asf/maven-resolver-ant-tasks.git
# timeout=10
[windows-jdk9]  > git config --add remote.origin.fetch +refs/heads/*:refs/remotes/origin/*
# timeout=10
[windows-jdk9]  > git config remote.origin.url https://gitbox.apache.org/repos/asf/maven-resolver-ant-tasks.git
# timeout=10
[windows-jdk9] Fetching without tags
[windows-jdk9] Fetching upstream changes from https://gitbox.apache.org/repos/asf/maven-resolver-ant-tasks.git
[windows-jdk9]  > git fetch --no-tags --progress https://gitbox.apache.org/repos/asf/maven-resolver-ant-tasks.git
+refs/heads/*:refs/remotes/origin/*
[linux-jdk8] Sending interrupt signal to process
[linux-jdk9] [INFO] [jenkins-event-spy] Generate /home/jenkins/jenkins-slave/workspace/n-resolver-ant-tasks_master-PZI36OPNRAJBXJOAPEQN5EKT3YVHZTR3KX72Y4FQGBMQE6GFTARQ@tmp/withMaven640e149c/maven-spy-20180215-185110-5179127867135863676146.log.tmp
...
[linux-jdk9] [INFO] Scanning for projects...
[windows-jdk9] Checking out Revision 3894dc4f92ba701f61089452cb1dfe07c7e1afa2 (master)
[windows-jdk9]  > git config core.sparsecheckout # timeout=10
[windows-jdk9]  > git checkout -f 3894dc4f92ba701f61089452cb1dfe07c7e1afa2
[windows-jdk9] Commit message: "Set resolverVersion to 1.1.1"
[windows-jdk9] Cleaning workspace
[windows-jdk9]  > git rev-parse --verify HEAD # timeout=10
[windows-jdk9] Resetting working tree
[windows-jdk9]  > git reset --hard # timeout=10
[windows-jdk9]  > git clean -fdx # timeout=10
[linux-jdk9] [INFO] Downloading from central: https://repo.maven.apache.org/maven2/org/apache/maven/maven-parent/30/maven-parent-30.pom
[linux-jdk9] [INFO] Downloaded from central: https://repo.maven.apache.org/maven2/org/apache/maven/maven-parent/30/maven-parent-30.pom
(41 kB at 106 kB/s)
[linux-jdk9] [INFO] Downloading from central: https://repo.maven.apache.org/maven2/org/apache/apache/18/apache-18.pom
[linux-jdk9] [INFO] Downloaded from central: https://repo.maven.apache.org/maven2/org/apache/apache/18/apache-18.pom
(16 kB at 681 kB/s)
[linux-jdk9] Sending interrupt signal to process
[linux-jdk9] [INFO] 
[linux-jdk9] [INFO] ------------------------------------------------------------------------
[linux-jdk9] [INFO] Building Maven Artifact Resolver Ant Tasks 1.1.0-SNAPSHOT
[linux-jdk9] [INFO] ------------------------------------------------------------------------
[linux-jdk9] [INFO] Downloading from central: https://repo.maven.apache.org/maven2/org/apache/maven/plugins/maven-remote-resources-plugin/1.5/maven-remote-resources-plugin-1.5.pom
[linux-jdk9] [INFO] Downloaded from central: https://repo.maven.apache.org/maven2/org/apache/maven/plugins/maven-remote-resources-plugin/1.5/maven-remote-resources-plugin-1.5.pom
(13 kB at 556 kB/s)
[linux-jdk9] [INFO] Downloading from central: https://repo.maven.apache.org/maven2/org/apache/maven/plugins/maven-plugins/24/maven-plugins-24.pom
[linux-jdk9] [INFO] Downloaded from central: https://repo.maven.apache.org/maven2/org/apache/maven/plugins/maven-plugins/24/maven-plugins-24.pom
(11 kB at 515 kB/s)
[linux-jdk9] [INFO] Downloading from central: https://repo.maven.apache.org/maven2/org/apache/maven/maven-parent/23/maven-parent-23.pom
[linux-jdk9] [INFO] Downloaded from central: https://repo.maven.apache.org/maven2/org/apache/maven/maven-parent/23/maven-parent-23.pom
(33 kB at 1.0 MB/s)
[linux-jdk9] [INFO] Downloading from central: https://repo.maven.apache.org/maven2/org/apache/apache/13/apache-13.pom
[linux-jdk9] [INFO] Downloaded from central: https://repo.maven.apache.org/maven2/org/apache/apache/13/apache-13.pom
(14 kB at 822 kB/s)
[linux-jdk9] [INFO] Downloading from central: https://repo.maven.apache.org/maven2/org/apache/maven/plugins/maven-remote-resources-plugin/1.5/maven-remote-resources-plugin-1.5.jar
[linux-jdk9] [INFO] Downloaded from central: https://repo.maven.apache.org/maven2/org/apache/maven/plugins/maven-remote-resources-plugin/1.5/maven-remote-resources-plugin-1.5.jar
(69 kB at 2.7 MB/s)
[linux-jdk9] [INFO] Downloading from central: https://repo.maven.apache.org/maven2/org/apache/maven/plugins/maven-site-plugin/3.5.1/maven-site-plugin-3.5.1.pom
[linux-jdk9] [INFO] Downloaded from central: https://repo.maven.apache.org/maven2/org/apache/maven/plugins/maven-site-plugin/3.5.1/maven-site-plugin-3.5.1.pom
(18 kB at 748 kB/s)
[linux-jdk9] [INFO] Downloading from central: https://repo.maven.apache.org/maven2/org/apache/maven/plugins/maven-plugins/28/maven-plugins-28.pom
[linux-jdk9] [INFO] Downloaded from central: https://repo.maven.apache.org/maven2/org/apache/maven/plugins/maven-plugins/28/maven-plugins-28.pom
(12 kB at 668 kB/s)
[linux-jdk9] [INFO] Downloading from central: https://repo.maven.apache.org/maven2/org/apache/maven/maven-parent/27/maven-parent-27.pom
[windows-jdk8] [INFO] [jenkins-event-spy] Generate F:\jenkins\jenkins-slave\workspace\n-resolver-ant-tasks_master-PZI36OPNRAJBXJOAPEQN5EKT3YVHZTR3KX72Y4FQGBMQE6GFTARQ@2@tmp\withMaven8d848f8b\maven-spy-20180215-185111-1835468213959858801714.log.tmp
...
[windows-jdk8] [INFO] Scanning for projects...
[windows-jdk8] Sending interrupt signal to process
[Pipeline] [linux-jdk7] }
[Pipeline] [linux-jdk8] }
[Pipeline] [windows-jdk9] }
[Pipeline] [linux-jdk7] // dir
[Pipeline] [linux-jdk8] // dir
[Pipeline] [windows-jdk9] // dir
[Pipeline] [linux-jdk7] }
[linux-jdk7] [withMaven] One or multiple Maven executions have been ignored by the Jenkins
Pipeline Maven Plugin because they have been interrupted before completion (1). See Pipeline
Maven Plugin FAQ for more details.
[Pipeline] [linux-jdk8] }
[linux-jdk8] [withMaven] One or multiple Maven executions have been ignored by the Jenkins
Pipeline Maven Plugin because they have been interrupted before completion (1). See Pipeline
Maven Plugin FAQ for more details.
[Pipeline] [windows-jdk9] }
[Pipeline] [linux-jdk7] // withMaven
[Pipeline] [linux-jdk8] // withMaven
[Pipeline] [windows-jdk9] // stage
[Pipeline] [linux-jdk7] echo
[linux-jdk7] [FAIL FAST] windows-jdk7 had first failure, ignoring script returned exit code
143
[Pipeline] [linux-jdk7] }
[Pipeline] [linux-jdk8] echo
[linux-jdk8] [FAIL FAST] windows-jdk7 had first failure, ignoring script returned exit code
143
[Pipeline] [linux-jdk8] }
[Pipeline] [linux-jdk9] }
[Pipeline] [windows-jdk8] }
[Pipeline] [windows-jdk9] stage
[Pipeline] [windows-jdk9] { (Build windows-jdk9)
[Pipeline] [windows-jdk9] echo
[windows-jdk9] [FAIL FAST] windows-jdk7 has failed. Skipping windows-jdk9.
[Pipeline] [windows-jdk9] }
[Pipeline] [linux-jdk7] // stage
[Pipeline] [linux-jdk8] // stage
[Pipeline] [linux-jdk9] // dir
[Pipeline] [windows-jdk8] // dir
[Pipeline] [linux-jdk7] }
[Pipeline] [linux-jdk8] }
[Pipeline] [linux-jdk9] }
[linux-jdk9] [withMaven] One or multiple Maven executions have been ignored by the Jenkins
Pipeline Maven Plugin because they have been interrupted before completion (1). See Pipeline
Maven Plugin FAQ for more details.
[Pipeline] [windows-jdk8] }
[windows-jdk8] [withMaven] One or multiple Maven executions have been ignored by the Jenkins
Pipeline Maven Plugin because they have been interrupted before completion (1). See Pipeline
Maven Plugin FAQ for more details.
[Pipeline] [windows-jdk9] // stage
[Pipeline] [windows-jdk9] }
[Pipeline] [linux-jdk7] // node
[Pipeline] [linux-jdk8] // node
[Pipeline] [linux-jdk9] // withMaven
[Pipeline] [windows-jdk8] // withMaven
[Pipeline] [linux-jdk7] }
[Pipeline] [linux-jdk8] }
[Pipeline] [linux-jdk9] echo
[linux-jdk9] [FAIL FAST] windows-jdk7 had first failure, ignoring script returned exit code
143
[Pipeline] [linux-jdk9] }
[Pipeline] [windows-jdk8] }
[Pipeline] [windows-jdk9] // node
[Pipeline] [windows-jdk9] }
[Pipeline] [linux-jdk9] // stage
[Pipeline] [windows-jdk8] // stage
[Pipeline] [linux-jdk9] }
[Pipeline] [windows-jdk8] }
[Pipeline] [linux-jdk9] // node
[Pipeline] [windows-jdk8] // node
[Pipeline] [linux-jdk9] }
[Pipeline] [windows-jdk8] }
[Pipeline] // parallel
[Pipeline] echo
***** FAST FAILURE *****

Fast failure triggered by windows-jdk7

***** FAST FAILURE *****
[Pipeline] stage
[Pipeline] { (Notifications)
[Pipeline] echo
Build result: FAILURE
[Pipeline] jiraIssueSelector
[Pipeline] emailext
Mime
  • Unnamed multipart/mixed (inline, None, 0 bytes)
View raw message