maven-notifications mailing list archives

Site index · List index
Message view « Date » · « Thread »
Top « Date » · « Thread »
From Apache Jenkins Server <jenk...@builds.apache.org>
Subject Build failed in Jenkins: Maven TLP » maven-artifact-transfer » MSHARED-679-package-private #5
Date Wed, 14 Feb 2018 20:13:40 GMT
See https://builds.apache.org/job/maven-box/job/maven-artifact-transfer/job/MSHARED-679-package-private/5/

Changes:

* [MSHARED-682] - Upgrade maven-shared-components parent to version 31  o
* [MSHARED-656] Make integration testing for different Maven versions
* Reformatted code  * Added null checks for parameters in ProjectDeployer
* Enhanced apache-rat-plugin configuration Fixed missing copyright header.
* Added Maven Project Deployer IT
* Improved.
* Fixed rebase issue.
* Added argument checks. Added DefaultDependencyCollectorTest
* [MSHARED-679] - Make all classes package private in internal package
* [MSHARED-682] - Upgrade maven-shared-components parent to version 31  o
* [MSHARED-656] Make integration testing for different Maven versions
* Reformatted code  * Added null checks for parameters in ProjectDeployer
* Enhanced apache-rat-plugin configuration Fixed missing copyright header.
* Added Maven Project Deployer IT
* Improved.
* Fixed rebase issue.
* Added argument checks. Added DefaultDependencyCollectorTest
* [MSHARED-679] - Make all classes package private in internal package

All tests passed

Build log:
[...truncated 1.16 MB...]
[windows-jdk7] [INFO] 
[windows-jdk7] [INFO] --- maven-checkstyle-plugin:3.0.0:check (checkstyle-check) @ maven-artifact-transfer
---
[windows-jdk7] [INFO] Downloading: https://repo.maven.apache.org/maven2/org/apache/maven/shared/maven-shared-resources/2/maven-shared-resources-2.pom
[windows-jdk7] [INFO] Downloaded: https://repo.maven.apache.org/maven2/org/apache/maven/shared/maven-shared-resources/2/maven-shared-resources-2.pom
(3.0 kB at 328 kB/s)
[windows-jdk7] [INFO] Downloading: https://repo.maven.apache.org/maven2/org/apache/maven/reporting/maven-reporting-impl/2.3/maven-reporting-impl-2.3.pom
[windows-jdk7] [INFO] Downloaded: https://repo.maven.apache.org/maven2/org/apache/maven/reporting/maven-reporting-impl/2.3/maven-reporting-impl-2.3.pom
(5.0 kB at 714 kB/s)
[windows-jdk7] [INFO] Downloading: https://repo.maven.apache.org/maven2/org/apache/maven/doxia/doxia-sink-api/1.2/doxia-sink-api-1.2.pom
[windows-jdk7] [INFO] Downloaded: https://repo.maven.apache.org/maven2/org/apache/maven/doxia/doxia-sink-api/1.2/doxia-sink-api-1.2.pom
(1.6 kB at 234 kB/s)
[windows-jdk7] [INFO] Downloading: https://repo.maven.apache.org/maven2/org/apache/maven/doxia/doxia/1.2/doxia-1.2.pom
[windows-jdk7] [INFO] Downloaded: https://repo.maven.apache.org/maven2/org/apache/maven/doxia/doxia/1.2/doxia-1.2.pom
(19 kB at 2.7 MB/s)
[windows-jdk7] [INFO] Downloading: https://repo.maven.apache.org/maven2/org/apache/maven/maven-parent/19/maven-parent-19.pom
[windows-jdk7] [INFO] Downloaded: https://repo.maven.apache.org/maven2/org/apache/maven/maven-parent/19/maven-parent-19.pom
(25 kB at 2.5 MB/s)
[windows-jdk7] [INFO] Downloading: https://repo.maven.apache.org/maven2/org/apache/maven/doxia/doxia-logging-api/1.2/doxia-logging-api-1.2.pom
[windows-jdk7] [INFO] Downloaded: https://repo.maven.apache.org/maven2/org/apache/maven/doxia/doxia-logging-api/1.2/doxia-logging-api-1.2.pom
(1.6 kB at 206 kB/s)
[windows-jdk7] [INFO] Downloading: https://repo.maven.apache.org/maven2/org/apache/maven/doxia/doxia-core/1.2/doxia-core-1.2.pom
[windows-jdk7] [INFO] Downloaded: https://repo.maven.apache.org/maven2/org/apache/maven/doxia/doxia-core/1.2/doxia-core-1.2.pom
(4.0 kB at 439 kB/s)
[windows-jdk7] [INFO] Downloading: https://repo.maven.apache.org/maven2/org/apache/maven/doxia/doxia-site-renderer/1.2/doxia-site-renderer-1.2.pom
[windows-jdk7] [INFO] Downloaded: https://repo.maven.apache.org/maven2/org/apache/maven/doxia/doxia-site-renderer/1.2/doxia-site-renderer-1.2.pom
(6.2 kB at 693 kB/s)
[windows-jdk7] [INFO] Downloading: https://repo.maven.apache.org/maven2/org/apache/maven/doxia/doxia-sitetools/1.2/doxia-sitetools-1.2.pom
[windows-jdk7] [INFO] Downloaded: https://repo.maven.apache.org/maven2/org/apache/maven/doxia/doxia-sitetools/1.2/doxia-sitetools-1.2.pom
(16 kB at 2.0 MB/s)
[windows-jdk7] [INFO] Downloading: https://repo.maven.apache.org/maven2/org/apache/maven/doxia/doxia-decoration-model/1.2/doxia-decoration-model-1.2.pom
[windows-jdk7] [INFO] Downloaded: https://repo.maven.apache.org/maven2/org/apache/maven/doxia/doxia-decoration-model/1.2/doxia-decoration-model-1.2.pom
(3.1 kB at 437 kB/s)
[windows-jdk7] [INFO] Downloading: https://repo.maven.apache.org/maven2/org/apache/maven/doxia/doxia-module-xhtml/1.2/doxia-module-xhtml-1.2.pom
[windows-jdk7] [INFO] Downloaded: https://repo.maven.apache.org/maven2/org/apache/maven/doxia/doxia-module-xhtml/1.2/doxia-module-xhtml-1.2.pom
(1.8 kB at 251 kB/s)
[windows-jdk7] [INFO] Downloading: https://repo.maven.apache.org/maven2/org/apache/maven/doxia/doxia-modules/1.2/doxia-modules-1.2.pom
[windows-jdk7] [INFO] Downloaded: https://repo.maven.apache.org/maven2/org/apache/maven/doxia/doxia-modules/1.2/doxia-modules-1.2.pom
(2.5 kB at 250 kB/s)
[windows-jdk7] [INFO] Downloading: https://repo.maven.apache.org/maven2/org/apache/maven/doxia/doxia-module-fml/1.2/doxia-module-fml-1.2.pom
[windows-jdk7] [INFO] Downloaded: https://repo.maven.apache.org/maven2/org/apache/maven/doxia/doxia-module-fml/1.2/doxia-module-fml-1.2.pom
(5.6 kB at 703 kB/s)
[windows-jdk7] [INFO] Downloading: https://repo.maven.apache.org/maven2/org/apache/maven/doxia/doxia-sink-api/1.4/doxia-sink-api-1.4.pom
[windows-jdk7] [INFO] Downloaded: https://repo.maven.apache.org/maven2/org/apache/maven/doxia/doxia-sink-api/1.4/doxia-sink-api-1.4.pom
(1.5 kB at 170 kB/s)
[windows-jdk7] [INFO] Downloading: https://repo.maven.apache.org/maven2/org/apache/maven/doxia/doxia/1.4/doxia-1.4.pom
[windows-jdk7] [INFO] Downloaded: https://repo.maven.apache.org/maven2/org/apache/maven/doxia/doxia/1.4/doxia-1.4.pom
(18 kB at 2.2 MB/s)
[windows-jdk7] [INFO] Downloading: https://repo.maven.apache.org/maven2/org/apache/maven/doxia/doxia-logging-api/1.4/doxia-logging-api-1.4.pom
[windows-jdk7] [INFO] Downloaded: https://repo.maven.apache.org/maven2/org/apache/maven/doxia/doxia-logging-api/1.4/doxia-logging-api-1.4.pom
(1.5 kB at 192 kB/s)
[windows-jdk7] [INFO] Downloading: https://repo.maven.apache.org/maven2/org/apache/maven/doxia/doxia-decoration-model/1.4/doxia-decoration-model-1.4.pom
[windows-jdk7] [INFO] Downloaded: https://repo.maven.apache.org/maven2/org/apache/maven/doxia/doxia-decoration-model/1.4/doxia-decoration-model-1.4.pom
(2.7 kB at 334 kB/s)
[windows-jdk7] [INFO] Downloading: https://repo.maven.apache.org/maven2/org/apache/maven/doxia/doxia-sitetools/1.4/doxia-sitetools-1.4.pom
[windows-jdk7] [INFO] Downloaded: https://repo.maven.apache.org/maven2/org/apache/maven/doxia/doxia-sitetools/1.4/doxia-sitetools-1.4.pom
(17 kB at 2.1 MB/s)
[windows-jdk7] [INFO] Downloading: https://repo.maven.apache.org/maven2/org/codehaus/plexus/plexus-utils/3.0.10/plexus-utils-3.0.10.pom
[windows-jdk7] [INFO] Downloaded: https://repo.maven.apache.org/maven2/org/codehaus/plexus/plexus-utils/3.0.10/plexus-utils-3.0.10.pom
(3.1 kB at 393 kB/s)
[windows-jdk7] [INFO] Downloading: https://repo.maven.apache.org/maven2/org/codehaus/plexus/plexus/3.3/plexus-3.3.pom
[windows-jdk7] [INFO] Downloaded: https://repo.maven.apache.org/maven2/org/codehaus/plexus/plexus/3.3/plexus-3.3.pom
(20 kB at 2.5 MB/s)
[windows-jdk7] [INFO] Downloading: https://repo.maven.apache.org/maven2/org/apache/maven/doxia/doxia-site-renderer/1.4/doxia-site-renderer-1.4.pom
[windows-jdk7] [INFO] Downloaded: https://repo.maven.apache.org/maven2/org/apache/maven/doxia/doxia-site-renderer/1.4/doxia-site-renderer-1.4.pom
(6.1 kB at 873 kB/s)
[windows-jdk7] [INFO] Downloading: https://repo.maven.apache.org/maven2/org/apache/maven/doxia/doxia-core/1.4/doxia-core-1.4.pom
[windows-jdk7] [INFO] Downloaded: https://repo.maven.apache.org/maven2/org/apache/maven/doxia/doxia-core/1.4/doxia-core-1.4.pom
(4.1 kB at 678 kB/s)
[windows-jdk7] [INFO] Downloading: https://repo.maven.apache.org/maven2/org/apache/maven/doxia/doxia-module-xhtml/1.4/doxia-module-xhtml-1.4.pom
[windows-jdk7] [INFO] Downloaded: https://repo.maven.apache.org/maven2/org/apache/maven/doxia/doxia-module-xhtml/1.4/doxia-module-xhtml-1.4.pom
(1.6 kB at 181 kB/s)
[windows-jdk7] [INFO] Downloading: https://repo.maven.apache.org/maven2/org/apache/maven/doxia/doxia-modules/1.4/doxia-modules-1.4.pom
[windows-jdk7] [INFO] Downloaded: https://repo.maven.apache.org/maven2/org/apache/maven/doxia/doxia-modules/1.4/doxia-modules-1.4.pom
(2.6 kB at 328 kB/s)
[windows-jdk7] [INFO] Downloading: https://repo.maven.apache.org/maven2/org/apache/maven/doxia/doxia-module-fml/1.4/doxia-module-fml-1.4.pom
[windows-jdk7] [INFO] Downloaded: https://repo.maven.apache.org/maven2/org/apache/maven/doxia/doxia-module-fml/1.4/doxia-module-fml-1.4.pom
(4.8 kB at 600 kB/s)
[windows-jdk7] [INFO] Downloading: https://repo.maven.apache.org/maven2/org/apache/maven/doxia/doxia-integration-tools/1.6/doxia-integration-tools-1.6.pom
[windows-jdk7] [INFO] Downloaded: https://repo.maven.apache.org/maven2/org/apache/maven/doxia/doxia-integration-tools/1.6/doxia-integration-tools-1.6.pom
(7.0 kB at 580 kB/s)
[windows-jdk7] [INFO] Downloading: https://repo.maven.apache.org/maven2/org/apache/maven/doxia/doxia-tools/3/doxia-tools-3.pom
[windows-jdk7] [INFO] Downloaded: https://repo.maven.apache.org/maven2/org/apache/maven/doxia/doxia-tools/3/doxia-tools-3.pom
(9.9 kB at 1.1 MB/s)
[windows-jdk7] [INFO] Downloading: https://repo.maven.apache.org/maven2/org/codehaus/plexus/plexus-resources/1.1.0/plexus-resources-1.1.0.pom
[windows-jdk7] [INFO] Downloaded: https://repo.maven.apache.org/maven2/org/codehaus/plexus/plexus-resources/1.1.0/plexus-resources-1.1.0.pom
(3.2 kB at 74 kB/s)
[windows-jdk7] [INFO] Downloading: https://repo.maven.apache.org/maven2/org/codehaus/plexus/plexus-velocity/1.1.8/plexus-velocity-1.1.8.pom
[windows-jdk7] [INFO] Downloaded: https://repo.maven.apache.org/maven2/org/codehaus/plexus/plexus-velocity/1.1.8/plexus-velocity-1.1.8.pom
(1.9 kB at 192 kB/s)
[windows-jdk7] [INFO] Downloading: https://repo.maven.apache.org/maven2/org/codehaus/plexus/plexus-components/1.1.15/plexus-components-1.1.15.pom
[windows-jdk7] [INFO] Downloaded: https://repo.maven.apache.org/maven2/org/codehaus/plexus/plexus-components/1.1.15/plexus-components-1.1.15.pom
(2.8 kB at 316 kB/s)
[windows-jdk7] [INFO] Downloading: https://repo.maven.apache.org/maven2/com/puppycrawl/tools/checkstyle/6.18/checkstyle-6.18.pom
[windows-jdk7] [INFO] Downloaded: https://repo.maven.apache.org/maven2/com/puppycrawl/tools/checkstyle/6.18/checkstyle-6.18.pom
(71 kB at 4.4 MB/s)
[windows-jdk7] [INFO] Downloading: https://repo.maven.apache.org/maven2/antlr/antlr/2.7.7/antlr-2.7.7.pom
[windows-jdk7] [INFO] Downloaded: https://repo.maven.apache.org/maven2/antlr/antlr/2.7.7/antlr-2.7.7.pom
(632 B at 63 kB/s)
[windows-jdk7] [INFO] Downloading: https://repo.maven.apache.org/maven2/org/antlr/antlr4-runtime/4.5.3/antlr4-runtime-4.5.3.pom
[windows-jdk7] [INFO] Downloaded: https://repo.maven.apache.org/maven2/org/antlr/antlr4-runtime/4.5.3/antlr4-runtime-4.5.3.pom
(2.3 kB at 289 kB/s)
[windows-jdk7] [INFO] Downloading: https://repo.maven.apache.org/maven2/org/antlr/antlr4-master/4.5.3/antlr4-master-4.5.3.pom
[windows-jdk7] [INFO] Downloaded: https://repo.maven.apache.org/maven2/org/antlr/antlr4-master/4.5.3/antlr4-master-4.5.3.pom
(3.7 kB at 460 kB/s)
[windows-jdk7] [INFO] Downloading: https://repo.maven.apache.org/maven2/commons-beanutils/commons-beanutils/1.9.2/commons-beanutils-1.9.2.pom
[windows-jdk7] [INFO] Downloaded: https://repo.maven.apache.org/maven2/commons-beanutils/commons-beanutils/1.9.2/commons-beanutils-1.9.2.pom
(14 kB at 1.3 MB/s)
[windows-jdk7] [INFO] Downloading: https://repo.maven.apache.org/maven2/org/apache/commons/commons-parent/33/commons-parent-33.pom
[windows-jdk7] [INFO] Downloaded: https://repo.maven.apache.org/maven2/org/apache/commons/commons-parent/33/commons-parent-33.pom
(53 kB at 4.4 MB/s)
[windows-jdk7] [INFO] Downloading: https://repo.maven.apache.org/maven2/commons-cli/commons-cli/1.3.1/commons-cli-1.3.1.pom
[windows-jdk7] [INFO] Downloaded: https://repo.maven.apache.org/maven2/commons-cli/commons-cli/1.3.1/commons-cli-1.3.1.pom
(10 kB at 1.3 MB/s)
[windows-jdk7] [INFO] Downloading: https://repo.maven.apache.org/maven2/org/apache/maven/shared/maven-shared-resources/2/maven-shared-resources-2.jar
[windows-jdk7] [INFO] Downloading: https://repo.maven.apache.org/maven2/org/apache/maven/reporting/maven-reporting-impl/2.3/maven-reporting-impl-2.3.jar
[windows-jdk7] [INFO] Downloading: https://repo.maven.apache.org/maven2/org/apache/maven/shared/maven-shared-utils/0.6/maven-shared-utils-0.6.jar
[windows-jdk7] [INFO] Downloading: https://repo.maven.apache.org/maven2/org/apache/maven/doxia/doxia-core/1.2/doxia-core-1.2.jar
[windows-jdk7] [INFO] Downloading: https://repo.maven.apache.org/maven2/commons-digester/commons-digester/1.6/commons-digester-1.6.jar
[windows-jdk7] [INFO] Downloaded: https://repo.maven.apache.org/maven2/org/apache/maven/reporting/maven-reporting-impl/2.3/maven-reporting-impl-2.3.jar
(18 kB at 782 kB/s)
[windows-jdk7] [INFO] Downloading: https://repo.maven.apache.org/maven2/commons-logging/commons-logging/1.0.4/commons-logging-1.0.4.jar
[windows-jdk7] [INFO] Downloaded: https://repo.maven.apache.org/maven2/org/apache/maven/shared/maven-shared-resources/2/maven-shared-resources-2.jar
(13 kB at 544 kB/s)
[windows-jdk7] [INFO] Downloading: https://repo.maven.apache.org/maven2/org/apache/maven/doxia/doxia-sink-api/1.4/doxia-sink-api-1.4.jar
[windows-jdk7] [INFO] Downloaded: https://repo.maven.apache.org/maven2/org/apache/maven/doxia/doxia-core/1.2/doxia-core-1.2.jar
(154 kB at 5.7 MB/s)
[windows-jdk7] [INFO] Downloading: https://repo.maven.apache.org/maven2/org/apache/maven/doxia/doxia-logging-api/1.4/doxia-logging-api-1.4.jar
[windows-jdk7] [INFO] Downloaded: https://repo.maven.apache.org/maven2/org/apache/maven/shared/maven-shared-utils/0.6/maven-shared-utils-0.6.jar
(165 kB at 5.9 MB/s)
[windows-jdk7] [INFO] Downloading: https://repo.maven.apache.org/maven2/org/apache/maven/doxia/doxia-decoration-model/1.4/doxia-decoration-model-1.4.jar
[windows-jdk7] [INFO] Downloaded: https://repo.maven.apache.org/maven2/commons-digester/commons-digester/1.6/commons-digester-1.6.jar
(168 kB at 5.6 MB/s)
[windows-jdk7] [INFO] Downloading: https://repo.maven.apache.org/maven2/org/apache/maven/doxia/doxia-site-renderer/1.4/doxia-site-renderer-1.4.jar
[windows-jdk7] [INFO] Downloaded: https://repo.maven.apache.org/maven2/commons-logging/commons-logging/1.0.4/commons-logging-1.0.4.jar
(38 kB at 1.2 MB/s)
[windows-jdk7] [INFO] Downloading: https://repo.maven.apache.org/maven2/org/apache/maven/doxia/doxia-module-xhtml/1.4/doxia-module-xhtml-1.4.jar
[windows-jdk7] [INFO] Downloaded: https://repo.maven.apache.org/maven2/org/apache/maven/doxia/doxia-sink-api/1.4/doxia-sink-api-1.4.jar
(11 kB at 287 kB/s)
[windows-jdk7] [INFO] Downloading: https://repo.maven.apache.org/maven2/org/apache/maven/doxia/doxia-module-fml/1.4/doxia-module-fml-1.4.jar
[windows-jdk7] [INFO] Downloaded: https://repo.maven.apache.org/maven2/org/apache/maven/doxia/doxia-logging-api/1.4/doxia-logging-api-1.4.jar
(11 kB at 269 kB/s)
[windows-jdk7] [INFO] Downloading: https://repo.maven.apache.org/maven2/org/apache/maven/doxia/doxia-integration-tools/1.6/doxia-integration-tools-1.6.jar
[windows-jdk7] [INFO] Downloaded: https://repo.maven.apache.org/maven2/org/apache/maven/doxia/doxia-module-xhtml/1.4/doxia-module-xhtml-1.4.jar
(15 kB at 350 kB/s)
[windows-jdk7] [INFO] Downloading: https://repo.maven.apache.org/maven2/commons-io/commons-io/1.4/commons-io-1.4.jar
[windows-jdk7] [INFO] Downloaded: https://repo.maven.apache.org/maven2/org/apache/maven/doxia/doxia-decoration-model/1.4/doxia-decoration-model-1.4.jar
(61 kB at 1.3 MB/s)
[windows-jdk7] [INFO] Downloading: https://repo.maven.apache.org/maven2/org/codehaus/plexus/plexus-resources/1.1.0/plexus-resources-1.1.0.jar
[windows-jdk7] [INFO] Downloaded: https://repo.maven.apache.org/maven2/org/apache/maven/doxia/doxia-site-renderer/1.4/doxia-site-renderer-1.4.jar
(53 kB at 1.1 MB/s)
[windows-jdk7] [INFO] Downloading: https://repo.maven.apache.org/maven2/org/codehaus/plexus/plexus-velocity/1.1.8/plexus-velocity-1.1.8.jar
[windows-jdk7] [INFO] Downloaded: https://repo.maven.apache.org/maven2/org/apache/maven/doxia/doxia-module-fml/1.4/doxia-module-fml-1.4.jar
(38 kB at 714 kB/s)
[windows-jdk7] [INFO] Downloading: https://repo.maven.apache.org/maven2/com/puppycrawl/tools/checkstyle/6.18/checkstyle-6.18.jar
[windows-jdk7] [INFO] Downloaded: https://repo.maven.apache.org/maven2/org/apache/maven/doxia/doxia-integration-tools/1.6/doxia-integration-tools-1.6.jar
(45 kB at 811 kB/s)
[windows-jdk7] [INFO] Downloading: https://repo.maven.apache.org/maven2/antlr/antlr/2.7.7/antlr-2.7.7.jar
[windows-jdk7] [INFO] Downloaded: https://repo.maven.apache.org/maven2/commons-io/commons-io/1.4/commons-io-1.4.jar
(109 kB at 1.9 MB/s)
[windows-jdk7] [INFO] Downloading: https://repo.maven.apache.org/maven2/org/antlr/antlr4-runtime/4.5.3/antlr4-runtime-4.5.3.jar
[windows-jdk7] [INFO] Downloaded: https://repo.maven.apache.org/maven2/org/codehaus/plexus/plexus-velocity/1.1.8/plexus-velocity-1.1.8.jar
(7.9 kB at 131 kB/s)
[windows-jdk7] [INFO] Downloading: https://repo.maven.apache.org/maven2/commons-beanutils/commons-beanutils/1.9.2/commons-beanutils-1.9.2.jar
[windows-jdk7] [INFO] Downloaded: https://repo.maven.apache.org/maven2/org/codehaus/plexus/plexus-resources/1.1.0/plexus-resources-1.1.0.jar
(23 kB at 363 kB/s)
[windows-jdk7] [INFO] Downloading: https://repo.maven.apache.org/maven2/commons-cli/commons-cli/1.3.1/commons-cli-1.3.1.jar
[windows-jdk7] [INFO] Downloaded: https://repo.maven.apache.org/maven2/antlr/antlr/2.7.7/antlr-2.7.7.jar
(445 kB at 5.6 MB/s)
[windows-jdk7] [INFO] Downloading: https://repo.maven.apache.org/maven2/commons-lang/commons-lang/2.1/commons-lang-2.1.jar
[windows-jdk7] [INFO] Downloaded: https://repo.maven.apache.org/maven2/org/antlr/antlr4-runtime/4.5.3/antlr4-runtime-4.5.3.jar
(302 kB at 3.7 MB/s)
[windows-jdk7] [INFO] Downloaded: https://repo.maven.apache.org/maven2/commons-cli/commons-cli/1.3.1/commons-cli-1.3.1.jar
(53 kB at 646 kB/s)
[windows-jdk7] [INFO] Downloaded: https://repo.maven.apache.org/maven2/commons-beanutils/commons-beanutils/1.9.2/commons-beanutils-1.9.2.jar
(234 kB at 2.8 MB/s)
[windows-jdk7] [INFO] Downloaded: https://repo.maven.apache.org/maven2/commons-lang/commons-lang/2.1/commons-lang-2.1.jar
(208 kB at 2.2 MB/s)
[windows-jdk7] [INFO] Downloaded: https://repo.maven.apache.org/maven2/com/puppycrawl/tools/checkstyle/6.18/checkstyle-6.18.jar
(1.2 MB at 11 MB/s)
[windows-jdk7] [INFO] There are 5 errors reported by Checkstyle 6.18 with config/maven_checks.xml
ruleset.
[windows-jdk7] [ERROR] src\main\java\org\apache\maven\shared\artifact\resolve\internal\Maven31ArtifactResult.java:[41,5]
(modifier) RedundantModifier: Redundant 'public' modifier.
[windows-jdk7] [ERROR] src\main\java\org\apache\maven\shared\dependencies\collect\internal\Maven30ArtifactRepositoryAdapter.java:[48,5]
(modifier) RedundantModifier: Redundant 'public' modifier.
[windows-jdk7] [ERROR] src\main\java\org\apache\maven\shared\dependencies\collect\internal\Maven30CollectorResult.java:[47,5]
(modifier) RedundantModifier: Redundant 'public' modifier.
[windows-jdk7] [ERROR] src\main\java\org\apache\maven\shared\dependencies\collect\internal\Maven31ArtifactRepositoryAdapter.java:[48,5]
(modifier) RedundantModifier: Redundant 'public' modifier.
[windows-jdk7] [ERROR] src\main\java\org\apache\maven\shared\dependencies\collect\internal\Maven31CollectorResult.java:[47,5]
(modifier) RedundantModifier: Redundant 'public' modifier.
[windows-jdk7] [INFO] ------------------------------------------------------------------------
[windows-jdk7] [INFO] BUILD FAILURE
[windows-jdk7] [INFO] ------------------------------------------------------------------------
[windows-jdk7] [INFO] Total time: 01:46 min
[windows-jdk7] [INFO] Finished at: 2018-02-14T20:13:31Z
[windows-jdk7] [INFO] Final Memory: 56M/1058M
[windows-jdk7] [INFO] ------------------------------------------------------------------------
[windows-jdk7] [INFO] [jenkins-event-spy] Generated F:\jenkins\jenkins-slave\workspace\MSHARED-679-package-private-SJGHFXICEHV2XQZ2XINQPOGHCRPTMVIE3TFTK4D25HFACXO76KQQ@tmp\withMaven70dc6c7b\maven-spy-20180214-201144-437302159904488312192.log
[windows-jdk7] [ERROR] Failed to execute goal org.apache.maven.plugins:maven-checkstyle-plugin:3.0.0:check
(checkstyle-check) on project maven-artifact-transfer: You have 5 Checkstyle violations. ->
[Help 1]
[windows-jdk7] [ERROR] 
[windows-jdk7] [ERROR] To see the full stack trace of the errors, re-run Maven with the -e
switch.
[windows-jdk7] [ERROR] Re-run Maven using the -X switch to enable full debug logging.
[windows-jdk7] [ERROR] 
[windows-jdk7] [ERROR] For more information about the errors and possible solutions, please
read the following articles:
[windows-jdk7] [ERROR] [Help 1] http://cwiki.apache.org/confluence/display/MAVEN/MojoFailureException
[windows-jdk7] Picked up JAVA_TOOL_OPTIONS: -Dmaven.ext.class.path="f:\jenkins\jenkins-slave\workspace\MSHARED-679-package-private-SJGHFXICEHV2XQZ2XINQPOGHCRPTMVIE3TFTK4D25HFACXO76KQQ@tmp\withMaven70dc6c7b\pipeline-maven-spy.jar"
-Dorg.jenkinsci.plugins.pipeline.maven.reportsFolder="f:\jenkins\jenkins-slave\workspace\MSHARED-679-package-private-SJGHFXICEHV2XQZ2XINQPOGHCRPTMVIE3TFTK4D25HFACXO76KQQ@tmp\withMaven70dc6c7b"

[windows-jdk9] [INFO]           maven-artifact-deployer-plugin\pom.xml ........... SUCCESS
(62.9 s)
[windows-jdk9] [INFO] Building: maven-artifact-installer-plugin\pom.xml
[Pipeline] [windows-jdk7] }
[Pipeline] [windows-jdk7] // dir
[Pipeline] [windows-jdk7] }
[windows-jdk7] [withMaven] Skip 'Generated Artifacts Publisher' disabled by configuration
[windows-jdk7] ERROR: [withMaven] WARNING Exception executing Maven reporter 'Invoker Publisher'
/ org.jenkinsci.plugins.pipeline.maven.publishers.InvokerRunsPublisher. Please report a bug
associated for the component 'pipeline-maven-plugin' at https://issues.jenkins-ci.org 
[windows-jdk7] java.lang.IllegalArgumentException: Cannot relativize 'src/it' relatively to
'f:\jenkins\jenkins-slave\workspace\MSHARED-679-package-private-SJGHFXICEHV2XQZ2XINQPOGHCRPTMVIE3TFTK4D25HFACXO76KQQ'
[windows-jdk7] 	at org.jenkinsci.plugins.pipeline.maven.util.XmlUtils.getPathInWorkspace(XmlUtils.java:319)
[windows-jdk7] 	at org.jenkinsci.plugins.pipeline.maven.publishers.InvokerRunsPublisher.expandAndRelativize(InvokerRunsPublisher.java:178)
[windows-jdk7] 	at org.jenkinsci.plugins.pipeline.maven.publishers.InvokerRunsPublisher.executeReporter(InvokerRunsPublisher.java:126)
[windows-jdk7] 	at org.jenkinsci.plugins.pipeline.maven.publishers.InvokerRunsPublisher.process(InvokerRunsPublisher.java:103)
[windows-jdk7] 	at org.jenkinsci.plugins.pipeline.maven.MavenSpyLogProcessor.processMavenSpyLogs(MavenSpyLogProcessor.java:109)
[windows-jdk7] 	at org.jenkinsci.plugins.pipeline.maven.WithMavenStepExecution$WorkspaceCleanupCallback.finished(WithMavenStepExecution.java:914)
[windows-jdk7] 	at org.jenkinsci.plugins.workflow.steps.BodyExecutionCallback$TailCall.onFailure(BodyExecutionCallback.java:124)
[windows-jdk7] 	at org.jenkinsci.plugins.workflow.cps.CpsBodyExecution$FailureAdapter.receive(CpsBodyExecution.java:345)
[windows-jdk7] 	at com.cloudbees.groovy.cps.impl.ThrowBlock$1.receive(ThrowBlock.java:68)
[windows-jdk7] 	at com.cloudbees.groovy.cps.impl.ConstantBlock.eval(ConstantBlock.java:21)
[windows-jdk7] 	at com.cloudbees.groovy.cps.Next.step(Next.java:83)
[windows-jdk7] 	at com.cloudbees.groovy.cps.Continuable$1.call(Continuable.java:174)
[windows-jdk7] 	at com.cloudbees.groovy.cps.Continuable$1.call(Continuable.java:163)
[windows-jdk7] 	at org.codehaus.groovy.runtime.GroovyCategorySupport$ThreadCategoryInfo.use(GroovyCategorySupport.java:122)
[windows-jdk7] 	at org.codehaus.groovy.runtime.GroovyCategorySupport.use(GroovyCategorySupport.java:261)
[windows-jdk7] 	at com.cloudbees.groovy.cps.Continuable.run0(Continuable.java:163)
[windows-jdk7] 	at org.jenkinsci.plugins.workflow.cps.SandboxContinuable.access$001(SandboxContinuable.java:19)
[windows-jdk7] 	at org.jenkinsci.plugins.workflow.cps.SandboxContinuable$1.call(SandboxContinuable.java:35)
[windows-jdk7] 	at org.jenkinsci.plugins.workflow.cps.SandboxContinuable$1.call(SandboxContinuable.java:32)
[windows-jdk7] 	at org.jenkinsci.plugins.scriptsecurity.sandbox.groovy.GroovySandbox.runInSandbox(GroovySandbox.java:108)
[windows-jdk7] 	at org.jenkinsci.plugins.workflow.cps.SandboxContinuable.run0(SandboxContinuable.java:32)
[windows-jdk7] 	at org.jenkinsci.plugins.workflow.cps.CpsThread.runNextChunk(CpsThread.java:174)
[windows-jdk7] 	at org.jenkinsci.plugins.workflow.cps.CpsThreadGroup.run(CpsThreadGroup.java:331)
[windows-jdk7] 	at org.jenkinsci.plugins.workflow.cps.CpsThreadGroup.access$100(CpsThreadGroup.java:82)
[windows-jdk7] 	at org.jenkinsci.plugins.workflow.cps.CpsThreadGroup$2.call(CpsThreadGroup.java:243)
[windows-jdk7] 	at org.jenkinsci.plugins.workflow.cps.CpsThreadGroup$2.call(CpsThreadGroup.java:231)
[windows-jdk7] 	at org.jenkinsci.plugins.workflow.cps.CpsVmExecutorService$2.call(CpsVmExecutorService.java:64)
[windows-jdk7] 	at java.util.concurrent.FutureTask.run(FutureTask.java:266)
[windows-jdk7] 	at hudson.remoting.SingleLaneExecutorService$1.run(SingleLaneExecutorService.java:112)
[windows-jdk7] 	at jenkins.util.ContextResettingExecutorService$1.run(ContextResettingExecutorService.java:28)
[windows-jdk7] 	at java.util.concurrent.Executors$RunnableAdapter.call(Executors.java:511)
[windows-jdk7] 	at java.util.concurrent.FutureTask.run(FutureTask.java:266)
[windows-jdk7] 	at java.util.concurrent.ThreadPoolExecutor.runWorker(ThreadPoolExecutor.java:1149)
[windows-jdk7] 	at java.util.concurrent.ThreadPoolExecutor$Worker.run(ThreadPoolExecutor.java:624)
[windows-jdk7] 	at java.lang.Thread.run(Thread.java:748)
[windows-jdk7] [withMaven] junitPublisher - Archive test results for Maven artifact org.apache.maven.shared:maven-artifact-transfer:0.9.2-SNAPSHOT
generated by maven-surefire-plugin:test (default-test): m\target\surefire-reports\*.xml
[windows-jdk7] [withMaven] junitPublisher - Jenkins JUnit Attachments Plugin not found, can't
publish test attachments.Recording test results
[windows-jdk7] [withMaven] Skip 'Findbugs Publisher' disabled by configuration
[windows-jdk7] [withMaven] Skip 'Open Task Scanner Publisher' disabled by configuration
[Pipeline] [windows-jdk7] // withMaven
[Pipeline] [windows-jdk7] echo
[windows-jdk7] [FAIL FAST] This is the first failure and likely root cause
[Pipeline] [windows-jdk7] }
[Pipeline] [windows-jdk7] // stage
[Pipeline] [windows-jdk7] }
[Pipeline] [windows-jdk7] // node
[windows-jdk7] Failed in branch windows-jdk7
[Pipeline] [windows-jdk7] }
[windows-jdk9] Sending interrupt signal to process
[windows-jdk8] Sending interrupt signal to process
[Pipeline] [linux-jdk7] // node
[Pipeline] [linux-jdk8] // node
[Pipeline] [linux-jdk9] // node
[Pipeline] [linux-jdk7] }
[linux-jdk7] Failed in branch linux-jdk7
[Pipeline] [linux-jdk8] }
[linux-jdk8] Failed in branch linux-jdk8
[Pipeline] [linux-jdk9] }
[linux-jdk9] Failed in branch linux-jdk9
[Pipeline] [windows-jdk8] }
[Pipeline] [windows-jdk8] // dir
[Pipeline] [windows-jdk8] }
[windows-jdk8] [withMaven] One or multiple Maven executions have been ignored by the Jenkins
Pipeline Maven Plugin because they have been interrupted before completion (1). See Pipeline
Maven Plugin FAQ for more details.
[Pipeline] [windows-jdk8] // withMaven
[Pipeline] [windows-jdk8] echo
[windows-jdk8] [FAIL FAST] windows-jdk7 had first failure, ignoring script returned exit code
-1
[Pipeline] [windows-jdk8] }
[Pipeline] [windows-jdk8] // stage
[Pipeline] [windows-jdk8] }
[Pipeline] [windows-jdk8] // node
[Pipeline] [windows-jdk8] }
[Pipeline] [windows-jdk9] }
[Pipeline] [windows-jdk9] // dir
[Pipeline] [windows-jdk9] }
[windows-jdk9] [withMaven] One or multiple Maven executions have been ignored by the Jenkins
Pipeline Maven Plugin because they have been interrupted before completion (1). See Pipeline
Maven Plugin FAQ for more details.
[Pipeline] [windows-jdk9] // withMaven
[Pipeline] [windows-jdk9] echo
[windows-jdk9] [FAIL FAST] windows-jdk7 had first failure, ignoring script returned exit code
-1073741502
[Pipeline] [windows-jdk9] }
[Pipeline] [windows-jdk9] // stage
[Pipeline] [windows-jdk9] }
[Pipeline] [windows-jdk9] // node
[Pipeline] [windows-jdk9] }
[Pipeline] // parallel
[Pipeline] echo
***** FAST FAILURE *****

Fast failure triggered by windows-jdk7

***** FAST FAILURE *****
[Pipeline] stage
[Pipeline] { (Notifications)
[Pipeline] echo
Build result: FAILURE
[Pipeline] jiraIssueSelector
[Pipeline] jiraComment
[Pipeline] jiraComment
[Pipeline] jiraComment
[Pipeline] emailext
Mime
  • Unnamed multipart/mixed (inline, None, 0 bytes)
View raw message