maven-notifications mailing list archives

Site index · List index
Message view « Date » · « Thread »
Top « Date » · « Thread »
From Apache Jenkins Server <jenk...@builds.apache.org>
Subject Build failed in Jenkins: maven-plugins-windows #2106
Date Fri, 10 Nov 2017 07:40:00 GMT
See <https://builds.apache.org/job/maven-plugins-windows/2106/display/redirect?page=changes>

Changes:

[hboutemy] [MSITE-802] improved explanations of generatedSite parameter

------------------------------------------
[...truncated 964.71 KB...]
[INFO] Apache Maven JLink Plugin ......................... FAILURE [1.247s]
[INFO] Apache Maven JMod Plugin .......................... FAILURE [0.635s]
[INFO] Apache Maven Project Info Reports Plugin .......... FAILURE [3.641s]
[INFO] Apache Maven Remote Resources Plugin .............. SUCCESS [12.277s]
[INFO] Apache Maven Shade Plugin ......................... SUCCESS [16.369s]
[INFO] Apache Maven SCM Publish Plugin ................... SUCCESS [7.844s]
[INFO] Apache Maven Dependency Plugin .................... SUCCESS [1:15.250s]
[INFO] Apache Maven Plugins Aggregator ................... SUCCESS [9.594s]
[INFO] ------------------------------------------------------------------------
[INFO] BUILD FAILURE
[INFO] ------------------------------------------------------------------------
[INFO] Total time: 13:38.801s
[INFO] Finished at: Fri Nov 10 07:39:27 UTC 2017
[INFO] Final Memory: 84M/667M
[INFO] ------------------------------------------------------------------------
[ERROR] Failed to execute goal on project maven-jlink-plugin: Could not resolve dependencies
for project org.apache.maven.plugins:maven-jlink-plugin:maven-plugin:3.0.0-alpha-2-SNAPSHOT:
Could not find artifact org.codehaus.plexus:plexus-java:jar:0.9.4-SNAPSHOT in apache-snapshots
(http://repository.apache.org/snapshots/) -> [Help 1]
org.apache.maven.lifecycle.LifecycleExecutionException: Failed to execute goal on project
maven-jlink-plugin: Could not resolve dependencies for project org.apache.maven.plugins:maven-jlink-plugin:maven-plugin:3.0.0-alpha-2-SNAPSHOT:
Could not find artifact org.codehaus.plexus:plexus-java:jar:0.9.4-SNAPSHOT in apache-snapshots
(http://repository.apache.org/snapshots/)
	at org.apache.maven.lifecycle.internal.LifecycleDependencyResolver.getDependencies(LifecycleDependencyResolver.java:210)
	at org.apache.maven.lifecycle.internal.LifecycleDependencyResolver.resolveProjectDependencies(LifecycleDependencyResolver.java:117)
	at org.apache.maven.lifecycle.internal.MojoExecutor.ensureDependenciesAreResolved(MojoExecutor.java:258)
	at org.apache.maven.lifecycle.internal.MojoExecutor.execute(MojoExecutor.java:201)
	at org.apache.maven.lifecycle.internal.MojoExecutor.execute(MojoExecutor.java:153)
	at org.apache.maven.lifecycle.internal.MojoExecutor.execute(MojoExecutor.java:145)
	at org.apache.maven.lifecycle.internal.LifecycleModuleBuilder.buildProject(LifecycleModuleBuilder.java:84)
	at org.apache.maven.lifecycle.internal.LifecycleModuleBuilder.buildProject(LifecycleModuleBuilder.java:59)
	at org.apache.maven.lifecycle.internal.LifecycleStarter.singleThreadedBuild(LifecycleStarter.java:183)
	at org.apache.maven.lifecycle.internal.LifecycleStarter.execute(LifecycleStarter.java:161)
	at org.apache.maven.DefaultMaven.doExecute(DefaultMaven.java:320)
	at org.apache.maven.DefaultMaven.execute(DefaultMaven.java:156)
	at org.jvnet.hudson.maven3.launcher.Maven3Launcher.main(Maven3Launcher.java:117)
	at sun.reflect.NativeMethodAccessorImpl.invoke0(Native Method)
	at sun.reflect.NativeMethodAccessorImpl.invoke(Unknown Source)
	at sun.reflect.DelegatingMethodAccessorImpl.invoke(Unknown Source)
	at java.lang.reflect.Method.invoke(Unknown Source)
	at org.codehaus.plexus.classworlds.launcher.Launcher.launchStandard(Launcher.java:329)
	at org.codehaus.plexus.classworlds.launcher.Launcher.launch(Launcher.java:239)
	at org.jvnet.hudson.maven3.agent.Maven3Main.launch(Maven3Main.java:181)
	at sun.reflect.NativeMethodAccessorImpl.invoke0(Native Method)
	at sun.reflect.NativeMethodAccessorImpl.invoke(Unknown Source)
	at sun.reflect.DelegatingMethodAccessorImpl.invoke(Unknown Source)
	at java.lang.reflect.Method.invoke(Unknown Source)
	at hudson.maven.Maven3Builder.call(Maven3Builder.java:139)
	at hudson.maven.Maven3Builder.call(Maven3Builder.java:70)
	at hudson.remoting.UserRequest.perform(UserRequest.java:153)
	at hudson.remoting.UserRequest.perform(UserRequest.java:50)
	at hudson.remoting.Request$2.run(Request.java:336)
	at hudson.remoting.InterceptingExecutorService$1.call(InterceptingExecutorService.java:68)
	at java.util.concurrent.FutureTask.run(Unknown Source)
	at java.util.concurrent.ThreadPoolExecutor.runWorker(Unknown Source)
	at java.util.concurrent.ThreadPoolExecutor$Worker.run(Unknown Source)
	at java.lang.Thread.run(Unknown Source)
Caused by: org.apache.maven.project.DependencyResolutionException: Could not resolve dependencies
for project org.apache.maven.plugins:maven-jlink-plugin:maven-plugin:3.0.0-alpha-2-SNAPSHOT:
Could not find artifact org.codehaus.plexus:plexus-java:jar:0.9.4-SNAPSHOT in apache-snapshots
(http://repository.apache.org/snapshots/)
	at org.apache.maven.project.DefaultProjectDependenciesResolver.resolve(DefaultProjectDependenciesResolver.java:189)
	at org.apache.maven.lifecycle.internal.LifecycleDependencyResolver.getDependencies(LifecycleDependencyResolver.java:185)
	... 33 more
Caused by: org.sonatype.aether.resolution.DependencyResolutionException: Could not find artifact
org.codehaus.plexus:plexus-java:jar:0.9.4-SNAPSHOT in apache-snapshots (http://repository.apache.org/snapshots/)
	at org.sonatype.aether.impl.internal.DefaultRepositorySystem.resolveDependencies(DefaultRepositorySystem.java:375)
	at org.apache.maven.project.DefaultProjectDependenciesResolver.resolve(DefaultProjectDependenciesResolver.java:183)
	... 34 more
Caused by: org.sonatype.aether.resolution.ArtifactResolutionException: Could not find artifact
org.codehaus.plexus:plexus-java:jar:0.9.4-SNAPSHOT in apache-snapshots (http://repository.apache.org/snapshots/)
	at org.sonatype.aether.impl.internal.DefaultArtifactResolver.resolve(DefaultArtifactResolver.java:538)
	at org.sonatype.aether.impl.internal.DefaultArtifactResolver.resolveArtifacts(DefaultArtifactResolver.java:216)
	at org.sonatype.aether.impl.internal.DefaultRepositorySystem.resolveDependencies(DefaultRepositorySystem.java:358)
	... 35 more
Caused by: org.sonatype.aether.transfer.ArtifactNotFoundException: Could not find artifact
org.codehaus.plexus:plexus-java:jar:0.9.4-SNAPSHOT in apache-snapshots (http://repository.apache.org/snapshots/)
	at org.sonatype.aether.connector.wagon.WagonRepositoryConnector$4.wrap(WagonRepositoryConnector.java:947)
	at org.sonatype.aether.connector.wagon.WagonRepositoryConnector$4.wrap(WagonRepositoryConnector.java:941)
	at org.sonatype.aether.connector.wagon.WagonRepositoryConnector$GetTask.run(WagonRepositoryConnector.java:669)
	at org.sonatype.aether.util.concurrency.RunnableErrorForwarder$1.run(RunnableErrorForwarder.java:60)
	... 3 more
[ERROR] Failed to execute goal org.apache.maven.plugins:maven-enforcer-plugin:3.0.0-M1:enforce
(ban-known-bad-maven-versions) on project maven-jmod-plugin: Execution ban-known-bad-maven-versions
of goal org.apache.maven.plugins:maven-enforcer-plugin:3.0.0-M1:enforce failed. NullPointerException
-> [Help 2]
org.apache.maven.lifecycle.LifecycleExecutionException: Failed to execute goal org.apache.maven.plugins:maven-enforcer-plugin:3.0.0-M1:enforce
(ban-known-bad-maven-versions) on project maven-jmod-plugin: Execution ban-known-bad-maven-versions
of goal org.apache.maven.plugins:maven-enforcer-plugin:3.0.0-M1:enforce failed.
	at org.apache.maven.lifecycle.internal.MojoExecutor.execute(MojoExecutor.java:225)
	at org.apache.maven.lifecycle.internal.MojoExecutor.execute(MojoExecutor.java:153)
	at org.apache.maven.lifecycle.internal.MojoExecutor.execute(MojoExecutor.java:145)
	at org.apache.maven.lifecycle.internal.LifecycleModuleBuilder.buildProject(LifecycleModuleBuilder.java:84)
	at org.apache.maven.lifecycle.internal.LifecycleModuleBuilder.buildProject(LifecycleModuleBuilder.java:59)
	at org.apache.maven.lifecycle.internal.LifecycleStarter.singleThreadedBuild(LifecycleStarter.java:183)
	at org.apache.maven.lifecycle.internal.LifecycleStarter.execute(LifecycleStarter.java:161)
	at org.apache.maven.DefaultMaven.doExecute(DefaultMaven.java:320)
	at org.apache.maven.DefaultMaven.execute(DefaultMaven.java:156)
	at org.jvnet.hudson.maven3.launcher.Maven3Launcher.main(Maven3Launcher.java:117)
	at sun.reflect.NativeMethodAccessorImpl.invoke0(Native Method)
	at sun.reflect.NativeMethodAccessorImpl.invoke(Unknown Source)
	at sun.reflect.DelegatingMethodAccessorImpl.invoke(Unknown Source)
	at java.lang.reflect.Method.invoke(Unknown Source)
	at org.codehaus.plexus.classworlds.launcher.Launcher.launchStandard(Launcher.java:329)
	at org.codehaus.plexus.classworlds.launcher.Launcher.launch(Launcher.java:239)
	at org.jvnet.hudson.maven3.agent.Maven3Main.launch(Maven3Main.java:181)
	at sun.reflect.NativeMethodAccessorImpl.invoke0(Native Method)
	at sun.reflect.NativeMethodAccessorImpl.invoke(Unknown Source)
	at sun.reflect.DelegatingMethodAccessorImpl.invoke(Unknown Source)
	at java.lang.reflect.Method.invoke(Unknown Source)
	at hudson.maven.Maven3Builder.call(Maven3Builder.java:139)
	at hudson.maven.Maven3Builder.call(Maven3Builder.java:70)
	at hudson.remoting.UserRequest.perform(UserRequest.java:153)
	at hudson.remoting.UserRequest.perform(UserRequest.java:50)
	at hudson.remoting.Request$2.run(Request.java:336)
	at hudson.remoting.InterceptingExecutorService$1.call(InterceptingExecutorService.java:68)
	at java.util.concurrent.FutureTask.run(Unknown Source)
	at java.util.concurrent.ThreadPoolExecutor.runWorker(Unknown Source)
	at java.util.concurrent.ThreadPoolExecutor$Worker.run(Unknown Source)
	at java.lang.Thread.run(Unknown Source)
Caused by: org.apache.maven.plugin.PluginExecutionException: Execution ban-known-bad-maven-versions
of goal org.apache.maven.plugins:maven-enforcer-plugin:3.0.0-M1:enforce failed.
	at org.apache.maven.plugin.DefaultBuildPluginManager.executeMojo(DefaultBuildPluginManager.java:110)
	at org.apache.maven.lifecycle.internal.MojoExecutor.execute(MojoExecutor.java:209)
	... 30 more
Caused by: java.lang.NullPointerException
	at org.apache.maven.artifact.versioning.ComparableVersion.parseVersion(ComparableVersion.java:354)
	at org.apache.maven.artifact.versioning.ComparableVersion.<init>(ComparableVersion.java:345)
	at org.apache.maven.artifact.versioning.DefaultArtifactVersion.parseVersion(DefaultArtifactVersion.java:110)
	at org.apache.maven.artifact.versioning.DefaultArtifactVersion.<init>(DefaultArtifactVersion.java:46)
	at org.apache.maven.plugins.enforcer.RequireMavenVersion.execute(RequireMavenVersion.java:46)
	at org.apache.maven.plugins.enforcer.EnforceMojo.execute(EnforceMojo.java:202)
	at org.apache.maven.plugin.DefaultBuildPluginManager.executeMojo(DefaultBuildPluginManager.java:101)
	... 31 more
[ERROR] Failed to execute goal org.codehaus.mojo:keytool-maven-plugin:1.0:genkey (init) on
project maven-project-info-reports-plugin: Result of cmd.exe /X /C '""C:\Program Files\Java\jre1.8.0_121\..\bin\keytool.exe"
-genkey -dname "cn=jetty, ou=jetty, L=Unknown, ST=Unknown, o=Apache, c=Unknown" -alias apache
-keypass apache -keystore F:\jenkins\jenkins-slave\workspace\maven-plugins-windows\maven-project-info-reports-plugin/target/jetty.jks
-storepass apache -validity 365 -keyalg RSA"' execution is: '1': The system cannot find the
path specified.. -> [Help 3]
org.apache.maven.lifecycle.LifecycleExecutionException: Failed to execute goal org.codehaus.mojo:keytool-maven-plugin:1.0:genkey
(init) on project maven-project-info-reports-plugin: Result of cmd.exe /X /C '""C:\Program
Files\Java\jre1.8.0_121\..\bin\keytool.exe" -genkey -dname "cn=jetty, ou=jetty, L=Unknown,
ST=Unknown, o=Apache, c=Unknown" -alias apache -keypass apache -keystore F:\jenkins\jenkins-slave\workspace\maven-plugins-windows\maven-project-info-reports-plugin/target/jetty.jks
-storepass apache -validity 365 -keyalg RSA"' execution is: '1': The system cannot find the
path specified..
	at org.apache.maven.lifecycle.internal.MojoExecutor.execute(MojoExecutor.java:217)
	at org.apache.maven.lifecycle.internal.MojoExecutor.execute(MojoExecutor.java:153)
	at org.apache.maven.lifecycle.internal.MojoExecutor.execute(MojoExecutor.java:145)
	at org.apache.maven.lifecycle.internal.LifecycleModuleBuilder.buildProject(LifecycleModuleBuilder.java:84)
	at org.apache.maven.lifecycle.internal.LifecycleModuleBuilder.buildProject(LifecycleModuleBuilder.java:59)
	at org.apache.maven.lifecycle.internal.LifecycleStarter.singleThreadedBuild(LifecycleStarter.java:183)
	at org.apache.maven.lifecycle.internal.LifecycleStarter.execute(LifecycleStarter.java:161)
	at org.apache.maven.DefaultMaven.doExecute(DefaultMaven.java:320)
	at org.apache.maven.DefaultMaven.execute(DefaultMaven.java:156)
	at org.jvnet.hudson.maven3.launcher.Maven3Launcher.main(Maven3Launcher.java:117)
	at sun.reflect.NativeMethodAccessorImpl.invoke0(Native Method)
	at sun.reflect.NativeMethodAccessorImpl.invoke(Unknown Source)
	at sun.reflect.DelegatingMethodAccessorImpl.invoke(Unknown Source)
	at java.lang.reflect.Method.invoke(Unknown Source)
	at org.codehaus.plexus.classworlds.launcher.Launcher.launchStandard(Launcher.java:329)
	at org.codehaus.plexus.classworlds.launcher.Launcher.launch(Launcher.java:239)
	at org.jvnet.hudson.maven3.agent.Maven3Main.launch(Maven3Main.java:181)
	at sun.reflect.NativeMethodAccessorImpl.invoke0(Native Method)
	at sun.reflect.NativeMethodAccessorImpl.invoke(Unknown Source)
	at sun.reflect.DelegatingMethodAccessorImpl.invoke(Unknown Source)
	at java.lang.reflect.Method.invoke(Unknown Source)
	at hudson.maven.Maven3Builder.call(Maven3Builder.java:139)
	at hudson.maven.Maven3Builder.call(Maven3Builder.java:70)
	at hudson.remoting.UserRequest.perform(UserRequest.java:153)
	at hudson.remoting.UserRequest.perform(UserRequest.java:50)
	at hudson.remoting.Request$2.run(Request.java:336)
	at hudson.remoting.InterceptingExecutorService$1.call(InterceptingExecutorService.java:68)
	at java.util.concurrent.FutureTask.run(Unknown Source)
	at java.util.concurrent.ThreadPoolExecutor.runWorker(Unknown Source)
	at java.util.concurrent.ThreadPoolExecutor$Worker.run(Unknown Source)
	at java.lang.Thread.run(Unknown Source)
Caused by: org.apache.maven.plugin.MojoExecutionException: Result of cmd.exe /X /C '""C:\Program
Files\Java\jre1.8.0_121\..\bin\keytool.exe" -genkey -dname "cn=jetty, ou=jetty, L=Unknown,
ST=Unknown, o=Apache, c=Unknown" -alias apache -keypass apache -keystore F:\jenkins\jenkins-slave\workspace\maven-plugins-windows\maven-project-info-reports-plugin/target/jetty.jks
-storepass apache -validity 365 -keyalg RSA"' execution is: '1': The system cannot find the
path specified..
	at org.codehaus.mojo.keytool.GenkeyMojo.execute(GenkeyMojo.java:207)
	at org.apache.maven.plugin.DefaultBuildPluginManager.executeMojo(DefaultBuildPluginManager.java:101)
	at org.apache.maven.lifecycle.internal.MojoExecutor.execute(MojoExecutor.java:209)
	... 30 more
[ERROR] 
[ERROR] Re-run Maven using the -X switch to enable full debug logging.
[ERROR] 
[ERROR] For more information about the errors and possible solutions, please read the following
articles:
[ERROR] [Help 1] http://cwiki.apache.org/confluence/display/MAVEN/DependencyResolutionException
[ERROR] [Help 2] http://cwiki.apache.org/confluence/display/MAVEN/PluginExecutionException
[ERROR] [Help 3] http://cwiki.apache.org/confluence/display/MAVEN/MojoExecutionException
[ERROR] 
[ERROR] After correcting the problems, you can resume the build with the command
[ERROR]   mvn <goals> -rf :maven-jlink-plugin
[JENKINS] Archiving F:\jenkins\jenkins-slave\workspace\maven-plugins-windows\maven-antrun-plugin\pom.xml
to org.apache.maven.plugins/maven-antrun-plugin/3.0.0-SNAPSHOT/maven-antrun-plugin-3.0.0-SNAPSHOT.pom
[JENKINS] Archiving F:\jenkins\jenkins-slave\workspace\maven-plugins-windows\maven-antrun-plugin\target\maven-antrun-plugin-3.0.0-SNAPSHOT.jar
to org.apache.maven.plugins/maven-antrun-plugin/3.0.0-SNAPSHOT/maven-antrun-plugin-3.0.0-SNAPSHOT.jar
[JENKINS] Archiving F:\jenkins\jenkins-slave\workspace\maven-plugins-windows\maven-linkcheck-plugin\pom.xml
to org.apache.maven.plugins/maven-linkcheck-plugin/1.3-SNAPSHOT/maven-linkcheck-plugin-1.3-SNAPSHOT.pom
[JENKINS] Archiving F:\jenkins\jenkins-slave\workspace\maven-plugins-windows\maven-linkcheck-plugin\target\maven-linkcheck-plugin-1.3-SNAPSHOT.jar
to org.apache.maven.plugins/maven-linkcheck-plugin/1.3-SNAPSHOT/maven-linkcheck-plugin-1.3-SNAPSHOT.jar
[JENKINS] Archiving F:\jenkins\jenkins-slave\workspace\maven-plugins-windows\maven-scm-publish-plugin\pom.xml
to org.apache.maven.plugins/maven-scm-publish-plugin/1.2-SNAPSHOT/maven-scm-publish-plugin-1.2-SNAPSHOT.pom
[JENKINS] Archiving F:\jenkins\jenkins-slave\workspace\maven-plugins-windows\maven-scm-publish-plugin\target\maven-scm-publish-plugin-1.2-SNAPSHOT.jar
to org.apache.maven.plugins/maven-scm-publish-plugin/1.2-SNAPSHOT/maven-scm-publish-plugin-1.2-SNAPSHOT.jar
[JENKINS] Archiving F:\jenkins\jenkins-slave\workspace\maven-plugins-windows\maven-acr-plugin\pom.xml
to org.apache.maven.plugins/maven-acr-plugin/3.0.1-SNAPSHOT/maven-acr-plugin-3.0.1-SNAPSHOT.pom
[JENKINS] Archiving F:\jenkins\jenkins-slave\workspace\maven-plugins-windows\maven-acr-plugin\target\maven-acr-plugin-3.0.1-SNAPSHOT.jar
to org.apache.maven.plugins/maven-acr-plugin/3.0.1-SNAPSHOT/maven-acr-plugin-3.0.1-SNAPSHOT.jar
[JENKINS] Archiving F:\jenkins\jenkins-slave\workspace\maven-plugins-windows\maven-install-plugin\pom.xml
to org.apache.maven.plugins/maven-install-plugin/3.0.0-SNAPSHOT/maven-install-plugin-3.0.0-SNAPSHOT.pom
[JENKINS] Archiving F:\jenkins\jenkins-slave\workspace\maven-plugins-windows\maven-install-plugin\target\maven-install-plugin-3.0.0-SNAPSHOT.jar
to org.apache.maven.plugins/maven-install-plugin/3.0.0-SNAPSHOT/maven-install-plugin-3.0.0-SNAPSHOT.jar
[JENKINS] Archiving F:\jenkins\jenkins-slave\workspace\maven-plugins-windows\maven-assembly-plugin\pom.xml
to org.apache.maven.plugins/maven-assembly-plugin/3.1.1-SNAPSHOT/maven-assembly-plugin-3.1.1-SNAPSHOT.pom
[JENKINS] Archiving F:\jenkins\jenkins-slave\workspace\maven-plugins-windows\maven-assembly-plugin\target\maven-assembly-plugin-3.1.1-SNAPSHOT.jar
to org.apache.maven.plugins/maven-assembly-plugin/3.1.1-SNAPSHOT/maven-assembly-plugin-3.1.1-SNAPSHOT.jar
[JENKINS] Archiving F:\jenkins\jenkins-slave\workspace\maven-plugins-windows\maven-docck-plugin\pom.xml
to org.apache.maven.plugins/maven-docck-plugin/1.2-SNAPSHOT/maven-docck-plugin-1.2-SNAPSHOT.pom
[JENKINS] Archiving F:\jenkins\jenkins-slave\workspace\maven-plugins-windows\maven-docck-plugin\target\maven-docck-plugin-1.2-SNAPSHOT.jar
to org.apache.maven.plugins/maven-docck-plugin/1.2-SNAPSHOT/maven-docck-plugin-1.2-SNAPSHOT.jar
[JENKINS] Archiving <https://builds.apache.org/job/maven-plugins-windows/ws/pom.xml>
to org.apache.maven.plugins/maven-plugins-aggregator/1-SNAPSHOT/maven-plugins-aggregator-1-SNAPSHOT.pom
[JENKINS] Archiving F:\jenkins\jenkins-slave\workspace\maven-plugins-windows\maven-clean-plugin\pom.xml
to org.apache.maven.plugins/maven-clean-plugin/3.0.1-SNAPSHOT/maven-clean-plugin-3.0.1-SNAPSHOT.pom
[JENKINS] Archiving F:\jenkins\jenkins-slave\workspace\maven-plugins-windows\maven-clean-plugin\target\maven-clean-plugin-3.0.1-SNAPSHOT.jar
to org.apache.maven.plugins/maven-clean-plugin/3.0.1-SNAPSHOT/maven-clean-plugin-3.0.1-SNAPSHOT.jar
[JENKINS] Archiving F:\jenkins\jenkins-slave\workspace\maven-plugins-windows\maven-resources-plugin\pom.xml
to org.apache.maven.plugins/maven-resources-plugin/3.0.3-SNAPSHOT/maven-resources-plugin-3.0.3-SNAPSHOT.pom
[JENKINS] Archiving F:\jenkins\jenkins-slave\workspace\maven-plugins-windows\maven-resources-plugin\target\maven-resources-plugin-3.0.3-SNAPSHOT.jar
to org.apache.maven.plugins/maven-resources-plugin/3.0.3-SNAPSHOT/maven-resources-plugin-3.0.3-SNAPSHOT.jar
[JENKINS] Archiving F:\jenkins\jenkins-slave\workspace\maven-plugins-windows\maven-pmd-plugin\pom.xml
to org.apache.maven.plugins/maven-pmd-plugin/3.9.0-SNAPSHOT/maven-pmd-plugin-3.9.0-SNAPSHOT.pom
[JENKINS] Archiving F:\jenkins\jenkins-slave\workspace\maven-plugins-windows\maven-pmd-plugin\target\maven-pmd-plugin-3.9.0-SNAPSHOT.jar
to org.apache.maven.plugins/maven-pmd-plugin/3.9.0-SNAPSHOT/maven-pmd-plugin-3.9.0-SNAPSHOT.jar
[JENKINS] Archiving F:\jenkins\jenkins-slave\workspace\maven-plugins-windows\maven-shade-plugin\pom.xml
to org.apache.maven.plugins/maven-shade-plugin/3.1.1-SNAPSHOT/maven-shade-plugin-3.1.1-SNAPSHOT.pom
[JENKINS] Archiving F:\jenkins\jenkins-slave\workspace\maven-plugins-windows\maven-shade-plugin\target\maven-shade-plugin-3.1.1-SNAPSHOT.jar
to org.apache.maven.plugins/maven-shade-plugin/3.1.1-SNAPSHOT/maven-shade-plugin-3.1.1-SNAPSHOT.jar
[JENKINS] Archiving F:\jenkins\jenkins-slave\workspace\maven-plugins-windows\maven-toolchains-plugin\pom.xml
to org.apache.maven.plugins/maven-toolchains-plugin/3.0.0-SNAPSHOT/maven-toolchains-plugin-3.0.0-SNAPSHOT.pom
[JENKINS] Archiving F:\jenkins\jenkins-slave\workspace\maven-plugins-windows\maven-toolchains-plugin\target\maven-toolchains-plugin-3.0.0-SNAPSHOT.jar
to org.apache.maven.plugins/maven-toolchains-plugin/3.0.0-SNAPSHOT/maven-toolchains-plugin-3.0.0-SNAPSHOT.jar
[JENKINS] Archiving F:\jenkins\jenkins-slave\workspace\maven-plugins-windows\maven-remote-resources-plugin\pom.xml
to org.apache.maven.plugins/maven-remote-resources-plugin/1.6-SNAPSHOT/maven-remote-resources-plugin-1.6-SNAPSHOT.pom
[JENKINS] Archiving F:\jenkins\jenkins-slave\workspace\maven-plugins-windows\maven-remote-resources-plugin\target\maven-remote-resources-plugin-1.6-SNAPSHOT.jar
to org.apache.maven.plugins/maven-remote-resources-plugin/1.6-SNAPSHOT/maven-remote-resources-plugin-1.6-SNAPSHOT.jar
[JENKINS] Archiving F:\jenkins\jenkins-slave\workspace\maven-plugins-windows\maven-project-info-reports-plugin\pom.xml
to org.apache.maven.plugins/maven-project-info-reports-plugin/2.10-SNAPSHOT/maven-project-info-reports-plugin-2.10-SNAPSHOT.pom
[JENKINS] Archiving F:\jenkins\jenkins-slave\workspace\maven-plugins-windows\maven-patch-plugin\pom.xml
to org.apache.maven.plugins/maven-patch-plugin/1.3-SNAPSHOT/maven-patch-plugin-1.3-SNAPSHOT.pom
[JENKINS] Archiving F:\jenkins\jenkins-slave\workspace\maven-plugins-windows\maven-patch-plugin\target\maven-patch-plugin-1.3-SNAPSHOT.jar
to org.apache.maven.plugins/maven-patch-plugin/1.3-SNAPSHOT/maven-patch-plugin-1.3-SNAPSHOT.jar
[JENKINS] Archiving F:\jenkins\jenkins-slave\workspace\maven-plugins-windows\maven-compiler-plugin\pom.xml
to org.apache.maven.plugins/maven-compiler-plugin/3.7.1-SNAPSHOT/maven-compiler-plugin-3.7.1-SNAPSHOT.pom
[JENKINS] Archiving F:\jenkins\jenkins-slave\workspace\maven-plugins-windows\maven-compiler-plugin\target\maven-compiler-plugin-3.7.1-SNAPSHOT.jar
to org.apache.maven.plugins/maven-compiler-plugin/3.7.1-SNAPSHOT/maven-compiler-plugin-3.7.1-SNAPSHOT.jar
[JENKINS] Archiving F:\jenkins\jenkins-slave\workspace\maven-plugins-windows\maven-stage-plugin\pom.xml
to org.apache.maven.plugins/maven-stage-plugin/1.1-SNAPSHOT/maven-stage-plugin-1.1-SNAPSHOT.pom
[JENKINS] Archiving F:\jenkins\jenkins-slave\workspace\maven-plugins-windows\maven-stage-plugin\target\maven-stage-plugin-1.1-SNAPSHOT.jar
to org.apache.maven.plugins/maven-stage-plugin/1.1-SNAPSHOT/maven-stage-plugin-1.1-SNAPSHOT.jar
[JENKINS] Archiving F:\jenkins\jenkins-slave\workspace\maven-plugins-windows\maven-verifier-plugin\pom.xml
to org.apache.maven.plugins/maven-verifier-plugin/3.0.0-SNAPSHOT/maven-verifier-plugin-3.0.0-SNAPSHOT.pom
[JENKINS] Archiving F:\jenkins\jenkins-slave\workspace\maven-plugins-windows\maven-verifier-plugin\target\maven-verifier-plugin-3.0.0-SNAPSHOT.jar
to org.apache.maven.plugins/maven-verifier-plugin/3.0.0-SNAPSHOT/maven-verifier-plugin-3.0.0-SNAPSHOT.jar
[JENKINS] Archiving F:\jenkins\jenkins-slave\workspace\maven-plugins-windows\maven-jmod-plugin\pom.xml
to org.apache.maven.plugins/maven-jmod-plugin/3.0.0-alpha-2-SNAPSHOT/maven-jmod-plugin-3.0.0-alpha-2-SNAPSHOT.pom
[JENKINS] Archiving F:\jenkins\jenkins-slave\workspace\maven-plugins-windows\maven-jarsigner-plugin\pom.xml
to org.apache.maven.plugins/maven-jarsigner-plugin/1.5-SNAPSHOT/maven-jarsigner-plugin-1.5-SNAPSHOT.pom
[JENKINS] Archiving F:\jenkins\jenkins-slave\workspace\maven-plugins-windows\maven-jarsigner-plugin\target\maven-jarsigner-plugin-1.5-SNAPSHOT.jar
to org.apache.maven.plugins/maven-jarsigner-plugin/1.5-SNAPSHOT/maven-jarsigner-plugin-1.5-SNAPSHOT.jar
[JENKINS] Archiving F:\jenkins\jenkins-slave\workspace\maven-plugins-windows\maven-ejb-plugin\pom.xml
to org.apache.maven.plugins/maven-ejb-plugin/3.0.1-SNAPSHOT/maven-ejb-plugin-3.0.1-SNAPSHOT.pom
[JENKINS] Archiving F:\jenkins\jenkins-slave\workspace\maven-plugins-windows\maven-ejb-plugin\target\maven-ejb-plugin-3.0.1-SNAPSHOT.jar
to org.apache.maven.plugins/maven-ejb-plugin/3.0.1-SNAPSHOT/maven-ejb-plugin-3.0.1-SNAPSHOT.jar
[JENKINS] Archiving F:\jenkins\jenkins-slave\workspace\maven-plugins-windows\maven-jlink-plugin\pom.xml
to org.apache.maven.plugins/maven-jlink-plugin/3.0.0-alpha-2-SNAPSHOT/maven-jlink-plugin-3.0.0-alpha-2-SNAPSHOT.pom
[Fast Archiver] No prior successful build to compare, so performing full copy of artifacts
[JENKINS] Archiving F:\jenkins\jenkins-slave\workspace\maven-plugins-windows\maven-changelog-plugin\pom.xml
to org.apache.maven.plugins/maven-changelog-plugin/2.4-SNAPSHOT/maven-changelog-plugin-2.4-SNAPSHOT.pom
[JENKINS] Archiving F:\jenkins\jenkins-slave\workspace\maven-plugins-windows\maven-changelog-plugin\target\maven-changelog-plugin-2.4-SNAPSHOT.jar
to org.apache.maven.plugins/maven-changelog-plugin/2.4-SNAPSHOT/maven-changelog-plugin-2.4-SNAPSHOT.jar
[JENKINS] Archiving F:\jenkins\jenkins-slave\workspace\maven-plugins-windows\maven-help-plugin\pom.xml
to org.apache.maven.plugins/maven-help-plugin/3.0.0-SNAPSHOT/maven-help-plugin-3.0.0-SNAPSHOT.pom
[JENKINS] Archiving F:\jenkins\jenkins-slave\workspace\maven-plugins-windows\maven-help-plugin\target\maven-help-plugin-3.0.0-SNAPSHOT.jar
to org.apache.maven.plugins/maven-help-plugin/3.0.0-SNAPSHOT/maven-help-plugin-3.0.0-SNAPSHOT.jar
[JENKINS] Archiving F:\jenkins\jenkins-slave\workspace\maven-plugins-windows\maven-war-plugin\pom.xml
to org.apache.maven.plugins/maven-war-plugin/3.2.1-SNAPSHOT/maven-war-plugin-3.2.1-SNAPSHOT.pom
[JENKINS] Archiving F:\jenkins\jenkins-slave\workspace\maven-plugins-windows\maven-war-plugin\target\maven-war-plugin-3.2.1-SNAPSHOT.jar
to org.apache.maven.plugins/maven-war-plugin/3.2.1-SNAPSHOT/maven-war-plugin-3.2.1-SNAPSHOT.jar
[JENKINS] Archiving F:\jenkins\jenkins-slave\workspace\maven-plugins-windows\maven-ear-plugin\pom.xml
to org.apache.maven.plugins/maven-ear-plugin/3.0.0-SNAPSHOT/maven-ear-plugin-3.0.0-SNAPSHOT.pom
[JENKINS] Archiving F:\jenkins\jenkins-slave\workspace\maven-plugins-windows\maven-ear-plugin\target\maven-ear-plugin-3.0.0-SNAPSHOT.jar
to org.apache.maven.plugins/maven-ear-plugin/3.0.0-SNAPSHOT/maven-ear-plugin-3.0.0-SNAPSHOT.jar
[JENKINS] Archiving F:\jenkins\jenkins-slave\workspace\maven-plugins-windows\maven-invoker-plugin\pom.xml
to org.apache.maven.plugins/maven-invoker-plugin/3.0.2-SNAPSHOT/maven-invoker-plugin-3.0.2-SNAPSHOT.pom
[JENKINS] Archiving F:\jenkins\jenkins-slave\workspace\maven-plugins-windows\maven-invoker-plugin\target\maven-invoker-plugin-3.0.2-SNAPSHOT.jar
to org.apache.maven.plugins/maven-invoker-plugin/3.0.2-SNAPSHOT/maven-invoker-plugin-3.0.2-SNAPSHOT.jar
[JENKINS] Archiving F:\jenkins\jenkins-slave\workspace\maven-plugins-windows\maven-jdeps-plugin\pom.xml
to org.apache.maven.plugins/maven-jdeps-plugin/3.1.1-SNAPSHOT/maven-jdeps-plugin-3.1.1-SNAPSHOT.pom
[JENKINS] Archiving F:\jenkins\jenkins-slave\workspace\maven-plugins-windows\maven-jdeps-plugin\target\maven-jdeps-plugin-3.1.1-SNAPSHOT.jar
to org.apache.maven.plugins/maven-jdeps-plugin/3.1.1-SNAPSHOT/maven-jdeps-plugin-3.1.1-SNAPSHOT.jar
[JENKINS] Archiving F:\jenkins\jenkins-slave\workspace\maven-plugins-windows\maven-doap-plugin\pom.xml
to org.apache.maven.plugins/maven-doap-plugin/1.3-SNAPSHOT/maven-doap-plugin-1.3-SNAPSHOT.pom
[JENKINS] Archiving F:\jenkins\jenkins-slave\workspace\maven-plugins-windows\maven-doap-plugin\target\maven-doap-plugin-1.3-SNAPSHOT.jar
to org.apache.maven.plugins/maven-doap-plugin/1.3-SNAPSHOT/maven-doap-plugin-1.3-SNAPSHOT.jar
[JENKINS] Archiving F:\jenkins\jenkins-slave\workspace\maven-plugins-windows\maven-site-plugin\dependency-reduced-pom.xml
to org.apache.maven.plugins/maven-site-plugin/3.7-SNAPSHOT/maven-site-plugin-3.7-SNAPSHOT.pom
[JENKINS] Archiving F:\jenkins\jenkins-slave\workspace\maven-plugins-windows\maven-site-plugin\target\maven-site-plugin-3.7-SNAPSHOT.jar
to org.apache.maven.plugins/maven-site-plugin/3.7-SNAPSHOT/maven-site-plugin-3.7-SNAPSHOT.jar
[JENKINS] Archiving F:\jenkins\jenkins-slave\workspace\maven-plugins-windows\maven-changes-plugin\pom.xml
to org.apache.maven.plugins/maven-changes-plugin/3.0.0-SNAPSHOT/maven-changes-plugin-3.0.0-SNAPSHOT.pom
[JENKINS] Archiving F:\jenkins\jenkins-slave\workspace\maven-plugins-windows\maven-changes-plugin\target\maven-changes-plugin-3.0.0-SNAPSHOT.jar
to org.apache.maven.plugins/maven-changes-plugin/3.0.0-SNAPSHOT/maven-changes-plugin-3.0.0-SNAPSHOT.jar
[JENKINS] Archiving F:\jenkins\jenkins-slave\workspace\maven-plugins-windows\maven-deploy-plugin\pom.xml
to org.apache.maven.plugins/maven-deploy-plugin/3.0.0-SNAPSHOT/maven-deploy-plugin-3.0.0-SNAPSHOT.pom
[JENKINS] Archiving F:\jenkins\jenkins-slave\workspace\maven-plugins-windows\maven-deploy-plugin\target\maven-deploy-plugin-3.0.0-SNAPSHOT.jar
to org.apache.maven.plugins/maven-deploy-plugin/3.0.0-SNAPSHOT/maven-deploy-plugin-3.0.0-SNAPSHOT.jar
[JENKINS] Archiving F:\jenkins\jenkins-slave\workspace\maven-plugins-windows\maven-repository-plugin\pom.xml
to org.apache.maven.plugins/maven-repository-plugin/2.5-SNAPSHOT/maven-repository-plugin-2.5-SNAPSHOT.pom
[JENKINS] Archiving F:\jenkins\jenkins-slave\workspace\maven-plugins-windows\maven-repository-plugin\target\maven-repository-plugin-2.5-SNAPSHOT.jar
to org.apache.maven.plugins/maven-repository-plugin/2.5-SNAPSHOT/maven-repository-plugin-2.5-SNAPSHOT.jar
[JENKINS] Archiving F:\jenkins\jenkins-slave\workspace\maven-plugins-windows\maven-source-plugin\pom.xml
to org.apache.maven.plugins/maven-source-plugin/3.0.2-SNAPSHOT/maven-source-plugin-3.0.2-SNAPSHOT.pom
[JENKINS] Archiving F:\jenkins\jenkins-slave\workspace\maven-plugins-windows\maven-source-plugin\target\maven-source-plugin-3.0.2-SNAPSHOT.jar
to org.apache.maven.plugins/maven-source-plugin/3.0.2-SNAPSHOT/maven-source-plugin-3.0.2-SNAPSHOT.jar
[JENKINS] Archiving F:\jenkins\jenkins-slave\workspace\maven-plugins-windows\maven-pdf-plugin\pom.xml
to org.apache.maven.plugins/maven-pdf-plugin/1.4-SNAPSHOT/maven-pdf-plugin-1.4-SNAPSHOT.pom
[JENKINS] Archiving F:\jenkins\jenkins-slave\workspace\maven-plugins-windows\maven-pdf-plugin\target\maven-pdf-plugin-1.4-SNAPSHOT.jar
to org.apache.maven.plugins/maven-pdf-plugin/1.4-SNAPSHOT/maven-pdf-plugin-1.4-SNAPSHOT.jar
[JENKINS] Archiving F:\jenkins\jenkins-slave\workspace\maven-plugins-windows\maven-jar-plugin\pom.xml
to org.apache.maven.plugins/maven-jar-plugin/3.0.3-SNAPSHOT/maven-jar-plugin-3.0.3-SNAPSHOT.pom
[JENKINS] Archiving F:\jenkins\jenkins-slave\workspace\maven-plugins-windows\maven-jar-plugin\target\maven-jar-plugin-3.0.3-SNAPSHOT.jar
to org.apache.maven.plugins/maven-jar-plugin/3.0.3-SNAPSHOT/maven-jar-plugin-3.0.3-SNAPSHOT.jar
[JENKINS] Archiving F:\jenkins\jenkins-slave\workspace\maven-plugins-windows\maven-javadoc-plugin\pom.xml
to org.apache.maven.plugins/maven-javadoc-plugin/3.0.0-SNAPSHOT/maven-javadoc-plugin-3.0.0-SNAPSHOT.pom
[JENKINS] Archiving F:\jenkins\jenkins-slave\workspace\maven-plugins-windows\maven-javadoc-plugin\target\maven-javadoc-plugin-3.0.0-SNAPSHOT.jar
to org.apache.maven.plugins/maven-javadoc-plugin/3.0.0-SNAPSHOT/maven-javadoc-plugin-3.0.0-SNAPSHOT.jar
[JENKINS] Archiving F:\jenkins\jenkins-slave\workspace\maven-plugins-windows\maven-dependency-plugin\pom.xml
to org.apache.maven.plugins/maven-dependency-plugin/3.0.3-SNAPSHOT/maven-dependency-plugin-3.0.3-SNAPSHOT.pom
[JENKINS] Archiving F:\jenkins\jenkins-slave\workspace\maven-plugins-windows\maven-dependency-plugin\target\maven-dependency-plugin-3.0.3-SNAPSHOT.jar
to org.apache.maven.plugins/maven-dependency-plugin/3.0.3-SNAPSHOT/maven-dependency-plugin-3.0.3-SNAPSHOT.jar
[JENKINS] Archiving F:\jenkins\jenkins-slave\workspace\maven-plugins-windows\maven-rar-plugin\pom.xml
to org.apache.maven.plugins/maven-rar-plugin/3.0.0-SNAPSHOT/maven-rar-plugin-3.0.0-SNAPSHOT.pom
[JENKINS] Archiving F:\jenkins\jenkins-slave\workspace\maven-plugins-windows\maven-rar-plugin\target\maven-rar-plugin-3.0.0-SNAPSHOT.jar
to org.apache.maven.plugins/maven-rar-plugin/3.0.0-SNAPSHOT/maven-rar-plugin-3.0.0-SNAPSHOT.jar
[JENKINS] Archiving F:\jenkins\jenkins-slave\workspace\maven-plugins-windows\maven-checkstyle-plugin\pom.xml
to org.apache.maven.plugins/maven-checkstyle-plugin/3.0.0-SNAPSHOT/maven-checkstyle-plugin-3.0.0-SNAPSHOT.pom
[JENKINS] Archiving F:\jenkins\jenkins-slave\workspace\maven-plugins-windows\maven-checkstyle-plugin\target\maven-checkstyle-plugin-3.0.0-SNAPSHOT.jar
to org.apache.maven.plugins/maven-checkstyle-plugin/3.0.0-SNAPSHOT/maven-checkstyle-plugin-3.0.0-SNAPSHOT.jar
Sending e-mails to: notifications@maven.apache.org
Sending e-mails to: notifications@maven.apache.org
Sending e-mails to: notifications@maven.apache.org khmarbaise@apache.org
Sending e-mails to: notifications@maven.apache.org
channel stopped
[WARNINGS] Skipping publisher since build result is FAILURE

Mime
View raw message