maven-notifications mailing list archives

Site index · List index
Message view « Date » · « Thread »
Top « Date » · « Thread »
From Apache Jenkins Server <jenk...@builds.apache.org>
Subject Build failed in Jenkins: dist-tool-plugin #1895
Date Mon, 04 Sep 2017 09:58:28 GMT
See <https://builds.apache.org/job/dist-tool-plugin/1895/display/redirect>

------------------------------------------
[...truncated 61.91 KB...]
[INFO] Downloading: https://repo.maven.apache.org/maven2/org/apache/maven/plugins/maven-acr-plugin/3.0.0/maven-acr-plugin-3.0.0.pom
[INFO] Downloaded: https://repo.maven.apache.org/maven2/org/apache/maven/plugins/maven-acr-plugin/3.0.0/maven-acr-plugin-3.0.0.pom
(5 KB at 368.8 KB/sec)
[INFO]   maven-ant-plugin
[INFO] Downloading: https://repo.maven.apache.org/maven2/org/apache/maven/plugins/maven-ant-plugin/2.4/maven-ant-plugin-2.4.pom
[INFO] Downloaded: https://repo.maven.apache.org/maven2/org/apache/maven/plugins/maven-ant-plugin/2.4/maven-ant-plugin-2.4.pom
(6 KB at 388.7 KB/sec)
[INFO]   maven-antrun-plugin
[INFO]   * maven-archetype-plugin
[INFO]   maven-assembly-plugin
[INFO]   maven-changelog-plugin
[INFO] Downloading: https://repo.maven.apache.org/maven2/org/apache/maven/plugins/maven-changelog-plugin/2.3/maven-changelog-plugin-2.3.pom
[INFO] Downloaded: https://repo.maven.apache.org/maven2/org/apache/maven/plugins/maven-changelog-plugin/2.3/maven-changelog-plugin-2.3.pom
(14 KB at 946.9 KB/sec)
[INFO]   maven-changes-plugin
[INFO] Downloading: https://repo.maven.apache.org/maven2/org/apache/maven/plugins/maven-changes-plugin/2.12.1/maven-changes-plugin-2.12.1.pom
[INFO] Downloaded: https://repo.maven.apache.org/maven2/org/apache/maven/plugins/maven-changes-plugin/2.12.1/maven-changes-plugin-2.12.1.pom
(18 KB at 620.5 KB/sec)
[INFO]   maven-checkstyle-plugin
[INFO]   maven-clean-plugin
[INFO]   maven-compiler-plugin
[INFO]   maven-dependency-plugin
[INFO]   maven-deploy-plugin
[INFO]   maven-doap-plugin
[INFO] Downloading: https://repo.maven.apache.org/maven2/org/apache/maven/plugins/maven-doap-plugin/1.2/maven-doap-plugin-1.2.pom
[INFO] Downloaded: https://repo.maven.apache.org/maven2/org/apache/maven/plugins/maven-doap-plugin/1.2/maven-doap-plugin-1.2.pom
(8 KB at 368.2 KB/sec)
[INFO]   maven-docck-plugin
[INFO]   maven-ear-plugin
[INFO] Downloading: https://repo.maven.apache.org/maven2/org/apache/maven/plugins/maven-ear-plugin/2.10.1/maven-ear-plugin-2.10.1.pom
[INFO] Downloaded: https://repo.maven.apache.org/maven2/org/apache/maven/plugins/maven-ear-plugin/2.10.1/maven-ear-plugin-2.10.1.pom
(10 KB at 183.9 KB/sec)
[INFO]   maven-ejb-plugin
[INFO] Downloading: https://repo.maven.apache.org/maven2/org/apache/maven/plugins/maven-ejb-plugin/3.0.0/maven-ejb-plugin-3.0.0.pom
[INFO] Downloaded: https://repo.maven.apache.org/maven2/org/apache/maven/plugins/maven-ejb-plugin/3.0.0/maven-ejb-plugin-3.0.0.pom
(7 KB at 200.4 KB/sec)
[INFO]   * maven-enforcer-plugin 
[INFO]   * maven-failsafe-plugin
[INFO]   maven-gpg-plugin
[INFO]   maven-help-plugin
[INFO]   maven-install-plugin
[INFO]   maven-invoker-plugin
[INFO] Downloading: https://repo.maven.apache.org/maven2/org/apache/maven/plugins/maven-invoker-plugin/3.0.1/maven-invoker-plugin-3.0.1.pom
[INFO] Downloaded: https://repo.maven.apache.org/maven2/org/apache/maven/plugins/maven-invoker-plugin/3.0.1/maven-invoker-plugin-3.0.1.pom
(14 KB at 532.0 KB/sec)
[INFO]   maven-jar-plugin
[INFO]   maven-jarsigner-plugin
[INFO]   maven-javadoc-plugin
[INFO] Downloading: https://repo.maven.apache.org/maven2/org/apache/maven/plugins/maven-javadoc-plugin/3.0.0-M1/maven-javadoc-plugin-3.0.0-M1.pom
[INFO] Downloaded: https://repo.maven.apache.org/maven2/org/apache/maven/plugins/maven-javadoc-plugin/3.0.0-M1/maven-javadoc-plugin-3.0.0-M1.pom
(16 KB at 508.4 KB/sec)
[INFO]   maven-jdeps-plugin
[INFO] Downloading: https://repo.maven.apache.org/maven2/org/apache/maven/plugins/maven-jdeps-plugin/3.1.0/maven-jdeps-plugin-3.1.0.pom
[INFO] Downloaded: https://repo.maven.apache.org/maven2/org/apache/maven/plugins/maven-jdeps-plugin/3.1.0/maven-jdeps-plugin-3.1.0.pom
(4 KB at 262.6 KB/sec)
[INFO]   * maven-jxr-plugin 
[INFO]   maven-linkcheck-plugin
[INFO] Downloading: https://repo.maven.apache.org/maven2/org/apache/maven/plugins/maven-linkcheck-plugin/1.2/maven-linkcheck-plugin-1.2.pom
[INFO] Downloaded: https://repo.maven.apache.org/maven2/org/apache/maven/plugins/maven-linkcheck-plugin/1.2/maven-linkcheck-plugin-1.2.pom
(8 KB at 567.5 KB/sec)
[INFO]   maven-patch-plugin
[INFO] Downloading: https://repo.maven.apache.org/maven2/org/apache/maven/plugins/maven-patch-plugin/1.2/maven-patch-plugin-1.2.pom
[INFO] Downloaded: https://repo.maven.apache.org/maven2/org/apache/maven/plugins/maven-patch-plugin/1.2/maven-patch-plugin-1.2.pom
(5 KB at 233.5 KB/sec)
[INFO]   maven-pdf-plugin
[INFO] Downloading: https://repo.maven.apache.org/maven2/org/apache/maven/plugins/maven-pdf-plugin/1.3/maven-pdf-plugin-1.3.pom
[INFO] Downloaded: https://repo.maven.apache.org/maven2/org/apache/maven/plugins/maven-pdf-plugin/1.3/maven-pdf-plugin-1.3.pom
(12 KB at 817.6 KB/sec)
[INFO]   * maven-plugin-plugin
[INFO]   maven-pmd-plugin
[INFO]   maven-project-info-reports-plugin
[INFO]   maven-rar-plugin
[INFO]   * maven-release-plugin  
[INFO]   maven-remote-resources-plugin
[INFO]   maven-repository-plugin
[INFO] Downloading: https://repo.maven.apache.org/maven2/org/apache/maven/plugins/maven-repository-plugin/2.4/maven-repository-plugin-2.4.pom
[INFO] Downloaded: https://repo.maven.apache.org/maven2/org/apache/maven/plugins/maven-repository-plugin/2.4/maven-repository-plugin-2.4.pom
(10 KB at 628.1 KB/sec)
[INFO]   maven-resources-plugin
[INFO]   * maven-scm-plugin
[INFO]   maven-scm-publish-plugin
[INFO]   maven-shade-plugin
[INFO] Downloading: https://repo.maven.apache.org/maven2/org/apache/maven/plugins/maven-shade-plugin/3.1.0/maven-shade-plugin-3.1.0.pom
[INFO] Downloaded: https://repo.maven.apache.org/maven2/org/apache/maven/plugins/maven-shade-plugin/3.1.0/maven-shade-plugin-3.1.0.pom
(10 KB at 711.2 KB/sec)
[INFO]   maven-site-plugin
[INFO]   maven-source-plugin
[INFO]   maven-stage-plugin
[INFO] Downloading: https://repo.maven.apache.org/maven2/org/apache/maven/plugins/maven-stage-plugin/1.0/maven-stage-plugin-1.0.pom
[INFO] Downloaded: https://repo.maven.apache.org/maven2/org/apache/maven/plugins/maven-stage-plugin/1.0/maven-stage-plugin-1.0.pom
(7 KB at 511.4 KB/sec)
[INFO]   * maven-surefire-plugin
[INFO]   * maven-surefire-report-plugin
[INFO]   maven-toolchains-plugin
[INFO]   maven-verifier-plugin
[INFO] Downloading: https://repo.maven.apache.org/maven2/org/apache/maven/plugins/maven-verifier-plugin/1.1/maven-verifier-plugin-1.1.pom
[INFO] Downloaded: https://repo.maven.apache.org/maven2/org/apache/maven/plugins/maven-verifier-plugin/1.1/maven-verifier-plugin-1.1.pom
(5 KB at 305.2 KB/sec)
[INFO]   maven-war-plugin
[INFO] /pom: org.apache http://maven.apache.org/pom/
[INFO] > apache index-path = /asf/
[INFO] > apache site = http://maven.apache.org/pom/asf/
[INFO]   apache
[INFO] /pom: org.apache.maven http://maven.apache.org/pom/
[INFO] > maven-parent index-path = /maven/
[INFO] > maven-parent site = http://maven.apache.org/pom/maven/
[INFO]   maven-parent
[INFO] /release: org.apache.maven.release
[INFO]   maven-release (,3) 
[INFO] /reporting: org.apache.maven.reporting http://maven.apache.org/shared/
[INFO]   maven-reporting-api
[INFO]   maven-reporting-exec
[INFO]   maven-reporting-impl
[INFO] Downloading: https://repo.maven.apache.org/maven2/org/apache/maven/reporting/maven-reporting-impl/3.0.0/maven-reporting-impl-3.0.0.pom
[INFO] Downloaded: https://repo.maven.apache.org/maven2/org/apache/maven/reporting/maven-reporting-impl/3.0.0/maven-reporting-impl-3.0.0.pom
(8 KB at 571.7 KB/sec)
[INFO] /resolver: org.apache.maven.resolver
[INFO]   maven-resolver
[INFO] Downloading: https://repo.maven.apache.org/maven2/org/apache/maven/resolver/maven-resolver/1.1.0/maven-resolver-1.1.0.pom
[INFO] Downloaded: https://repo.maven.apache.org/maven2/org/apache/maven/resolver/maven-resolver/1.1.0/maven-resolver-1.1.0.pom
(16 KB at 906.3 KB/sec)
[INFO] /resources: org.apache.apache.resources
[INFO] > apache-source-release-assembly-descriptor site = http://maven.apache.org/apache-resource-bundles/
[INFO]   apache-source-release-assembly-descriptor
[INFO] Downloading: https://repo.maven.apache.org/maven2/org/apache/apache/resources/apache-source-release-assembly-descriptor/1.0.6/apache-source-release-assembly-descriptor-1.0.6.pom
[INFO] Downloaded: https://repo.maven.apache.org/maven2/org/apache/apache/resources/apache-source-release-assembly-descriptor/1.0.6/apache-source-release-assembly-descriptor-1.0.6.pom
(8 KB at 371.1 KB/sec)
[INFO] Downloading: https://repo.maven.apache.org/maven2/org/apache/apache/resources/apache-resource-bundles/5/apache-resource-bundles-5.pom
[INFO] Downloaded: https://repo.maven.apache.org/maven2/org/apache/apache/resources/apache-resource-bundles/5/apache-resource-bundles-5.pom
(3 KB at 29.3 KB/sec)
[INFO] /resources: org.apache
[INFO] > apache-incubator-disclaimer-resource-bundle site = http://maven.apache.org/apache-resource-bundles/
[INFO]   apache-incubator-disclaimer-resource-bundle (,1.1]
[INFO] Downloading: https://repo.maven.apache.org/maven2/org/apache/apache-incubator-disclaimer-resource-bundle/1.1/apache-incubator-disclaimer-resource-bundle-1.1.pom
[WARNING] Checksum validation failed, expected da39a3ee5e6b4b0d3255bfef95601890afd80709 but
is 6e0b74ff3d2da9bfe1126608f7e937537e628a5f for https://repo.maven.apache.org/maven2/org/apache/apache-incubator-disclaimer-resource-bundle/1.1/apache-incubator-disclaimer-resource-bundle-1.1.pom
[WARNING] Could not validate integrity of download from https://repo.maven.apache.org/maven2/org/apache/apache-incubator-disclaimer-resource-bundle/1.1/apache-incubator-disclaimer-resource-bundle-1.1.pom:
Checksum validation failed, expected da39a3ee5e6b4b0d3255bfef95601890afd80709 but is 6e0b74ff3d2da9bfe1126608f7e937537e628a5f
[WARNING] Checksum validation failed, expected da39a3ee5e6b4b0d3255bfef95601890afd80709 but
is 6e0b74ff3d2da9bfe1126608f7e937537e628a5f for https://repo.maven.apache.org/maven2/org/apache/apache-incubator-disclaimer-resource-bundle/1.1/apache-incubator-disclaimer-resource-bundle-1.1.pom
[INFO] Downloaded: https://repo.maven.apache.org/maven2/org/apache/apache-incubator-disclaimer-resource-bundle/1.1/apache-incubator-disclaimer-resource-bundle-1.1.pom
(722 B at 1.9 KB/sec)
[INFO] Downloading: https://repo.maven.apache.org/maven2/org/apache/apache-resource-bundles/2/apache-resource-bundles-2.pom
[WARNING] Checksum validation failed, expected da39a3ee5e6b4b0d3255bfef95601890afd80709 but
is bfadc7db5b215805d531144732c80692de9780e1 for https://repo.maven.apache.org/maven2/org/apache/apache-resource-bundles/2/apache-resource-bundles-2.pom
[WARNING] Could not validate integrity of download from https://repo.maven.apache.org/maven2/org/apache/apache-resource-bundles/2/apache-resource-bundles-2.pom:
Checksum validation failed, expected da39a3ee5e6b4b0d3255bfef95601890afd80709 but is bfadc7db5b215805d531144732c80692de9780e1
[WARNING] Checksum validation failed, expected da39a3ee5e6b4b0d3255bfef95601890afd80709 but
is bfadc7db5b215805d531144732c80692de9780e1 for https://repo.maven.apache.org/maven2/org/apache/apache-resource-bundles/2/apache-resource-bundles-2.pom
[INFO] Downloaded: https://repo.maven.apache.org/maven2/org/apache/apache-resource-bundles/2/apache-resource-bundles-2.pom
(2 KB at 8.2 KB/sec)
[INFO] > apache-jar-resource-bundle site = http://maven.apache.org/apache-resource-bundles/
[INFO]   apache-jar-resource-bundle (,1.4]
[INFO] Downloading: https://repo.maven.apache.org/maven2/org/apache/apache-jar-resource-bundle/1.4/apache-jar-resource-bundle-1.4.pom
[INFO] Downloaded: https://repo.maven.apache.org/maven2/org/apache/apache-jar-resource-bundle/1.4/apache-jar-resource-bundle-1.4.pom
(2 KB at 6.4 KB/sec)
[INFO] > apache-license-header-resource-bundle site = http://maven.apache.org/apache-resource-bundles/
[INFO]   apache-license-header-resource-bundle (,1.1]
[INFO] Downloading: https://repo.maven.apache.org/maven2/org/apache/apache-license-header-resource-bundle/1.1/apache-license-header-resource-bundle-1.1.pom
[WARNING] Checksum validation failed, expected da39a3ee5e6b4b0d3255bfef95601890afd80709 but
is 923c05b225d7a5a8a614b5fca846b1776e18b98a for https://repo.maven.apache.org/maven2/org/apache/apache-license-header-resource-bundle/1.1/apache-license-header-resource-bundle-1.1.pom
[WARNING] Could not validate integrity of download from https://repo.maven.apache.org/maven2/org/apache/apache-license-header-resource-bundle/1.1/apache-license-header-resource-bundle-1.1.pom:
Checksum validation failed, expected da39a3ee5e6b4b0d3255bfef95601890afd80709 but is 923c05b225d7a5a8a614b5fca846b1776e18b98a
[WARNING] Checksum validation failed, expected da39a3ee5e6b4b0d3255bfef95601890afd80709 but
is 923c05b225d7a5a8a614b5fca846b1776e18b98a for https://repo.maven.apache.org/maven2/org/apache/apache-license-header-resource-bundle/1.1/apache-license-header-resource-bundle-1.1.pom
[INFO] Downloaded: https://repo.maven.apache.org/maven2/org/apache/apache-license-header-resource-bundle/1.1/apache-license-header-resource-bundle-1.1.pom
(694 B at 2.2 KB/sec)
[INFO] /scm: org.apache.maven.scm
[INFO]   maven-scm 
[INFO] Downloading: https://repo.maven.apache.org/maven2/org/apache/maven/scm/maven-scm/1.9.5/maven-scm-1.9.5.pom
[INFO] Downloaded: https://repo.maven.apache.org/maven2/org/apache/maven/scm/maven-scm/1.9.5/maven-scm-1.9.5.pom
(25 KB at 1749.9 KB/sec)
[INFO] /shared: org.apache.maven.shared http://maven.apache.org/shared/
[INFO]   file-management
[INFO]   maven-artifact-resolver
[INFO]   maven-common-artifact-filters
[INFO]   maven-dependency-analyzer
[INFO]   maven-dependency-tree
[INFO]   maven-filtering
[INFO]   maven-invoker
[INFO]   maven-jarsigner
[INFO]   maven-mapping
[INFO]   maven-repository-builder
[INFO]   maven-runtime
[INFO] Downloading: https://repo.maven.apache.org/maven2/org/apache/maven/shared/maven-runtime/1.0-alpha-3/maven-runtime-1.0-alpha-3.pom
[INFO] Downloaded: https://repo.maven.apache.org/maven2/org/apache/maven/shared/maven-runtime/1.0-alpha-3/maven-runtime-1.0-alpha-3.pom
(6 KB at 432.5 KB/sec)
[INFO]   maven-script-interpreter
[INFO] Downloading: https://repo.maven.apache.org/maven2/org/apache/maven/shared/maven-script-interpreter/1.2/maven-script-interpreter-1.2.pom
[INFO] Downloaded: https://repo.maven.apache.org/maven2/org/apache/maven/shared/maven-script-interpreter/1.2/maven-script-interpreter-1.2.pom
(4 KB at 278.9 KB/sec)
[INFO]   maven-shared-incremental
[INFO]   maven-shared-jar
[INFO]   maven-shared-resources
[INFO]   maven-shared-utils
[INFO]   maven-shared-io
[INFO]   maven-verifier
[INFO] Downloading: https://repo.maven.apache.org/maven2/org/apache/maven/shared/maven-verifier/1.6/maven-verifier-1.6.pom
[INFO] Downloaded: https://repo.maven.apache.org/maven2/org/apache/maven/shared/maven-verifier/1.6/maven-verifier-1.6.pom
(0 B at 0.0 KB/sec)
[INFO] /shared: org.apache.maven http://maven.apache.org/shared/
[INFO]   maven-archiver
[INFO] > maven-skins index-path = /skins/
[INFO] /skins: org.apache.maven.skins http://maven.apache.org/skins/
[INFO]   maven-default-skin
[INFO] Downloading: https://repo.maven.apache.org/maven2/org/apache/maven/skins/maven-default-skin/1.2/maven-default-skin-1.2.pom
[INFO] Downloaded: https://repo.maven.apache.org/maven2/org/apache/maven/skins/maven-default-skin/1.2/maven-default-skin-1.2.pom
(5 KB at 23.0 KB/sec)
[INFO] Downloading: https://repo.maven.apache.org/maven2/org/apache/maven/skins/maven-skins/10/maven-skins-10.pom
[INFO] Downloaded: https://repo.maven.apache.org/maven2/org/apache/maven/skins/maven-skins/10/maven-skins-10.pom
(4 KB at 16.0 KB/sec)
[INFO]   maven-fluido-skin
[INFO] Downloading: https://repo.maven.apache.org/maven2/org/apache/maven/skins/maven-fluido-skin/1.6/maven-fluido-skin-1.6.pom
[INFO] Downloaded: https://repo.maven.apache.org/maven2/org/apache/maven/skins/maven-fluido-skin/1.6/maven-fluido-skin-1.6.pom
(29 KB at 156.9 KB/sec)
[INFO] Downloading: https://repo.maven.apache.org/maven2/org/apache/maven/skins/maven-skins/30/maven-skins-30.pom
[INFO] Downloaded: https://repo.maven.apache.org/maven2/org/apache/maven/skins/maven-skins/30/maven-skins-30.pom
(3 KB at 177.1 KB/sec)
[INFO] /surefire: org.apache.maven.surefire
[INFO]   surefire
[INFO] /wagon: org.apache.maven.wagon
[INFO]   wagon
[INFO] Downloading: https://repo.maven.apache.org/maven2/org/apache/maven/wagon/wagon/3.0.0/wagon-3.0.0.pom
[INFO] Downloaded: https://repo.maven.apache.org/maven2/org/apache/maven/wagon/wagon/3.0.0/wagon-3.0.0.pom
(21 KB at 972.7 KB/sec)
[INFO] 
[JENKINS] Archiving site from <https://builds.apache.org/job/dist-tool-plugin/ws/target/site>
to /x1/jenkins/jenkins-home/jobs/dist-tool-plugin/site
[INFO] ------------------------------------------------------------------------
[INFO] BUILD FAILURE
[INFO] ------------------------------------------------------------------------
[INFO] Total time: 06:51 min
[INFO] Finished at: 2017-09-04T09:58:25+00:00
[INFO] Final Memory: 93M/903M
[INFO] ------------------------------------------------------------------------
[WARNING] The requested profile "apache.snapshots" could not be activated because it does
not exist.
Waiting for Jenkins to finish collecting data
[ERROR] Failed to execute goal org.apache.maven.plugins:maven-site-plugin:3.5.1:site (default-site)
on project dist-tool-plugin: Execution default-site of goal org.apache.maven.plugins:maven-site-plugin:3.5.1:site
failed. NullPointerException -> [Help 1]
org.apache.maven.lifecycle.LifecycleExecutionException: Failed to execute goal org.apache.maven.plugins:maven-site-plugin:3.5.1:site
(default-site) on project dist-tool-plugin: Execution default-site of goal org.apache.maven.plugins:maven-site-plugin:3.5.1:site
failed.
	at org.apache.maven.lifecycle.internal.MojoExecutor.execute(MojoExecutor.java:212)
	at org.apache.maven.lifecycle.internal.MojoExecutor.execute(MojoExecutor.java:153)
	at org.apache.maven.lifecycle.internal.MojoExecutor.execute(MojoExecutor.java:145)
	at org.apache.maven.lifecycle.internal.LifecycleModuleBuilder.buildProject(LifecycleModuleBuilder.java:116)
	at org.apache.maven.lifecycle.internal.LifecycleModuleBuilder.buildProject(LifecycleModuleBuilder.java:80)
	at org.apache.maven.lifecycle.internal.builder.singlethreaded.SingleThreadedBuilder.build(SingleThreadedBuilder.java:51)
	at org.apache.maven.lifecycle.internal.LifecycleStarter.execute(LifecycleStarter.java:128)
	at org.apache.maven.DefaultMaven.doExecute(DefaultMaven.java:307)
	at org.apache.maven.DefaultMaven.doExecute(DefaultMaven.java:193)
	at org.apache.maven.DefaultMaven.execute(DefaultMaven.java:106)
	at org.jvnet.hudson.maven3.launcher.Maven33Launcher.main(Maven33Launcher.java:129)
	at sun.reflect.NativeMethodAccessorImpl.invoke0(Native Method)
	at sun.reflect.NativeMethodAccessorImpl.invoke(NativeMethodAccessorImpl.java:62)
	at sun.reflect.DelegatingMethodAccessorImpl.invoke(DelegatingMethodAccessorImpl.java:43)
	at java.lang.reflect.Method.invoke(Method.java:498)
	at org.codehaus.plexus.classworlds.launcher.Launcher.launchStandard(Launcher.java:330)
	at org.codehaus.plexus.classworlds.launcher.Launcher.launch(Launcher.java:238)
	at jenkins.maven3.agent.Maven33Main.launch(Maven33Main.java:176)
	at sun.reflect.NativeMethodAccessorImpl.invoke0(Native Method)
	at sun.reflect.NativeMethodAccessorImpl.invoke(NativeMethodAccessorImpl.java:62)
	at sun.reflect.DelegatingMethodAccessorImpl.invoke(DelegatingMethodAccessorImpl.java:43)
	at java.lang.reflect.Method.invoke(Method.java:498)
	at hudson.maven.Maven3Builder.call(Maven3Builder.java:139)
	at hudson.maven.Maven3Builder.call(Maven3Builder.java:70)
	at hudson.remoting.UserRequest.perform(UserRequest.java:153)
	at hudson.remoting.UserRequest.perform(UserRequest.java:50)
	at hudson.remoting.Request$2.run(Request.java:336)
	at hudson.remoting.InterceptingExecutorService$1.call(InterceptingExecutorService.java:68)
	at java.util.concurrent.FutureTask.run(FutureTask.java:266)
	at java.util.concurrent.ThreadPoolExecutor.runWorker(ThreadPoolExecutor.java:1149)
	at java.util.concurrent.ThreadPoolExecutor$Worker.run(ThreadPoolExecutor.java:624)
	at java.lang.Thread.run(Thread.java:748)
Caused by: org.apache.maven.plugin.PluginExecutionException: Execution default-site of goal
org.apache.maven.plugins:maven-site-plugin:3.5.1:site failed.
	at org.apache.maven.plugin.DefaultBuildPluginManager.executeMojo(DefaultBuildPluginManager.java:145)
	at org.apache.maven.lifecycle.internal.MojoExecutor.execute(MojoExecutor.java:207)
	... 31 more
Caused by: java.lang.NullPointerException
	at org.apache.maven.dist.tools.site.CheckSiteResult.getSkins(CheckSiteResult.java:97)
	at org.apache.maven.dist.tools.site.DistCheckSiteMojo.executeReport(DistCheckSiteMojo.java:228)
	at org.apache.maven.reporting.AbstractMavenReport.generate(AbstractMavenReport.java:255)
	at org.apache.maven.plugins.site.render.ReportDocumentRenderer.renderDocument(ReportDocumentRenderer.java:227)
	at org.apache.maven.doxia.siterenderer.DefaultSiteRenderer.render(DefaultSiteRenderer.java:329)
	at org.apache.maven.plugins.site.render.SiteMojo.renderLocale(SiteMojo.java:181)
	at org.apache.maven.plugins.site.render.SiteMojo.execute(SiteMojo.java:135)
	at org.apache.maven.plugin.DefaultBuildPluginManager.executeMojo(DefaultBuildPluginManager.java:134)
	... 32 more
[ERROR] 
[ERROR] Re-run Maven using the -X switch to enable full debug logging.
[ERROR] 
[ERROR] For more information about the errors and possible solutions, please read the following
articles:
[ERROR] [Help 1] http://cwiki.apache.org/confluence/display/MAVEN/PluginExecutionException
[JENKINS] Archiving <https://builds.apache.org/job/dist-tool-plugin/ws/pom.xml> to org.apache.maven.dist.tools/dist-tool-plugin/1.0-SNAPSHOT/dist-tool-plugin-1.0-SNAPSHOT.pom
[JENKINS] Archiving <https://builds.apache.org/job/dist-tool-plugin/ws/target/dist-tool-plugin-1.0-SNAPSHOT.jar>
to org.apache.maven.dist.tools/dist-tool-plugin/1.0-SNAPSHOT/dist-tool-plugin-1.0-SNAPSHOT.jar
channel stopped

Mime
View raw message