maven-notifications mailing list archives

Site index · List index
Message view « Date » · « Thread »
Top « Date » · « Thread »
From Apache Jenkins Server <jenk...@builds.apache.org>
Subject Build failed in Jenkins: maven-plugin-tools-windows #129
Date Wed, 30 Aug 2017 18:12:17 GMT
See <https://builds.apache.org/job/maven-plugin-tools-windows/129/display/redirect?page=changes>

Changes:

[Robert Scholte] [MPLUGIN-324] javadoc generated by helpmojo goal of maven-plugin-plugin produces
build failures

------------------------------------------
[...truncated 112.92 KB...]
[INFO] Installing <https://builds.apache.org/job/maven-plugin-tools-windows/ws/target\maven-plugin-tools-3.5.1-SNAPSHOT-site.xml>
to F:\jenkins\jenkins-slave\workspace\maven-plugin-tools-windows\maven-plugin-plugin\target\local-repo\org\apache\maven\plugin-tools\maven-plugin-tools\3.5.1-SNAPSHOT\maven-plugin-tools-3.5.1-SNAPSHOT-site.xml
[INFO] Installing F:\jenkins\jenkins-slave\workspace\maven-plugin-tools-windows\maven-plugin-tools-api\pom.xml
to F:\jenkins\jenkins-slave\workspace\maven-plugin-tools-windows\maven-plugin-plugin\target\local-repo\org\apache\maven\plugin-tools\maven-plugin-tools-api\3.5.1-SNAPSHOT\maven-plugin-tools-api-3.5.1-SNAPSHOT.pom
[INFO] Installing F:\jenkins\jenkins-slave\workspace\maven-plugin-tools-windows\maven-plugin-tools-api\target\maven-plugin-tools-api-3.5.1-SNAPSHOT.jar
to F:\jenkins\jenkins-slave\workspace\maven-plugin-tools-windows\maven-plugin-plugin\target\local-repo\org\apache\maven\plugin-tools\maven-plugin-tools-api\3.5.1-SNAPSHOT\maven-plugin-tools-api-3.5.1-SNAPSHOT.jar
[INFO] Installing F:\jenkins\jenkins-slave\workspace\maven-plugin-tools-windows\maven-plugin-tools-api\pom.xml
to F:\jenkins\jenkins-slave\workspace\maven-plugin-tools-windows\maven-plugin-plugin\target\local-repo\org\apache\maven\plugin-tools\maven-plugin-tools-api\3.5.1-SNAPSHOT\maven-plugin-tools-api-3.5.1-SNAPSHOT.pom
[INFO] Installing F:\jenkins\jenkins-slave\workspace\maven-plugin-tools-windows\maven-plugin-tools-generators\pom.xml
to F:\jenkins\jenkins-slave\workspace\maven-plugin-tools-windows\maven-plugin-plugin\target\local-repo\org\apache\maven\plugin-tools\maven-plugin-tools-generators\3.5.1-SNAPSHOT\maven-plugin-tools-generators-3.5.1-SNAPSHOT.pom
[INFO] Installing F:\jenkins\jenkins-slave\workspace\maven-plugin-tools-windows\maven-plugin-tools-generators\target\maven-plugin-tools-generators-3.5.1-SNAPSHOT.jar
to F:\jenkins\jenkins-slave\workspace\maven-plugin-tools-windows\maven-plugin-plugin\target\local-repo\org\apache\maven\plugin-tools\maven-plugin-tools-generators\3.5.1-SNAPSHOT\maven-plugin-tools-generators-3.5.1-SNAPSHOT.jar
[INFO] Installing F:\jenkins\jenkins-slave\workspace\maven-plugin-tools-windows\maven-plugin-tools-generators\pom.xml
to F:\jenkins\jenkins-slave\workspace\maven-plugin-tools-windows\maven-plugin-plugin\target\local-repo\org\apache\maven\plugin-tools\maven-plugin-tools-generators\3.5.1-SNAPSHOT\maven-plugin-tools-generators-3.5.1-SNAPSHOT.pom
[INFO] Installing F:\jenkins\jenkins-slave\workspace\maven-plugin-tools-windows\maven-plugin-tools-java\pom.xml
to F:\jenkins\jenkins-slave\workspace\maven-plugin-tools-windows\maven-plugin-plugin\target\local-repo\org\apache\maven\plugin-tools\maven-plugin-tools-java\3.5.1-SNAPSHOT\maven-plugin-tools-java-3.5.1-SNAPSHOT.pom
[INFO] Installing F:\jenkins\jenkins-slave\workspace\maven-plugin-tools-windows\maven-plugin-tools-java\target\maven-plugin-tools-java-3.5.1-SNAPSHOT.jar
to F:\jenkins\jenkins-slave\workspace\maven-plugin-tools-windows\maven-plugin-plugin\target\local-repo\org\apache\maven\plugin-tools\maven-plugin-tools-java\3.5.1-SNAPSHOT\maven-plugin-tools-java-3.5.1-SNAPSHOT.jar
[INFO] Installing F:\jenkins\jenkins-slave\workspace\maven-plugin-tools-windows\maven-plugin-tools-java\pom.xml
to F:\jenkins\jenkins-slave\workspace\maven-plugin-tools-windows\maven-plugin-plugin\target\local-repo\org\apache\maven\plugin-tools\maven-plugin-tools-java\3.5.1-SNAPSHOT\maven-plugin-tools-java-3.5.1-SNAPSHOT.pom
[INFO] Installing F:\jenkins\jenkins-slave\workspace\maven-plugin-tools-windows\maven-plugin-annotations\pom.xml
to F:\jenkins\jenkins-slave\workspace\maven-plugin-tools-windows\maven-plugin-plugin\target\local-repo\org\apache\maven\plugin-tools\maven-plugin-annotations\3.5.1-SNAPSHOT\maven-plugin-annotations-3.5.1-SNAPSHOT.pom
[INFO] Installing F:\jenkins\jenkins-slave\workspace\maven-plugin-tools-windows\maven-plugin-annotations\target\maven-plugin-annotations-3.5.1-SNAPSHOT.jar
to F:\jenkins\jenkins-slave\workspace\maven-plugin-tools-windows\maven-plugin-plugin\target\local-repo\org\apache\maven\plugin-tools\maven-plugin-annotations\3.5.1-SNAPSHOT\maven-plugin-annotations-3.5.1-SNAPSHOT.jar
[INFO] Installing F:\jenkins\jenkins-slave\workspace\maven-plugin-tools-windows\maven-plugin-annotations\pom.xml
to F:\jenkins\jenkins-slave\workspace\maven-plugin-tools-windows\maven-plugin-plugin\target\local-repo\org\apache\maven\plugin-tools\maven-plugin-annotations\3.5.1-SNAPSHOT\maven-plugin-annotations-3.5.1-SNAPSHOT.pom
[INFO] Installing F:\jenkins\jenkins-slave\workspace\maven-plugin-tools-windows\maven-plugin-tools-annotations\pom.xml
to F:\jenkins\jenkins-slave\workspace\maven-plugin-tools-windows\maven-plugin-plugin\target\local-repo\org\apache\maven\plugin-tools\maven-plugin-tools-annotations\3.5.1-SNAPSHOT\maven-plugin-tools-annotations-3.5.1-SNAPSHOT.pom
[INFO] Installing F:\jenkins\jenkins-slave\workspace\maven-plugin-tools-windows\maven-plugin-tools-annotations\target\maven-plugin-tools-annotations-3.5.1-SNAPSHOT.jar
to F:\jenkins\jenkins-slave\workspace\maven-plugin-tools-windows\maven-plugin-plugin\target\local-repo\org\apache\maven\plugin-tools\maven-plugin-tools-annotations\3.5.1-SNAPSHOT\maven-plugin-tools-annotations-3.5.1-SNAPSHOT.jar
[INFO] Installing F:\jenkins\jenkins-slave\workspace\maven-plugin-tools-windows\maven-plugin-tools-annotations\pom.xml
to F:\jenkins\jenkins-slave\workspace\maven-plugin-tools-windows\maven-plugin-plugin\target\local-repo\org\apache\maven\plugin-tools\maven-plugin-tools-annotations\3.5.1-SNAPSHOT\maven-plugin-tools-annotations-3.5.1-SNAPSHOT.pom
[INFO] Installing F:\jenkins\jenkins-slave\workspace\maven-plugin-tools-windows\maven-plugin-tools-annotations\target\maven-plugin-tools-annotations-3.5.1-SNAPSHOT-tests.jar
to F:\jenkins\jenkins-slave\workspace\maven-plugin-tools-windows\maven-plugin-plugin\target\local-repo\org\apache\maven\plugin-tools\maven-plugin-tools-annotations\3.5.1-SNAPSHOT\maven-plugin-tools-annotations-3.5.1-SNAPSHOT-tests.jar
[INFO] Installing F:\jenkins\jenkins-slave\workspace\maven-plugin-tools-windows\maven-plugin-tools-annotations\target\maven-plugin-tools-annotations-3.5.1-SNAPSHOT-test-sources.jar
to F:\jenkins\jenkins-slave\workspace\maven-plugin-tools-windows\maven-plugin-plugin\target\local-repo\org\apache\maven\plugin-tools\maven-plugin-tools-annotations\3.5.1-SNAPSHOT\maven-plugin-tools-annotations-3.5.1-SNAPSHOT-test-sources.jar
[INFO] Installing F:\jenkins\jenkins-slave\workspace\maven-plugin-tools-windows\maven-plugin-tools-javadoc\pom.xml
to F:\jenkins\jenkins-slave\workspace\maven-plugin-tools-windows\maven-plugin-plugin\target\local-repo\org\apache\maven\plugin-tools\maven-plugin-tools-javadoc\3.5.1-SNAPSHOT\maven-plugin-tools-javadoc-3.5.1-SNAPSHOT.pom
[INFO] Installing F:\jenkins\jenkins-slave\workspace\maven-plugin-tools-windows\maven-script\pom.xml
to F:\jenkins\jenkins-slave\workspace\maven-plugin-tools-windows\maven-plugin-plugin\target\local-repo\org\apache\maven\plugin-tools\maven-script\3.5.1-SNAPSHOT\maven-script-3.5.1-SNAPSHOT.pom
[INFO] Installing F:\jenkins\jenkins-slave\workspace\maven-plugin-tools-windows\maven-script\target\maven-script-3.5.1-SNAPSHOT-site.xml
to F:\jenkins\jenkins-slave\workspace\maven-plugin-tools-windows\maven-plugin-plugin\target\local-repo\org\apache\maven\plugin-tools\maven-script\3.5.1-SNAPSHOT\maven-script-3.5.1-SNAPSHOT-site.xml
[INFO] Installing F:\jenkins\jenkins-slave\workspace\maven-plugin-tools-windows\maven-script\maven-plugin-tools-model\pom.xml
to F:\jenkins\jenkins-slave\workspace\maven-plugin-tools-windows\maven-plugin-plugin\target\local-repo\org\apache\maven\plugin-tools\maven-plugin-tools-model\3.5.1-SNAPSHOT\maven-plugin-tools-model-3.5.1-SNAPSHOT.pom
[INFO] Installing F:\jenkins\jenkins-slave\workspace\maven-plugin-tools-windows\maven-script\maven-plugin-tools-model\target\maven-plugin-tools-model-3.5.1-SNAPSHOT.jar
to F:\jenkins\jenkins-slave\workspace\maven-plugin-tools-windows\maven-plugin-plugin\target\local-repo\org\apache\maven\plugin-tools\maven-plugin-tools-model\3.5.1-SNAPSHOT\maven-plugin-tools-model-3.5.1-SNAPSHOT.jar
[INFO] Installing F:\jenkins\jenkins-slave\workspace\maven-plugin-tools-windows\maven-script\maven-plugin-tools-model\pom.xml
to F:\jenkins\jenkins-slave\workspace\maven-plugin-tools-windows\maven-plugin-plugin\target\local-repo\org\apache\maven\plugin-tools\maven-plugin-tools-model\3.5.1-SNAPSHOT\maven-plugin-tools-model-3.5.1-SNAPSHOT.pom
[INFO] Installing F:\jenkins\jenkins-slave\workspace\maven-plugin-tools-windows\maven-script\maven-plugin-tools-ant\pom.xml
to F:\jenkins\jenkins-slave\workspace\maven-plugin-tools-windows\maven-plugin-plugin\target\local-repo\org\apache\maven\plugin-tools\maven-plugin-tools-ant\3.5.1-SNAPSHOT\maven-plugin-tools-ant-3.5.1-SNAPSHOT.pom
[INFO] Installing F:\jenkins\jenkins-slave\workspace\maven-plugin-tools-windows\maven-script\maven-plugin-tools-ant\target\maven-plugin-tools-ant-3.5.1-SNAPSHOT.jar
to F:\jenkins\jenkins-slave\workspace\maven-plugin-tools-windows\maven-plugin-plugin\target\local-repo\org\apache\maven\plugin-tools\maven-plugin-tools-ant\3.5.1-SNAPSHOT\maven-plugin-tools-ant-3.5.1-SNAPSHOT.jar
[INFO] Installing F:\jenkins\jenkins-slave\workspace\maven-plugin-tools-windows\maven-script\maven-plugin-tools-ant\pom.xml
to F:\jenkins\jenkins-slave\workspace\maven-plugin-tools-windows\maven-plugin-plugin\target\local-repo\org\apache\maven\plugin-tools\maven-plugin-tools-ant\3.5.1-SNAPSHOT\maven-plugin-tools-ant-3.5.1-SNAPSHOT.pom
[INFO] Installing F:\jenkins\jenkins-slave\workspace\maven-plugin-tools-windows\maven-script\maven-script-ant\pom.xml
to F:\jenkins\jenkins-slave\workspace\maven-plugin-tools-windows\maven-plugin-plugin\target\local-repo\org\apache\maven\plugin-tools\maven-script-ant\3.5.1-SNAPSHOT\maven-script-ant-3.5.1-SNAPSHOT.pom
[INFO] Installing F:\jenkins\jenkins-slave\workspace\maven-plugin-tools-windows\maven-script\maven-script-ant\target\maven-script-ant-3.5.1-SNAPSHOT.jar
to F:\jenkins\jenkins-slave\workspace\maven-plugin-tools-windows\maven-plugin-plugin\target\local-repo\org\apache\maven\plugin-tools\maven-script-ant\3.5.1-SNAPSHOT\maven-script-ant-3.5.1-SNAPSHOT.jar
[INFO] Installing F:\jenkins\jenkins-slave\workspace\maven-plugin-tools-windows\maven-script\maven-script-ant\pom.xml
to F:\jenkins\jenkins-slave\workspace\maven-plugin-tools-windows\maven-plugin-plugin\target\local-repo\org\apache\maven\plugin-tools\maven-script-ant\3.5.1-SNAPSHOT\maven-script-ant-3.5.1-SNAPSHOT.pom
[INFO] Installing F:\jenkins\jenkins-slave\workspace\maven-plugin-tools-windows\maven-script\maven-plugin-tools-beanshell\pom.xml
to F:\jenkins\jenkins-slave\workspace\maven-plugin-tools-windows\maven-plugin-plugin\target\local-repo\org\apache\maven\plugin-tools\maven-plugin-tools-beanshell\3.5.1-SNAPSHOT\maven-plugin-tools-beanshell-3.5.1-SNAPSHOT.pom
[INFO] Installing F:\jenkins\jenkins-slave\workspace\maven-plugin-tools-windows\maven-script\maven-plugin-tools-beanshell\target\maven-plugin-tools-beanshell-3.5.1-SNAPSHOT.jar
to F:\jenkins\jenkins-slave\workspace\maven-plugin-tools-windows\maven-plugin-plugin\target\local-repo\org\apache\maven\plugin-tools\maven-plugin-tools-beanshell\3.5.1-SNAPSHOT\maven-plugin-tools-beanshell-3.5.1-SNAPSHOT.jar
[INFO] Installing F:\jenkins\jenkins-slave\workspace\maven-plugin-tools-windows\maven-script\maven-plugin-tools-beanshell\pom.xml
to F:\jenkins\jenkins-slave\workspace\maven-plugin-tools-windows\maven-plugin-plugin\target\local-repo\org\apache\maven\plugin-tools\maven-plugin-tools-beanshell\3.5.1-SNAPSHOT\maven-plugin-tools-beanshell-3.5.1-SNAPSHOT.pom
[INFO] Installing F:\jenkins\jenkins-slave\workspace\maven-plugin-tools-windows\maven-script\maven-script-beanshell\pom.xml
to F:\jenkins\jenkins-slave\workspace\maven-plugin-tools-windows\maven-plugin-plugin\target\local-repo\org\apache\maven\plugin-tools\maven-script-beanshell\3.5.1-SNAPSHOT\maven-script-beanshell-3.5.1-SNAPSHOT.pom
[INFO] Installing F:\jenkins\jenkins-slave\workspace\maven-plugin-tools-windows\maven-script\maven-script-beanshell\target\maven-script-beanshell-3.5.1-SNAPSHOT.jar
to F:\jenkins\jenkins-slave\workspace\maven-plugin-tools-windows\maven-plugin-plugin\target\local-repo\org\apache\maven\plugin-tools\maven-script-beanshell\3.5.1-SNAPSHOT\maven-script-beanshell-3.5.1-SNAPSHOT.jar
[INFO] Installing F:\jenkins\jenkins-slave\workspace\maven-plugin-tools-windows\maven-script\maven-script-beanshell\pom.xml
to F:\jenkins\jenkins-slave\workspace\maven-plugin-tools-windows\maven-plugin-plugin\target\local-repo\org\apache\maven\plugin-tools\maven-script-beanshell\3.5.1-SNAPSHOT\maven-script-beanshell-3.5.1-SNAPSHOT.pom
[INFO] Installing F:\jenkins\jenkins-slave\workspace\maven-plugin-tools-windows\maven-plugin-plugin\pom.xml
to F:\jenkins\jenkins-slave\workspace\maven-plugin-tools-windows\maven-plugin-plugin\target\local-repo\org\apache\maven\plugins\maven-plugin-plugin\3.5.1-SNAPSHOT\maven-plugin-plugin-3.5.1-SNAPSHOT.pom
[INFO] Installing F:\jenkins\jenkins-slave\workspace\maven-plugin-tools-windows\maven-plugin-plugin\target\maven-plugin-plugin-3.5.1-SNAPSHOT.jar
to F:\jenkins\jenkins-slave\workspace\maven-plugin-tools-windows\maven-plugin-plugin\target\local-repo\org\apache\maven\plugins\maven-plugin-plugin\3.5.1-SNAPSHOT\maven-plugin-plugin-3.5.1-SNAPSHOT.jar
[INFO] 
[INFO] --- maven-invoker-plugin:1.10:run (integration-test) @ maven-plugin-plugin ---
[INFO] Building: annotation-with-inheritance\pom.xml
[INFO] run script verify.groovy
[INFO] ..SUCCESS (31.3 s)
[INFO] Building: annotation-with-inheritance-from-deps\pom.xml
[INFO] run script verify.groovy
[INFO] ..SUCCESS (23.6 s)
[INFO] Building: annotation-with-inheritance-reactor\pom.xml
[INFO] run script verify.groovy
[INFO] ..SUCCESS (15.7 s)
[INFO] Building: ant-basic\pom.xml
[INFO] run script verify.groovy
[INFO] ..SUCCESS (10.4 s)
[INFO] Building: ant-reference-parameter\pom.xml
[INFO] ..SUCCESS (11.1 s)
[INFO] Building: ant-simple-usage\pom.xml
[INFO] ..SUCCESS (6.7 s)
[INFO] Building: ant-since-maven-plugin\pom.xml
[INFO] ..SUCCESS (5.9 s)
[INFO] Building: beanshell-simple\pom.xml
[INFO] run script verify.groovy
[INFO] ..SUCCESS (9.3 s)
[INFO] Building: fix-maven-since-3.x\pom.xml
[INFO] run script verify.groovy
[INFO] ..SUCCESS (17.6 s)
[INFO] Building: help-basic\pom.xml
[INFO] run script verify.groovy
[INFO] ..SUCCESS (13.8 s)
[INFO] Building: help-package\pom.xml
[INFO] run script verify.bsh
[INFO] ..SUCCESS (6.9 s)
[INFO] Building: ignore-plugin-class-realm\pom.xml
[INFO] ..SUCCESS (11.3 s)
[INFO] Building: java-basic\pom.xml
[INFO] run script verify.groovy
[INFO] ..SUCCESS (11.0 s)
[INFO] Building: java-basic-annotations\pom.xml
[INFO] run script verify.groovy
[INFO] ..SUCCESS (15.7 s)
[INFO] Building: java-basic-annotations-jdk8\pom.xml
[INFO] run script verify.groovy
[INFO] ..SUCCESS (16.2 s)
[INFO] Building: mplugin-187\pom.xml
[INFO] ..SUCCESS (4.9 s)
[INFO] Building: mplugin-191\pom.xml
[INFO] run script verify.groovy
[INFO] ..SUCCESS (8.8 s)
[INFO] Building: mplugin-223\pom.xml
[INFO] run script verify.groovy
[INFO] ..SUCCESS (7.3 s)
[INFO] Building: mplugin-272_java8\pom.xml
[INFO] ..FAILED (6.0 s)
[INFO]   The build exited with code 1. See F:\jenkins\jenkins-slave\workspace\maven-plugin-tools-windows\maven-plugin-plugin\target\it\mplugin-272_java8\build.log
for details.
[INFO] Building: mplugin-299_no-configuration\pom.xml
[INFO] ..SUCCESS (10.8 s)
[INFO] Building: mplugin-305_defaultMojoDependencies\pom.xml
[INFO] run script verify.groovy
[INFO] ..SUCCESS (8.9 s)
[INFO] Building: mplugin-305_emptyMojoDependencies\pom.xml
[INFO] run script verify.groovy
[INFO] ..SUCCESS (7.4 s)
[INFO] Building: mplugin-305_singleMojoDependencies\pom.xml
[INFO] run script verify.groovy
[INFO] ..SUCCESS (7.8 s)
[INFO] Building: mplugin-319_report-since\pom.xml
[INFO] run script verify.groovy
[INFO] ..SUCCESS (7.4 s)
[INFO] Building: mplugin-324_javadoc\pom.xml
[INFO] ..SUCCESS (12.7 s)
[INFO] Building: packaging-jar\pom.xml
[INFO] run script verify.groovy
[INFO] ..SUCCESS (9.3 s)
[INFO] Building: plugin-info-jdk\pom.xml
[INFO] run script verify.groovy
[INFO] ..SUCCESS (13.4 s)
[INFO] Building: plugin-info-jdk-default-version\pom.xml
[INFO] run script verify.groovy
[INFO] ..SUCCESS (7.0 s)
[INFO] Building: plugin-report\pom.xml
[INFO] run script verify.bsh
[INFO] ..SUCCESS (19.7 s)
[INFO] Building: plugin-report-annotations\pom.xml
[INFO] run script verify.bsh
[INFO] ..SUCCESS (11.2 s)
[INFO] Building: skip\pom.xml
[INFO] run script verify.groovy
[INFO] ..SUCCESS (6.1 s)
[INFO] Building: source-encoding\pom.xml
[INFO] run script verify.groovy
[INFO] ..SUCCESS (7.8 s)
[INFO] -------------------------------------------------
[INFO] Build Summary:
[INFO]   Passed: 31, Failed: 1, Errors: 0, Skipped: 0
[INFO] -------------------------------------------------
[ERROR] The following builds failed:
[ERROR] *  mplugin-272_java8\pom.xml
[INFO] -------------------------------------------------
MavenInvokerArchiver
found reports:[F:\jenkins\jenkins-slave\workspace\maven-plugin-tools-windows\maven-plugin-plugin\target\invoker-reports\BUILD-annotation-with-inheritance-from-deps.xml,
F:\jenkins\jenkins-slave\workspace\maven-plugin-tools-windows\maven-plugin-plugin\target\invoker-reports\BUILD-annotation-with-inheritance-reactor.xml,
F:\jenkins\jenkins-slave\workspace\maven-plugin-tools-windows\maven-plugin-plugin\target\invoker-reports\BUILD-annotation-with-inheritance.xml,
F:\jenkins\jenkins-slave\workspace\maven-plugin-tools-windows\maven-plugin-plugin\target\invoker-reports\BUILD-ant-basic.xml,
F:\jenkins\jenkins-slave\workspace\maven-plugin-tools-windows\maven-plugin-plugin\target\invoker-reports\BUILD-ant-reference-parameter.xml,
F:\jenkins\jenkins-slave\workspace\maven-plugin-tools-windows\maven-plugin-plugin\target\invoker-reports\BUILD-ant-simple-usage.xml,
F:\jenkins\jenkins-slave\workspace\maven-plugin-tools-windows\maven-plugin-plugin\target\invoker-reports\BUILD-ant-since-maven-plugin.xml,
F:\jenkins\jenkins-slave\workspace\maven-plugin-tools-windows\maven-plugin-plugin\target\invoker-reports\BUILD-beanshell-simple.xml,
F:\jenkins\jenkins-slave\workspace\maven-plugin-tools-windows\maven-plugin-plugin\target\invoker-reports\BUILD-fix-maven-since-3.x.xml,
F:\jenkins\jenkins-slave\workspace\maven-plugin-tools-windows\maven-plugin-plugin\target\invoker-reports\BUILD-help-basic.xml,
F:\jenkins\jenkins-slave\workspace\maven-plugin-tools-windows\maven-plugin-plugin\target\invoker-reports\BUILD-help-package.xml,
F:\jenkins\jenkins-slave\workspace\maven-plugin-tools-windows\maven-plugin-plugin\target\invoker-reports\BUILD-ignore-plugin-class-realm.xml,
F:\jenkins\jenkins-slave\workspace\maven-plugin-tools-windows\maven-plugin-plugin\target\invoker-reports\BUILD-java-basic-annotations-jdk8.xml,
F:\jenkins\jenkins-slave\workspace\maven-plugin-tools-windows\maven-plugin-plugin\target\invoker-reports\BUILD-java-basic-annotations.xml,
F:\jenkins\jenkins-slave\workspace\maven-plugin-tools-windows\maven-plugin-plugin\target\invoker-reports\BUILD-java-basic.xml,
F:\jenkins\jenkins-slave\workspace\maven-plugin-tools-windows\maven-plugin-plugin\target\invoker-reports\BUILD-mplugin-187.xml,
F:\jenkins\jenkins-slave\workspace\maven-plugin-tools-windows\maven-plugin-plugin\target\invoker-reports\BUILD-mplugin-191.xml,
F:\jenkins\jenkins-slave\workspace\maven-plugin-tools-windows\maven-plugin-plugin\target\invoker-reports\BUILD-mplugin-223.xml,
F:\jenkins\jenkins-slave\workspace\maven-plugin-tools-windows\maven-plugin-plugin\target\invoker-reports\BUILD-mplugin-272_java8.xml,
F:\jenkins\jenkins-slave\workspace\maven-plugin-tools-windows\maven-plugin-plugin\target\invoker-reports\BUILD-mplugin-299_no-configuration.xml,
F:\jenkins\jenkins-slave\workspace\maven-plugin-tools-windows\maven-plugin-plugin\target\invoker-reports\BUILD-mplugin-305_defaultMojoDependencies.xml,
F:\jenkins\jenkins-slave\workspace\maven-plugin-tools-windows\maven-plugin-plugin\target\invoker-reports\BUILD-mplugin-305_emptyMojoDependencies.xml,
F:\jenkins\jenkins-slave\workspace\maven-plugin-tools-windows\maven-plugin-plugin\target\invoker-reports\BUILD-mplugin-305_singleMojoDependencies.xml,
F:\jenkins\jenkins-slave\workspace\maven-plugin-tools-windows\maven-plugin-plugin\target\invoker-reports\BUILD-mplugin-319_report-since.xml,
F:\jenkins\jenkins-slave\workspace\maven-plugin-tools-windows\maven-plugin-plugin\target\invoker-reports\BUILD-mplugin-324_javadoc.xml,
F:\jenkins\jenkins-slave\workspace\maven-plugin-tools-windows\maven-plugin-plugin\target\invoker-reports\BUILD-packaging-jar.xml,
F:\jenkins\jenkins-slave\workspace\maven-plugin-tools-windows\maven-plugin-plugin\target\invoker-reports\BUILD-plugin-info-jdk-default-version.xml,
F:\jenkins\jenkins-slave\workspace\maven-plugin-tools-windows\maven-plugin-plugin\target\invoker-reports\BUILD-plugin-info-jdk.xml,
F:\jenkins\jenkins-slave\workspace\maven-plugin-tools-windows\maven-plugin-plugin\target\invoker-reports\BUILD-plugin-report-annotations.xml,
F:\jenkins\jenkins-slave\workspace\maven-plugin-tools-windows\maven-plugin-plugin\target\invoker-reports\BUILD-plugin-report.xml,
F:\jenkins\jenkins-slave\workspace\maven-plugin-tools-windows\maven-plugin-plugin\target\invoker-reports\BUILD-skip.xml,
F:\jenkins\jenkins-slave\workspace\maven-plugin-tools-windows\maven-plugin-plugin\target\invoker-reports\BUILD-source-encoding.xml]
java.lang.reflect.InvocationTargetException
	at sun.reflect.NativeMethodAccessorImpl.invoke0(Native Method)
	at sun.reflect.NativeMethodAccessorImpl.invoke(Unknown Source)
	at sun.reflect.DelegatingMethodAccessorImpl.invoke(Unknown Source)
	at java.lang.reflect.Method.invoke(Unknown Source)
	at org.codehaus.plexus.classworlds.launcher.Launcher.launchStandard(Launcher.java:329)
	at org.codehaus.plexus.classworlds.launcher.Launcher.launch(Launcher.java:239)
	at org.jvnet.hudson.maven3.agent.Maven3Main.launch(Maven3Main.java:181)
	at sun.reflect.NativeMethodAccessorImpl.invoke0(Native Method)
	at sun.reflect.NativeMethodAccessorImpl.invoke(Unknown Source)
	at sun.reflect.DelegatingMethodAccessorImpl.invoke(Unknown Source)
	at java.lang.reflect.Method.invoke(Unknown Source)
	at hudson.maven.Maven3Builder.call(Maven3Builder.java:139)
	at hudson.maven.Maven3Builder.call(Maven3Builder.java:70)
	at hudson.remoting.UserRequest.perform(UserRequest.java:153)
	at hudson.remoting.UserRequest.perform(UserRequest.java:50)
	at hudson.remoting.Request$2.run(Request.java:336)
	at hudson.remoting.InterceptingExecutorService$1.call(InterceptingExecutorService.java:68)
	at java.util.concurrent.FutureTask.run(Unknown Source)
	at java.util.concurrent.ThreadPoolExecutor.runWorker(Unknown Source)
	at java.util.concurrent.ThreadPoolExecutor$Worker.run(Unknown Source)
	at java.lang.Thread.run(Unknown Source)
Caused by: java.lang.NoSuchMethodError: org.codehaus.plexus.util.xml.pull.MXParser.<init>(Lorg/codehaus/plexus/util/xml/pull/EntityReplacementMap;)V
	at org.apache.maven.plugin.invoker.model.io.xpp3.BuildJobXpp3Reader.read(BuildJobXpp3Reader.java:510)
	at org.apache.maven.plugin.invoker.model.io.xpp3.BuildJobXpp3Reader.read(BuildJobXpp3Reader.java:529)
	at org.apache.maven.plugin.invoker.model.io.xpp3.BuildJobXpp3Reader.read(BuildJobXpp3Reader.java:558)
	at org.jenkinsci.plugins.maveninvoker.MavenInvokerArchiver.postExecute(MavenInvokerArchiver.java:113)
	at hudson.maven.Maven3Builder$MavenExecutionListener.recordMojoEnded(Maven3Builder.java:629)
	at hudson.maven.Maven3Builder$MavenExecutionListener.mojoFailed(Maven3Builder.java:662)
	at org.apache.maven.lifecycle.internal.DefaultExecutionEventCatapult.fire(DefaultExecutionEventCatapult.java:90)
	at org.apache.maven.lifecycle.internal.MojoExecutor.execute(MojoExecutor.java:232)
	at org.apache.maven.lifecycle.internal.MojoExecutor.execute(MojoExecutor.java:153)
	at org.apache.maven.lifecycle.internal.MojoExecutor.execute(MojoExecutor.java:145)
	at org.apache.maven.lifecycle.internal.LifecycleModuleBuilder.buildProject(LifecycleModuleBuilder.java:84)
	at org.apache.maven.lifecycle.internal.LifecycleModuleBuilder.buildProject(LifecycleModuleBuilder.java:59)
	at org.apache.maven.lifecycle.internal.LifecycleStarter.singleThreadedBuild(LifecycleStarter.java:183)
	at org.apache.maven.lifecycle.internal.LifecycleStarter.execute(LifecycleStarter.java:161)
	at org.apache.maven.DefaultMaven.doExecute(DefaultMaven.java:320)
	at org.apache.maven.DefaultMaven.execute(DefaultMaven.java:156)
	at org.jvnet.hudson.maven3.launcher.Maven3Launcher.main(Maven3Launcher.java:117)
	... 21 more
ERROR: Failed to parse POMs
java.io.IOException: java.lang.reflect.InvocationTargetException
	at hudson.maven.Maven3Builder.call(Maven3Builder.java:179)
	at hudson.maven.Maven3Builder.call(Maven3Builder.java:70)
	at hudson.remoting.UserRequest.perform(UserRequest.java:153)
	at hudson.remoting.UserRequest.perform(UserRequest.java:50)
	at hudson.remoting.Request$2.run(Request.java:336)
	at hudson.remoting.InterceptingExecutorService$1.call(InterceptingExecutorService.java:68)
	at java.util.concurrent.FutureTask.run(Unknown Source)
	at java.util.concurrent.ThreadPoolExecutor.runWorker(Unknown Source)
	at java.util.concurrent.ThreadPoolExecutor$Worker.run(Unknown Source)
	at java.lang.Thread.run(Unknown Source)
	at ......remote call to Channel to Maven [C:\Program Files\Java\jre1.8.0_121/bin/java, -Xmx2g,
-Xms256m, -cp, f:\jenkins\jenkins-slave\maven3-agent.jar;F:\jenkins\tools\maven\apache-maven-3.0.5\boot\plexus-classworlds-2.4.jar,
org.jvnet.hudson.maven3.agent.Maven3Main, F:\\jenkins\\tools\\maven\\apache-maven-3.0.5, F:\jenkins\jenkins-slave\slave.jar,
f:\jenkins\jenkins-slave\maven3-interceptor.jar, f:\jenkins\jenkins-slave\maven3-interceptor-commons.jar,
53780](Native Method)
	at hudson.remoting.Channel.attachCallSiteStackTrace(Channel.java:1545)
	at hudson.remoting.UserResponse.retrieve(UserRequest.java:253)
	at hudson.remoting.Channel.call(Channel.java:830)
	at hudson.maven.ProcessCache$MavenProcess.call(ProcessCache.java:161)
	at hudson.maven.MavenModuleSetBuild$MavenModuleSetBuildExecution.doRun(MavenModuleSetBuild.java:878)
	at hudson.model.AbstractBuild$AbstractBuildExecution.run(AbstractBuild.java:490)
	at hudson.model.Run.execute(Run.java:1735)
	at hudson.maven.MavenModuleSetBuild.run(MavenModuleSetBuild.java:542)
	at hudson.model.ResourceController.execute(ResourceController.java:97)
	at hudson.model.Executor.run(Executor.java:405)
Caused by: java.lang.reflect.InvocationTargetException
	at sun.reflect.NativeMethodAccessorImpl.invoke0(Native Method)
	at sun.reflect.NativeMethodAccessorImpl.invoke(Unknown Source)
	at sun.reflect.DelegatingMethodAccessorImpl.invoke(Unknown Source)
	at java.lang.reflect.Method.invoke(Unknown Source)
	at hudson.maven.Maven3Builder.call(Maven3Builder.java:139)
	at hudson.maven.Maven3Builder.call(Maven3Builder.java:70)
	at hudson.remoting.UserRequest.perform(UserRequest.java:153)
	at hudson.remoting.UserRequest.perform(UserRequest.java:50)
	at hudson.remoting.Request$2.run(Request.java:336)
	at hudson.remoting.InterceptingExecutorService$1.call(InterceptingExecutorService.java:68)
	at java.util.concurrent.FutureTask.run(Unknown Source)
	at java.util.concurrent.ThreadPoolExecutor.runWorker(Unknown Source)
	at java.util.concurrent.ThreadPoolExecutor$Worker.run(Unknown Source)
	at java.lang.Thread.run(Unknown Source)
Caused by: java.lang.Exception: java.lang.reflect.InvocationTargetException
	at org.jvnet.hudson.maven3.agent.Maven3Main.launch(Maven3Main.java:184)
	... 14 more
Caused by: java.lang.reflect.InvocationTargetException
	at sun.reflect.NativeMethodAccessorImpl.invoke0(Native Method)
	at sun.reflect.NativeMethodAccessorImpl.invoke(Unknown Source)
	at sun.reflect.DelegatingMethodAccessorImpl.invoke(Unknown Source)
	at java.lang.reflect.Method.invoke(Unknown Source)
	at org.codehaus.plexus.classworlds.launcher.Launcher.launchStandard(Launcher.java:329)
	at org.codehaus.plexus.classworlds.launcher.Launcher.launch(Launcher.java:239)
	at org.jvnet.hudson.maven3.agent.Maven3Main.launch(Maven3Main.java:181)
	... 14 more
Caused by: java.lang.NoSuchMethodError: org.codehaus.plexus.util.xml.pull.MXParser.<init>(Lorg/codehaus/plexus/util/xml/pull/EntityReplacementMap;)V
	at org.apache.maven.plugin.invoker.model.io.xpp3.BuildJobXpp3Reader.read(BuildJobXpp3Reader.java:510)
	at org.apache.maven.plugin.invoker.model.io.xpp3.BuildJobXpp3Reader.read(BuildJobXpp3Reader.java:529)
	at org.apache.maven.plugin.invoker.model.io.xpp3.BuildJobXpp3Reader.read(BuildJobXpp3Reader.java:558)
	at org.jenkinsci.plugins.maveninvoker.MavenInvokerArchiver.postExecute(MavenInvokerArchiver.java:113)
	at hudson.maven.Maven3Builder$MavenExecutionListener.recordMojoEnded(Maven3Builder.java:629)
	at hudson.maven.Maven3Builder$MavenExecutionListener.mojoFailed(Maven3Builder.java:662)
	at org.apache.maven.lifecycle.internal.DefaultExecutionEventCatapult.fire(DefaultExecutionEventCatapult.java:90)
	at org.apache.maven.lifecycle.internal.MojoExecutor.execute(MojoExecutor.java:232)
	at org.apache.maven.lifecycle.internal.MojoExecutor.execute(MojoExecutor.java:153)
	at org.apache.maven.lifecycle.internal.MojoExecutor.execute(MojoExecutor.java:145)
	at org.apache.maven.lifecycle.internal.LifecycleModuleBuilder.buildProject(LifecycleModuleBuilder.java:84)
	at org.apache.maven.lifecycle.internal.LifecycleModuleBuilder.buildProject(LifecycleModuleBuilder.java:59)
	at org.apache.maven.lifecycle.internal.LifecycleStarter.singleThreadedBuild(LifecycleStarter.java:183)
	at org.apache.maven.lifecycle.internal.LifecycleStarter.execute(LifecycleStarter.java:161)
	at org.apache.maven.DefaultMaven.doExecute(DefaultMaven.java:320)
	at org.apache.maven.DefaultMaven.execute(DefaultMaven.java:156)
	at org.jvnet.hudson.maven3.launcher.Maven3Launcher.main(Maven3Launcher.java:117)
	... 21 more
channel stopped

Mime
View raw message