maven-notifications mailing list archives

Site index · List index
Message view « Date » · « Thread »
Top « Date » · « Thread »
From Apache Jenkins Server <jenk...@builds.apache.org>
Subject Build failed in Jenkins: core-integration-testing-maven-3-embedded #7717
Date Thu, 24 Aug 2017 09:52:33 GMT
See <https://builds.apache.org/job/core-integration-testing-maven-3-embedded/7717/display/redirect?page=changes>

Changes:

[Robert Scholte] Squashed commit of the following:

------------------------------------------
[...truncated 4.39 MB...]
  MavenITmng3023ReactorDependencyResolutionTest>AbstractMavenIntegrationTestCase.runTest:222->testitMNG3023B:99
» Verification
  MavenITmng3023ReactorDependencyResolutionTest>AbstractMavenIntegrationTestCase.runTest:222->testitMNG3023C:132
» Verification
  MavenITmng3052DepRepoAggregationTest>AbstractMavenIntegrationTestCase.runTest:222->testitMNG3052:65
» Verification
  MavenITmng3203DefaultLifecycleExecIdTest>AbstractMavenIntegrationTestCase.runTest:222->testitMNG3203:55
» Verification
  MavenITmng3259DepsDroppedInMultiModuleBuildTest>AbstractMavenIntegrationTestCase.runTest:222->testitMNG3259:54
» Verification
  MavenITmng3268MultipleHyphenPCommandLineTest>AbstractMavenIntegrationTestCase.runTest:222->testMultipleProfileParams:53
» Verification
  MavenITmng3297DependenciesNotLeakedToMojoTest>AbstractMavenIntegrationTestCase.runTest:222->testit:55
» Verification
  MavenITmng3372DirectInvocationOfPluginsTest>AbstractMavenIntegrationTestCase.runTest:222->testDependencyTreeInvocation:83
» Verification
  MavenITmng3372DirectInvocationOfPluginsTest>AbstractMavenIntegrationTestCase.runTest:222->testitMNG3372:58
» Verification
  MavenITmng3380ManagedRelocatedTransdepsTest>AbstractMavenIntegrationTestCase.runTest:222->testitMNG3380:64
» Verification
  MavenITmng3396DependencyManagementForOverConstrainedRangesTest>AbstractMavenIntegrationTestCase.runTest:222->testitMNG3396:53
» Verification
  MavenITmng3441MetadataUpdatedFromDeploymentRepositoryTest>AbstractMavenIntegrationTestCase.runTest:222->testitMNG3441:60
» Verification
  MavenITmng3485OverrideWagonExtensionTest>AbstractMavenIntegrationTestCase.runTest:222->testitMNG3485:49
» Verification
  MavenITmng3498ForkToOtherMojoTest>AbstractMavenIntegrationTestCase.runTest:222->testitMNG3498:57
» Verification
  MavenITmng3506ArtifactHandlersFromPluginsTest>AbstractMavenIntegrationTestCase.runTest:222->testProjectPackagingUsage:58
» Verification
  MavenITmng3536AppendedAbsolutePathsTest>AbstractMavenIntegrationTestCase.runTest:222->testitMNG3536:49
» Verification
  MavenITmng3581PluginUsesWagonDependencyTest>AbstractMavenIntegrationTestCase.runTest:222->testit:52
» Verification
  MavenITmng3599useHttpProxyForWebDAVMk2Test>AbstractMavenIntegrationTestCase.runTest:222->testitUseHttpProxyForHttp:143
» Verification
  MavenITmng3599useHttpProxyForWebDAVMk2Test>AbstractMavenIntegrationTestCase.runTest:222->testitUseHttpProxyForWebDAV:185
» Verification
  MavenITmng3600DeploymentModeDefaultsTest>AbstractMavenIntegrationTestCase.runTest:222->testitMNG3600ModesSet:93
» Verification
  MavenITmng3600DeploymentModeDefaultsTest>AbstractMavenIntegrationTestCase.runTest:222->testitMNG3600NoSettings:51
» Verification
  MavenITmng3600DeploymentModeDefaultsTest>AbstractMavenIntegrationTestCase.runTest:222->testitMNG3600ServerDefaults:72
» Verification
  MavenITmng3642DynamicResourcesTest>AbstractMavenIntegrationTestCase.runTest:222->testitMNG3642:70
» Verification
  MavenITmng3652UserAgentHeaderTest>AbstractMavenIntegrationTestCase.runTest:222->testmng3652_AdditionnalHttpHeaderConfiguredInSettings:309
» Verification
  MavenITmng3652UserAgentHeaderTest>AbstractMavenIntegrationTestCase.runTest:222->testmng3652_ConfigurationInSettingsWithoutUserAgent:215
» Verification
  MavenITmng3652UserAgentHeaderTest>AbstractMavenIntegrationTestCase.runTest:222->testmng3652_UnConfiguredDAV:163
» Verification
  MavenITmng3652UserAgentHeaderTest>AbstractMavenIntegrationTestCase.runTest:222->testmng3652_UnConfiguredHttp:113
» Verification
  MavenITmng3652UserAgentHeaderTest>AbstractMavenIntegrationTestCase.runTest:222->testmng3652_UserAgentConfiguredInSettings:273
» Verification
  MavenITmng3671PluginLevelDepInterpolationTest>AbstractMavenIntegrationTestCase.runTest:222->testitMNG3671:55
» Verification
  MavenITmng3680InvalidDependencyPOMTest>AbstractMavenIntegrationTestCase.runTest:222->testitMNG3680:57
» Verification
  MavenITmng3684BuildPluginParameterTest>AbstractMavenIntegrationTestCase.runTest:222->testitMNG3684:50
» Verification
  MavenITmng3693PomFileBasedirChangeTest>AbstractMavenIntegrationTestCase.runTest:222->testitMNG3693:54
» Verification
  MavenITmng3694ReactorProjectsDynamismTest>AbstractMavenIntegrationTestCase.runTest:222->testitMNG3694:52
» Verification
  MavenITmng3703ExecutionProjectWithRelativePathsTest>AbstractMavenIntegrationTestCase.runTest:222->testForkFromMojo:53
» Verification
  MavenITmng3703ExecutionProjectWithRelativePathsTest>AbstractMavenIntegrationTestCase.runTest:222->testForkFromReport:78
» Verification
  MavenITmng3710PollutedClonedPluginsTest>AbstractMavenIntegrationTestCase.runTest:222->testitMNG3710_OriginalModel:85
» Verification
  MavenITmng3710PollutedClonedPluginsTest>AbstractMavenIntegrationTestCase.runTest:222->testitMNG3710_POMInheritance:53
» Verification
  MavenITmng3716AggregatorForkingTest>AbstractMavenIntegrationTestCase.runTest:222->testitMNG3716:54
» Verification
  MavenITmng3723ConcreteParentProjectTest>AbstractMavenIntegrationTestCase.runTest:222->testitMNG3723:60
» Verification
  MavenITmng3724ExecutionProjectSyncTest>AbstractMavenIntegrationTestCase.runTest:222->testitMNG3724:55
» Verification
  MavenITmng3729MultiForkAggregatorsTest>AbstractMavenIntegrationTestCase.runTest:222->testitMNG3729:69
» Verification
  MavenITmng3740SelfReferentialReactorProjectsTest>AbstractMavenIntegrationTestCase.runTest:222->testitMNG3740:56
» Verification
  MavenITmng3746POMPropertyOverrideTest>AbstractMavenIntegrationTestCase.runTest:222->testitMNG3746_UsingCLIProperty:79
» Verification
  MavenITmng3746POMPropertyOverrideTest>AbstractMavenIntegrationTestCase.runTest:222->testitMNG3746_UsingDefaultSystemProperty:55
» Verification
  MavenITmng3769ExclusionRelocatedTransdepsTest>AbstractMavenIntegrationTestCase.runTest:222->testitMNG3769:59
» Verification
  MavenITmng3805ExtensionClassPathOrderingTest>AbstractMavenIntegrationTestCase.runTest:222->testitMNG3805:58
» Verification
  MavenITmng3892ReleaseDeploymentTest>AbstractMavenIntegrationTestCase.runTest:222->testitMNG3892:56
» Verification
  MavenITmng3953AuthenticatedDeploymentTest>AbstractMavenIntegrationTestCase.runTest:222->testitRelease:136->testitMNG3953:158
» Verification
  MavenITmng3953AuthenticatedDeploymentTest>AbstractMavenIntegrationTestCase.runTest:222->testitSnapshot:145->testitMNG3953:158
» Verification
  MavenITmng4026ReactorDependenciesOrderTest>AbstractMavenIntegrationTestCase.runTest:222->testitMNG4026:56
» Verification
  MavenITmng4034ManagedProfileDependencyTest>AbstractMavenIntegrationTestCase.runTest:222->testitMNG4034:57
» Verification
  MavenITmng4048VersionRangeReactorResolutionTest>AbstractMavenIntegrationTestCase.runTest:222->testit:54
» Verification
  MavenITmng4056ClassifierBasedDepResolutionFromReactorTest>AbstractMavenIntegrationTestCase.runTest:222->testit:55
» Verification
  MavenITmng4070WhitespaceTrimmingTest>AbstractMavenIntegrationTestCase.runTest:222->testit:58
» Verification
  MavenITmng4087PercentEncodedFileUrlTest>AbstractMavenIntegrationTestCase.runTest:222->testit:54
» Verification
  MavenITmng4150VersionRangeTest>AbstractMavenIntegrationTestCase.runTest:222->testitMNG4150:57
» Verification
  MavenITmng4180PerDependencyExclusionsTest>AbstractMavenIntegrationTestCase.runTest:222->testit:59
» Verification
  MavenITmng4190MirrorRepoMergingTest>AbstractMavenIntegrationTestCase.runTest:222->testit:61
» Verification
  MavenITmng4199CompileMeetsRuntimeScopeTest>AbstractMavenIntegrationTestCase.runTest:222->testit:67
» Verification
  MavenITmng4203TransitiveDependencyExclusionTest>AbstractMavenIntegrationTestCase.runTest:222->testit:58
» Verification
  MavenITmng4207PluginWithLog4JTest>AbstractMavenIntegrationTestCase.runTest:222->testit:54
» Verification
  MavenITmng4233ReactorResolutionForManuallyCreatedArtifactTest>AbstractMavenIntegrationTestCase.runTest:222->testit:55
» Verification
  MavenITmng4235HttpAuthDeploymentChecksumsTest>AbstractMavenIntegrationTestCase.runTest:222->testit:140
» Verification
  MavenITmng4238ArtifactHandlerExtensionUsageTest>AbstractMavenIntegrationTestCase.runTest:222->testProjectPackagingUsage:57
» Verification
  MavenITmng4270ArtifactHandlersFromPluginDepsTest>AbstractMavenIntegrationTestCase.runTest:222->testProjectPackagingUsage:59
» Verification
  MavenITmng4281PreferLocalSnapshotTest>AbstractMavenIntegrationTestCase.runTest:222->testit:55
» Verification
  MavenITmng4304ProjectDependencyArtifactsTest>AbstractMavenIntegrationTestCase.runTest:222->testit:54
» Verification
  MavenITmng4314DirectInvocationOfAggregatorTest>AbstractMavenIntegrationTestCase.runTest:222->testit:56
» Verification
  MavenITmng4326LocalSnapshotSuppressesRemoteCheckTest>AbstractMavenIntegrationTestCase.runTest:222->testit:67
» Verification
  MavenITmng4331DependencyCollectionTest>AbstractMavenIntegrationTestCase.runTest:222->testitCliAggregator:81
» Verification
  MavenITmng4331DependencyCollectionTest>AbstractMavenIntegrationTestCase.runTest:222->testitEarlyLifecyclePhase:57
» Verification
  MavenITmng4359LocallyReachableParentOutsideOfReactorTest>AbstractMavenIntegrationTestCase.runTest:222->testit:56
» Verification
  MavenITmng4360WebDavSupportTest>AbstractMavenIntegrationTestCase.runTest:222->testitJackrabbitBasedImpl:62->test:133
» Verification
  MavenITmng4360WebDavSupportTest>AbstractMavenIntegrationTestCase.runTest:222->testitSlideBasedImpl:72->test:133
» Verification
  MavenITmng4363DynamicAdditionOfDependencyArtifactTest>AbstractMavenIntegrationTestCase.runTest:222->testit:58
» Verification
  MavenITmng4368TimestampAwareArtifactInstallerTest>AbstractMavenIntegrationTestCase.runTest:222->testitJarPackaging:114
» Verification
  MavenITmng4368TimestampAwareArtifactInstallerTest>AbstractMavenIntegrationTestCase.runTest:222->testitPomPackaging:62
» Verification
  MavenITmng4403LenientDependencyPomParsingTest>AbstractMavenIntegrationTestCase.runTest:222->testit:60
» Verification
  MavenITmng4412OfflineModeInPluginTest>AbstractMavenIntegrationTestCase.runTest:222->testitCollector:95
» Verification
  MavenITmng4413MirroringOfDependencyRepoTest>AbstractMavenIntegrationTestCase.runTest:222->testit:100
» Verification
  MavenITmng4450StubModelForMissingDependencyPomTest>AbstractMavenIntegrationTestCase.runTest:222->testit:56
» Verification
  MavenITmng4452ResolutionOfSnapshotWithClassifierTest>AbstractMavenIntegrationTestCase.runTest:222->testit:60
» Verification
  MavenITmng4461ArtifactUploadMonitorTest>AbstractMavenIntegrationTestCase.runTest:222->testit:52
» Verification
  MavenITmng4469AuthenticatedDeploymentToCustomRepoTest>AbstractMavenIntegrationTestCase.runTest:222->testit:148
» Verification
  MavenITmng4470AuthenticatedDeploymentToProxyTest>AbstractMavenIntegrationTestCase.runTest:222->testitRelease:186->testit:212
» Verification
  MavenITmng4470AuthenticatedDeploymentToProxyTest>AbstractMavenIntegrationTestCase.runTest:222->testitSnapshot:195->testit:212
» Verification
  MavenITmng4474PerLookupWagonInstantiationTest>AbstractMavenIntegrationTestCase.runTest:222->testit:53
» Verification
  MavenITmng4526MavenProjectArtifactsScopeTest>AbstractMavenIntegrationTestCase.runTest:222->testit:58
» Verification
  MavenITmng4528ExcludeWagonsFromMavenCoreArtifactsTest>AbstractMavenIntegrationTestCase.runTest:222->testit:57
» Verification
  MavenITmng4654ArtifactHandlerForMainArtifactTest>AbstractMavenIntegrationTestCase.runTest:222->testit:57
» Verification
  MavenITmng4679SnapshotUpdateInPluginTest>AbstractMavenIntegrationTestCase.runTest:222->testit:62
» Verification
  MavenITmng4729MirrorProxyAuthUsedByProjectBuilderTest>AbstractMavenIntegrationTestCase.runTest:222->testit:100
» Verification
  MavenITmng4755FetchRemoteMetadataForVersionRangeTest>AbstractMavenIntegrationTestCase.runTest:222->testit:56
» Verification
  MavenITmng4765LocalPomProjectBuilderTest>AbstractMavenIntegrationTestCase.runTest:222->testit:54
» Verification
  MavenITmng4779MultipleDepsWithVersionRangeFromLocalRepoTest>AbstractMavenIntegrationTestCase.runTest:222->testit:55
» Verification
  MavenITmng4781DeploymentToNexusStagingRepoTest>AbstractMavenIntegrationTestCase.runTest:222->testit:136
» Verification
  MavenITmng4785TransitiveResolutionInForkedThreadTest>AbstractMavenIntegrationTestCase.runTest:222->testit:58
» Verification
  MavenITmng4786AntBased21xMojoSupportTest>AbstractMavenIntegrationTestCase.runTest:222->testit:55
» Verification
  MavenITmng4788InstallationToCustomLocalRepoTest>AbstractMavenIntegrationTestCase.runTest:222->testit:52
» Verification
  MavenITmng4791ProjectBuilderResolvesRemotePomArtifactTest>AbstractMavenIntegrationTestCase.runTest:222->testit:58
» Verification
  MavenITmng4814ReResolutionOfDependenciesDuringReactorTest>AbstractMavenIntegrationTestCase.runTest:222->testit:62
» Verification
  MavenITmng4842ParentResolutionOfDependencyPomTest>AbstractMavenIntegrationTestCase.runTest:222->testitPlugin:86
» Verification
  MavenITmng4872ReactorResolutionAttachedWithExclusionsTest>AbstractMavenIntegrationTestCase.runTest:222->testit:54
» Verification
  MavenITmng4874UpdateLatestPluginVersionTest>AbstractMavenIntegrationTestCase.runTest:222->testit:53
» Verification
  MavenITmng4877DeployUsingPrivateKeyTest>AbstractMavenIntegrationTestCase.runTest:222->testit:55
» Verification
  MavenITmng4891RobustSnapshotResolutionTest>AbstractMavenIntegrationTestCase.runTest:222->testit:55
» Verification
  MavenITmng4952MetadataReleaseInfoUpdateTest>AbstractMavenIntegrationTestCase.runTest:222->testit:60
» Verification
  MavenITmng4955LocalVsRemoteSnapshotResolutionTest>AbstractMavenIntegrationTestCase.runTest:222->testit:55
» Verification
  MavenITmng4973ExtensionVisibleToPluginInReactorTest>AbstractMavenIntegrationTestCase.runTest:222->testit:59
» Verification
  MavenITmng5135AggregatorDepResolutionModuleExtensionTest>AbstractMavenIntegrationTestCase.runTest:222->testit:57
» Verification
  MavenITmng5137ReactorResolutionInForkedBuildTest>AbstractMavenIntegrationTestCase.runTest:222->testit:58
» Verification
  MavenITmng5214DontMapWsdlToJar>AbstractMavenIntegrationTestCase.runTest:222->testitTestPhase:52
» Verification
  MavenITmng5382Jsr330Plugin>AbstractMavenIntegrationTestCase.runTest:222->testJsr330PluginExecution:68
» Verification
  MavenITmng5387ArtifactReplacementPlugin>AbstractMavenIntegrationTestCase.runTest:222->testArtifactReplacementExecution:61
» Verification
  MavenITmng5389LifecycleParticipantAfterSessionEnd>AbstractMavenIntegrationTestCase.runTest:222->test:46
» Verification
  MavenITmng5530MojoExecutionScopeTest>AbstractMavenIntegrationTestCase.runTest:222->testExtension:99
» Verification
  MavenITmng5530MojoExecutionScopeTest>AbstractMavenIntegrationTestCase.runTest:222->test_copyfiles:45
» Verification
  MavenITmng5530MojoExecutionScopeTest>AbstractMavenIntegrationTestCase.runTest:222->test_copyfiles_multithreaded:71
» Verification
  MavenITmng5572ReactorPluginExtensionsTest>AbstractMavenIntegrationTestCase.runTest:222->testit:55
» Verification
  MavenITmng5578SessionScopeTest>AbstractMavenIntegrationTestCase.runTest:222->testBasic:45
» Verification
  MavenITmng5578SessionScopeTest>AbstractMavenIntegrationTestCase.runTest:222->testBasic_buildExtension:92
» Verification
  MavenITmng5578SessionScopeTest>AbstractMavenIntegrationTestCase.runTest:222->testBasic_multithreaded:68
» Verification
  MavenITmng5578SessionScopeTest>AbstractMavenIntegrationTestCase.runTest:222->testExtension:116
» Verification
  MavenITmng5581LifecycleMappingDelegate>AbstractMavenIntegrationTestCase.runTest:222->testCustomLifecycle:54
» Verification
  MavenITmng5591WorkspaceReader>AbstractMavenIntegrationTestCase.runTest:222->testWorkspaceReader:53
» Verification
  MavenITmng5639ImportScopePomResolutionTest>AbstractMavenIntegrationTestCase.runTest:222->testitMNG5639:51
» Verification
  MavenITmng5640LifecycleParticipantAfterSessionEnd>AbstractMavenIntegrationTestCase.runTest:222->testBuildError:131
» Verification
  MavenITmng5640LifecycleParticipantAfterSessionEnd>AbstractMavenIntegrationTestCase.runTest:222->testBuildErrorRt:176
» Verification
  MavenITmng5640LifecycleParticipantAfterSessionEnd>AbstractMavenIntegrationTestCase.runTest:222->testBuildFailureMissingDependency:92
» Verification
  MavenITmng5640LifecycleParticipantAfterSessionEnd>AbstractMavenIntegrationTestCase.runTest:222->testBuildFailureUTFail:53
» Verification
  MavenITmng5663NestedImportScopePomResolutionTest>AbstractMavenIntegrationTestCase.runTest:222->testitMNG5639:57
» Verification
  MavenITmng5742BuildExtensionClassloaderTest>AbstractMavenIntegrationTestCase.runTest:222->testBuildExtensionClassloader:47
» Verification
  MavenITmng5753CustomMojoExecutionConfiguratorTest>AbstractMavenIntegrationTestCase.runTest:222->testCustomMojoExecutionConfigurator:47
» Verification
  MavenITmng5783PluginDependencyFiltering>AbstractMavenIntegrationTestCase.runTest:222->testSLF4j:22
» Verification
  MavenITmng5840ParentVersionRanges>AbstractMavenIntegrationTestCase.runTest:222->testParentRangeRelativePathPointsToCorrectVersion:37
» Verification
  MavenITmng5840ParentVersionRanges>AbstractMavenIntegrationTestCase.runTest:222->testParentRangeRelativePathPointsToWrongVersion:21
» Verification
  MavenITmng5840RelativePathReactorMatching>AbstractMavenIntegrationTestCase.runTest:222->testRelativePathPointsToWrongVersion:21
» Verification
  MavenITmng5895CIFriendlyUsageWithPropertyTest>AbstractMavenIntegrationTestCase.runTest:222->testitShouldResolveTheDependencies:64
» Verification
  MavenITmng5898BuildMultimoduleWithEARFailsToResolveWARTest>AbstractMavenIntegrationTestCase.runTest:222->testit:51
» Verification
  MavenITmng5935OptionalLostInTranstiveManagedDependenciesTest>AbstractMavenIntegrationTestCase.runTest:222->testitMNG5935:48
» Verification
  MavenITmng6084Jsr250PluginTest>AbstractMavenIntegrationTestCase.runTest:222->testJsr250PluginExecution:66
» Verification
  MavenITmng6090CIFriendlyTest>AbstractMavenIntegrationTestCase.runTest:222->testitShouldResolveTheDependencies:64
» Verification
  MavenITmng6127PluginExecutionConfigurationInterferenceTest>AbstractMavenIntegrationTestCase.runTest:222->testCustomMojoExecutionConfigurator:52
» Verification
  MavenITmng6209MultipleBuildExtensions>AbstractMavenIntegrationTestCase.runTest:222->testBuildExtensionClassloader:40
» Verification
  MavenITmng6240PluginExtensionAetherProvider>AbstractMavenIntegrationTestCase.runTest:222->testPluginExtensionDependingOnMavenAetherProvider:59
» Verification

Tests run: 804, Failures: 10, Errors: 186, Skipped: 0

[INFO] ------------------------------------------------------------------------
[INFO] Reactor Summary:
[INFO] 
[INFO] Maven Core ITs .................................... SUCCESS [19.226s]
[INFO] Maven IT Support .................................. SUCCESS [1.423s]
[INFO] Maven IT :: Plugins ............................... SUCCESS [1.041s]
[INFO] Maven IT Plugin :: Active Collection .............. SUCCESS [6.215s]
[INFO] Maven IT Plugin :: Ant-Based ...................... SUCCESS [2.552s]
[INFO] Maven IT Plugin :: Artifact ....................... SUCCESS [2.680s]
[INFO] Maven IT Plugin :: Class Loader :: Dependency A ... SUCCESS [0.893s]
[INFO] Maven IT Plugin :: Class Loader :: Dependency B ... SUCCESS [0.889s]
[INFO] Maven IT Plugin :: Class Loader :: Dependency C ... SUCCESS [0.779s]
[INFO] Maven IT Plugin :: Class Loader ................... SUCCESS [2.215s]
[INFO] Maven IT Plugin :: Class Loader :: Aggregator ..... SUCCESS [0.776s]
[INFO] Maven IT Plugin :: Configuration .................. SUCCESS [1.617s]
[INFO] Maven IT Plugin :: Context Passing ................ SUCCESS [0.904s]
[INFO] Maven ITs :: Core Plugin Stubs .................... SUCCESS [0.764s]
[INFO] Maven IT Clean Plugin Stub ........................ SUCCESS [1.112s]
[INFO] Maven IT Compiler Plugin Stub ..................... SUCCESS [1.193s]
[INFO] Maven IT Deploy Plugin Stub ....................... SUCCESS [1.074s]
[INFO] Maven IT EAR Plugin Stub .......................... SUCCESS [1.104s]
[INFO] Maven IT EJB Plugin Stub .......................... SUCCESS [1.042s]
[INFO] Maven IT Install Plugin Stub ...................... SUCCESS [1.051s]
[INFO] Maven IT JAR Plugin Stub .......................... SUCCESS [1.060s]
[INFO] Maven IT Javadoc Plugin Stub ...................... SUCCESS [1.049s]
[INFO] Maven IT Plugin Plugin Stub ....................... SUCCESS [1.086s]
[INFO] Maven IT RAR Plugin Stub .......................... SUCCESS [1.013s]
[INFO] Maven IT Resources Plugin Stub .................... SUCCESS [1.091s]
[INFO] Maven IT Site Plugin Stub ......................... SUCCESS [1.085s]
[INFO] Maven IT Source Plugin Stub ....................... SUCCESS [1.022s]
[INFO] Maven IT Surefire Plugin Stub ..................... SUCCESS [0.989s]
[INFO] Maven IT WAR Plugin Stub .......................... SUCCESS [1.075s]
[INFO] Maven IT Plugin :: Dependency Collection .......... SUCCESS [1.106s]
[INFO] Maven IT Plugin :: Dependency Resolution .......... SUCCESS [3.512s]
[INFO] Maven IT Plugin :: Expression ..................... SUCCESS [1.440s]
[INFO] Maven IT Plugin :: Error Mojos .................... SUCCESS [1.482s]
[INFO] Maven IT Component ................................ SUCCESS [0.771s]
[INFO] Maven IT Plugin :: Extension Consumer ............. SUCCESS [0.828s]
[INFO] Maven IT Plugin :: Extension Provider ............. SUCCESS [0.837s]
[INFO] Maven IT Plugin :: Fork ........................... SUCCESS [1.045s]
[INFO] Maven IT Plugin :: Invalid Descriptor ............. SUCCESS [0.844s]
[INFO] Maven IT Plugin :: Log File ....................... SUCCESS [0.838s]
[INFO] Maven IT Helper Library ........................... SUCCESS [1.510s]
[INFO] Maven IT Plugin :: Model Interpolation ............ SUCCESS [1.273s]
[INFO] Maven IT Plugin :: No Default Component ........... SUCCESS [0.813s]
[INFO] Maven IT Plugin :: No Project ..................... SUCCESS [0.796s]
[INFO] Maven IT Plugin :: Online ......................... SUCCESS [0.770s]
[INFO] Maven IT Plugin :: Optional Mojos ................. SUCCESS [0.811s]
[INFO] Maven IT Plugin :: Packaging ...................... SUCCESS [0.825s]
[INFO] Maven IT Plugin :: Parameter Implementation ....... SUCCESS [0.805s]
[INFO] Maven IT Plugin :: Plugin Dependency .............. SUCCESS [0.803s]
[INFO] Maven IT Plugin :: Project ........................ SUCCESS [1.076s]
[INFO] Maven IT Plugin :: Project Interpolation .......... SUCCESS [1.062s]
[INFO] Maven IT Plugin :: Setter ......................... SUCCESS [0.796s]
[INFO] Maven IT Plugin :: Singleton Component ............ SUCCESS [0.812s]
[INFO] Maven IT Plugin :: Site ........................... SUCCESS [2.155s]
[INFO] Maven IT Plugin :: Toolchain ...................... SUCCESS [2.762s]
[INFO] Maven IT Plugin :: Touch .......................... SUCCESS [1.098s]
[INFO] Maven IT Plugin :: Uses Properties Plugin ......... SUCCESS [0.764s]
[INFO] Maven IT Plugin :: Uses Wagon Plugin .............. SUCCESS [1.549s]
[INFO] Maven IT Plugin :: This plugin should contain the mojos needed by all tests.  SUCCESS
[0.779s]
[INFO] Maven IT Plugin :: Plexus Utils 1.1 ............... SUCCESS [0.850s]
[INFO] Maven IT Plugin :: Plexus Utils New ............... SUCCESS [0.887s]
[INFO] Maven IT Plugin :: Plexus Component API ........... SUCCESS [1.180s]
[INFO] Maven IT Plugin :: Log4J Client ................... SUCCESS [0.895s]
[INFO] Maven IT Plugin :: Extension 1 .................... SUCCESS [0.755s]
[INFO] Maven IT Plugin :: Extension 2 .................... SUCCESS [0.739s]
[INFO] Maven IT Plugin :: Plexus Lifecycle ............... SUCCESS [1.318s]
[INFO] Maven IT Plugin :: Settings ....................... SUCCESS [0.912s]
[INFO] Maven IT Plugin :: mng-5805 extension ............. SUCCESS [0.699s]
[INFO] Maven IT Plugin :: mng-5805 extension mk2 ......... SUCCESS [0.700s]
[INFO] Maven IT Plugin :: mng-5805 plugin ................ SUCCESS [0.912s]
[INFO] Maven IT Plugin :: mng-5805 plugin-dep ............ SUCCESS [0.719s]
[INFO] Maven IT Plugin :: mng-5958 extension ............. SUCCESS [2.475s]
[INFO] Maven IT Toolchain ................................ SUCCESS [1.252s]
[INFO] Maven IT Wagon .................................... SUCCESS [1.003s]
[INFO] Maven IT Support Artifacts ........................ SUCCESS [1.238s]
[INFO] Maven IT Extension ................................ SUCCESS [0.691s]
[INFO] Maven ITs ......................................... FAILURE [9:14.877s]
[INFO] ------------------------------------------------------------------------
[INFO] BUILD FAILURE
[INFO] ------------------------------------------------------------------------
[INFO] Total time: 11:07.732s
[INFO] Finished at: Thu Aug 24 09:52:29 UTC 2017
[INFO] Final Memory: 71M/736M
[INFO] ------------------------------------------------------------------------
[ERROR] Failed to execute goal org.apache.maven.plugins:maven-surefire-plugin:2.18.1:test
(default-test) on project core-it-suite: There are test failures.
[ERROR] 
[ERROR] Please refer to <https://builds.apache.org/job/core-integration-testing-maven-3-embedded/ws/core-integration-testing-trunk/core-it-suite/target/surefire-reports>
for the individual test results.
[ERROR] -> [Help 1]
[ERROR] 
[ERROR] To see the full stack trace of the errors, re-run Maven with the -e switch.
[ERROR] Re-run Maven using the -X switch to enable full debug logging.
[ERROR] 
[ERROR] For more information about the errors and possible solutions, please read the following
articles:
[ERROR] [Help 1] http://cwiki.apache.org/confluence/display/MAVEN/MojoFailureException
[ERROR] 
[ERROR] After correcting the problems, you can resume the build with the command
[ERROR]   mvn <goals> -rf :core-it-suite
Build step 'Invoke top-level Maven targets' marked build as failure
Recording test results

Mime
View raw message