maven-notifications mailing list archives

Site index · List index
Message view « Date » · « Thread »
Top « Date » · « Thread »
From Apache Jenkins Server <jenk...@builds.apache.org>
Subject Build failed in Jenkins: dist-tool-plugin #1878
Date Fri, 18 Aug 2017 09:55:45 GMT
See <https://builds.apache.org/job/dist-tool-plugin/1878/display/redirect>

------------------------------------------
[...truncated 29.54 KB...]
[INFO] Generating "Mailing Lists" report        --- maven-project-info-reports-plugin:2.9:mailing-list
[INFO] Generating "Dependency Management" report --- maven-project-info-reports-plugin:2.9:dependency-management
[INFO] Generating "Dependencies" report         --- maven-project-info-reports-plugin:2.9:dependencies
[INFO] Generating "Dependency Convergence" report --- maven-project-info-reports-plugin:2.9:dependency-convergence
[INFO] Generating "CI Management" report        --- maven-project-info-reports-plugin:2.9:cim
[INFO] Generating "Plugin Management" report    --- maven-project-info-reports-plugin:2.9:plugin-management
[INFO] Generating "Plugins" report              --- maven-project-info-reports-plugin:2.9:plugins
[INFO] Generating "Distribution Management" report --- maven-project-info-reports-plugin:2.9:distribution-management
[INFO] Generating "Surefire Report" report      --- maven-surefire-report-plugin:2.19.1:report
[INFO] Generating "Checkstyle" report           --- maven-checkstyle-plugin:2.15:checkstyle
[INFO] Generating "PMD" report                  --- maven-pmd-plugin:3.6:pmd
[INFO] Generating "Source Xref" report          --- maven-jxr-plugin:2.5:jxr
[INFO] Generating "Test Source Xref" report     --- maven-jxr-plugin:2.5:test-jxr
[INFO] Generating "Tag List" report             --- taglist-maven-plugin:2.4:taglist
[INFO] Generating "JavaDocs" report             --- maven-javadoc-plugin:2.10.3:javadoc
[ERROR] Error fetching link: http://xml.apache.org/commons/components/external/apidocs/package-list.
Ignored it.
[ERROR] Error fetching link: http://selenium.googlecode.com/selenium-firefox-driver/apidocs/package-list.
Ignored it.
[ERROR] Error fetching link: http://junit.org/apidocs/package-list. Ignored it.
[ERROR] Error fetching link: http://hc.apache.org/httpcomponents-client/apidocs/package-list.
Ignored it.
[INFO] 
5 warnings
[WARNING] Javadoc Warnings
[WARNING] <https://builds.apache.org/job/dist-tool-plugin/ws/src/main/java/org/apache/maven/dist/tools/AbstractDistCheckMojo.java>:106:
warning: no @return
[WARNING] protected abstract boolean isIndexPageCheck();
[WARNING] ^
[WARNING] <https://builds.apache.org/job/dist-tool-plugin/ws/src/main/java/org/apache/maven/dist/tools/AbstractDistCheckMojo.java>:394:
warning: no description for @param
[WARNING] * @param cli
[WARNING] ^
[WARNING] <https://builds.apache.org/job/dist-tool-plugin/ws/src/main/java/org/apache/maven/dist/tools/AbstractDistCheckMojo.java>:395:
warning: no description for @param
[WARNING] * @param version
[WARNING] ^
[WARNING] <https://builds.apache.org/job/dist-tool-plugin/ws/src/main/java/org/apache/maven/dist/tools/AbstractDistCheckMojo.java>:396:
warning: no description for @param
[WARNING] * @param ignore
[WARNING] ^
[WARNING] <https://builds.apache.org/job/dist-tool-plugin/ws/src/main/java/org/apache/maven/dist/tools/AbstractDistCheckMojo.java>:397:
warning: no description for @param
[WARNING] * @param message
[WARNING] ^
[INFO] Generating "Test JavaDocs" report        --- maven-javadoc-plugin:2.10.3:test-javadoc
[ERROR] Error fetching link: http://xml.apache.org/commons/components/external/apidocs/package-list.
Ignored it.
[ERROR] Error fetching link: http://selenium.googlecode.com/selenium-firefox-driver/apidocs/package-list.
Ignored it.
[ERROR] Error fetching link: http://junit.org/apidocs/package-list. Ignored it.
[ERROR] Error fetching link: http://hc.apache.org/httpcomponents-client/apidocs/package-list.
Ignored it.
[INFO] Generating "FindBugs" report             --- findbugs-maven-plugin:3.0.3:findbugs
[INFO] Generating "Sonar" report                --- maven-report:0.1:report
[INFO] Generating "Dist Tool> Check Sites" report --- dist-tool-plugin:1.0-SNAPSHOT:check-site
[INFO] > dist-area = http://www.apache.org/dist/maven/
[INFO] /archetype: org.apache.maven.archetype
[INFO]   maven-archetype
[INFO] /binaries: content.not.checked
[INFO] /doxia: org.apache.maven.doxia
[INFO]   doxia
[INFO]   doxia-converter
[INFO]   doxia-linkcheck
[INFO]   doxia-sitetools
IOException try 1 while reading https://maven.apache.org/doxia/doxia-sitetools/: class java.net.SocketTimeoutException
Read timed out
IOException try 2 while reading https://maven.apache.org/doxia/doxia-sitetools/: class java.net.SocketTimeoutException
Read timed out
IOException try 3 while reading https://maven.apache.org/doxia/doxia-sitetools/: class java.net.SocketTimeoutException
Read timed out
[ERROR] IOException while reading https://maven.apache.org/doxia/doxia-sitetools/doxia-sitetools
[INFO] /enforcer: org.apache.maven.enforcer
[INFO]   enforcer
[INFO] /indexer: org.apache.maven.indexer
[INFO]   maven-indexer
[INFO] /maven-3: org.apache.maven src+bin
[INFO]   apache-maven [3.0,3.1.0-alpha-1)
[INFO]   apache-maven [3.1.0,3.2.0-alpha-1)
[INFO]   apache-maven
IOException try 1 while reading https://maven.apache.org/ref/3.5.0/apache-maven/: class java.net.SocketTimeoutException
Read timed out
IOException try 2 while reading https://maven.apache.org/ref/3.5.0/apache-maven/: class java.net.SocketTimeoutException
connect timed out
[INFO] /jxr: org.apache.maven.jxr
[INFO]   jxr
[INFO] /plugin-testing: org.apache.maven.plugin-testing
[INFO]   maven-plugin-testing
[INFO] /plugin-tools: org.apache.maven.plugin-tools
[INFO]   maven-plugin-tools
[INFO] /plugins: org.apache.maven.plugins http://maven.apache.org/plugins/
[INFO]   maven-acr-plugin
[INFO]   maven-ant-plugin
[INFO]   maven-antrun-plugin
[INFO]   * maven-archetype-plugin
[INFO]   maven-assembly-plugin
[INFO]   maven-changelog-plugin
[INFO]   maven-changes-plugin
[INFO]   maven-checkstyle-plugin
[INFO]   maven-clean-plugin
[INFO]   maven-compiler-plugin
[INFO]   maven-dependency-plugin
[INFO]   maven-deploy-plugin
[INFO]   maven-doap-plugin
[INFO]   maven-docck-plugin
[INFO]   maven-ear-plugin
[INFO]   maven-ejb-plugin
[INFO] Downloading: https://repo.maven.apache.org/maven2/org/apache/maven/plugins/maven-ejb-plugin/3.0.0/maven-ejb-plugin-3.0.0.pom
[INFO] Downloaded: https://repo.maven.apache.org/maven2/org/apache/maven/plugins/maven-ejb-plugin/3.0.0/maven-ejb-plugin-3.0.0.pom
(7 KB at 37.0 KB/sec)
[INFO]   * maven-enforcer-plugin 
[INFO]   * maven-failsafe-plugin
[INFO]   maven-gpg-plugin
[INFO]   maven-help-plugin
[INFO]   maven-install-plugin
[INFO]   maven-invoker-plugin
[INFO]   maven-jar-plugin
[INFO]   maven-jarsigner-plugin
[INFO]   maven-javadoc-plugin
[INFO]   maven-jdeps-plugin
[INFO]   * maven-jxr-plugin 
[INFO]   maven-linkcheck-plugin
[INFO]   maven-patch-plugin
[INFO]   maven-pdf-plugin
[INFO]   * maven-plugin-plugin
[INFO]   maven-pmd-plugin
[INFO]   maven-project-info-reports-plugin
[INFO]   maven-rar-plugin
[INFO]   * maven-release-plugin  
[INFO]   maven-remote-resources-plugin
[INFO]   maven-repository-plugin
[INFO]   maven-resources-plugin
[INFO]   * maven-scm-plugin
[INFO]   maven-scm-publish-plugin
[INFO]   maven-shade-plugin
[INFO]   maven-site-plugin
[INFO]   maven-source-plugin
[INFO]   maven-stage-plugin
[INFO]   * maven-surefire-plugin
[INFO]   * maven-surefire-report-plugin
[INFO]   maven-toolchains-plugin
[INFO]   maven-verifier-plugin
[INFO]   maven-war-plugin
[INFO] /pom: org.apache http://maven.apache.org/pom/
[INFO] > apache index-path = /asf/
[INFO] > apache site = http://maven.apache.org/pom/asf/
[INFO]   apache
[INFO] /pom: org.apache.maven http://maven.apache.org/pom/
[INFO] > maven-parent index-path = /maven/
[INFO] > maven-parent site = http://maven.apache.org/pom/maven/
[INFO]   maven-parent
[INFO] /release: org.apache.maven.release
[INFO]   maven-release (,3) 
[INFO] /reporting: org.apache.maven.reporting http://maven.apache.org/shared/
[INFO]   maven-reporting-api
[INFO]   maven-reporting-exec
[INFO]   maven-reporting-impl
[INFO] /resolver: org.apache.maven.resolver
[INFO]   maven-resolver
[INFO] /resources: org.apache.apache.resources
[INFO] > apache-source-release-assembly-descriptor site = http://maven.apache.org/apache-resource-bundles/
[INFO]   apache-source-release-assembly-descriptor
[INFO] /resources: org.apache
[INFO] > apache-incubator-disclaimer-resource-bundle site = http://maven.apache.org/apache-resource-bundles/
[INFO]   apache-incubator-disclaimer-resource-bundle (,1.1]
[INFO] > apache-jar-resource-bundle site = http://maven.apache.org/apache-resource-bundles/
[INFO]   apache-jar-resource-bundle (,1.4]
[INFO] > apache-license-header-resource-bundle site = http://maven.apache.org/apache-resource-bundles/
[INFO]   apache-license-header-resource-bundle (,1.1]
[INFO] /scm: org.apache.maven.scm
[INFO]   maven-scm 
[INFO] /shared: org.apache.maven.shared http://maven.apache.org/shared/
[INFO]   file-management
[INFO]   maven-artifact-resolver
[INFO]   maven-common-artifact-filters
[INFO]   maven-dependency-analyzer
[INFO]   maven-dependency-tree
[INFO]   maven-filtering
[INFO]   maven-invoker
[INFO]   maven-jarsigner
[INFO]   maven-mapping
[INFO]   maven-repository-builder
[INFO]   maven-runtime
[INFO]   maven-script-interpreter
[INFO]   maven-shared-incremental
[INFO]   maven-shared-jar
[INFO]   maven-shared-resources
[INFO]   maven-shared-utils
[INFO]   maven-shared-io
[INFO]   maven-verifier
[INFO] /shared: org.apache.maven http://maven.apache.org/shared/
[INFO]   maven-archiver
[INFO] > maven-skins index-path = /skins/
[INFO] /skins: org.apache.maven.skins http://maven.apache.org/skins/
[INFO]   maven-default-skin
[INFO]   maven-fluido-skin
[INFO] /surefire: org.apache.maven.surefire
[INFO]   surefire
[INFO] /wagon: org.apache.maven.wagon
[INFO]   wagon
[INFO] 
[JENKINS] Archiving site from <https://builds.apache.org/job/dist-tool-plugin/ws/target/site>
to /x1/jenkins/jenkins-home/jobs/dist-tool-plugin/site
[INFO] ------------------------------------------------------------------------
[INFO] BUILD FAILURE
[INFO] ------------------------------------------------------------------------
[INFO] Total time: 04:21 min
[INFO] Finished at: 2017-08-18T09:55:43+00:00
[INFO] Final Memory: 90M/879M
[INFO] ------------------------------------------------------------------------
[WARNING] The requested profile "apache.snapshots" could not be activated because it does
not exist.
[ERROR] Failed to execute goal org.apache.maven.plugins:maven-site-plugin:3.5.1:site (default-site)
on project dist-tool-plugin: Execution default-site of goal org.apache.maven.plugins:maven-site-plugin:3.5.1:site
failed. NullPointerException -> [Help 1]
org.apache.maven.lifecycle.LifecycleExecutionException: Failed to execute goal org.apache.maven.plugins:maven-site-plugin:3.5.1:site
(default-site) on project dist-tool-plugin: Execution default-site of goal org.apache.maven.plugins:maven-site-plugin:3.5.1:site
failed.
	at org.apache.maven.lifecycle.internal.MojoExecutor.execute(MojoExecutor.java:212)
	at org.apache.maven.lifecycle.internal.MojoExecutor.execute(MojoExecutor.java:153)
	at org.apache.maven.lifecycle.internal.MojoExecutor.execute(MojoExecutor.java:145)
	at org.apache.maven.lifecycle.internal.LifecycleModuleBuilder.buildProject(LifecycleModuleBuilder.java:116)
	at org.apache.maven.lifecycle.internal.LifecycleModuleBuilder.buildProject(LifecycleModuleBuilder.java:80)
	at org.apache.maven.lifecycle.internal.builder.singlethreaded.SingleThreadedBuilder.build(SingleThreadedBuilder.java:51)
	at org.apache.maven.lifecycle.internal.LifecycleStarter.execute(LifecycleStarter.java:128)
	at org.apache.maven.DefaultMaven.doExecute(DefaultMaven.java:307)
	at org.apache.maven.DefaultMaven.doExecute(DefaultMaven.java:193)
	at org.apache.maven.DefaultMaven.execute(DefaultMaven.java:106)
	at org.jvnet.hudson.maven3.launcher.Maven33Launcher.main(Maven33Launcher.java:129)
	at sun.reflect.NativeMethodAccessorImpl.invoke0(Native Method)
	at sun.reflect.NativeMethodAccessorImpl.invoke(NativeMethodAccessorImpl.java:62)
	at sun.reflect.DelegatingMethodAccessorImpl.invoke(DelegatingMethodAccessorImpl.java:43)
	at java.lang.reflect.Method.invoke(Method.java:498)
	at org.codehaus.plexus.classworlds.launcher.Launcher.launchStandard(Launcher.java:330)
	at org.codehaus.plexus.classworlds.launcher.Launcher.launch(Launcher.java:238)
	at jenkins.maven3.agent.Maven33Main.launch(Maven33Main.java:176)
	at sun.reflect.NativeMethodAccessorImpl.invoke0(Native Method)
	at sun.reflect.NativeMethodAccessorImpl.invoke(NativeMethodAccessorImpl.java:62)
	at sun.reflect.DelegatingMethodAccessorImpl.invoke(DelegatingMethodAccessorImpl.java:43)
	at java.lang.reflect.Method.invoke(Method.java:498)
	at hudson.maven.Maven3Builder.call(Maven3Builder.java:139)
	at hudson.maven.Maven3Builder.call(Maven3Builder.java:70)
	at hudson.remoting.UserRequest.perform(UserRequest.java:153)
	at hudson.remoting.UserRequest.perform(UserRequest.java:50)
	at hudson.remoting.Request$2.run(Request.java:336)
	at hudson.remoting.InterceptingExecutorService$1.call(InterceptingExecutorService.java:68)
	at java.util.concurrent.FutureTask.run(FutureTask.java:266)
	at java.util.concurrent.ThreadPoolExecutor.runWorker(ThreadPoolExecutor.java:1149)
	at java.util.concurrent.ThreadPoolExecutor$Worker.run(ThreadPoolExecutor.java:624)
	at java.lang.Thread.run(Thread.java:748)
Caused by: org.apache.maven.plugin.PluginExecutionException: Execution default-site of goal
org.apache.maven.plugins:maven-site-plugin:3.5.1:site failed.
	at org.apache.maven.plugin.DefaultBuildPluginManager.executeMojo(DefaultBuildPluginManager.java:145)
	at org.apache.maven.lifecycle.internal.MojoExecutor.execute(MojoExecutor.java:207)
	... 31 more
Caused by: java.lang.NullPointerException
	at org.apache.maven.dist.tools.site.CheckSiteResult.getSkins(CheckSiteResult.java:97)
	at org.apache.maven.dist.tools.site.DistCheckSiteMojo.executeReport(DistCheckSiteMojo.java:228)
	at org.apache.maven.reporting.AbstractMavenReport.generate(AbstractMavenReport.java:255)
	at org.apache.maven.plugins.site.render.ReportDocumentRenderer.renderDocument(ReportDocumentRenderer.java:227)
	at org.apache.maven.doxia.siterenderer.DefaultSiteRenderer.render(DefaultSiteRenderer.java:329)
	at org.apache.maven.plugins.site.render.SiteMojo.renderLocale(SiteMojo.java:181)
	at org.apache.maven.plugins.site.render.SiteMojo.execute(SiteMojo.java:135)
	at org.apache.maven.plugin.DefaultBuildPluginManager.executeMojo(DefaultBuildPluginManager.java:134)
	... 32 more
[ERROR] 
[ERROR] Re-run Maven using the -X switch to enable full debug logging.
[ERROR] 
[ERROR] For more information about the errors and possible solutions, please read the following
articles:
[ERROR] [Help 1] http://cwiki.apache.org/confluence/display/MAVEN/PluginExecutionException
[JENKINS] Archiving <https://builds.apache.org/job/dist-tool-plugin/ws/pom.xml> to org.apache.maven.dist.tools/dist-tool-plugin/1.0-SNAPSHOT/dist-tool-plugin-1.0-SNAPSHOT.pom
[JENKINS] Archiving <https://builds.apache.org/job/dist-tool-plugin/ws/target/dist-tool-plugin-1.0-SNAPSHOT.jar>
to org.apache.maven.dist.tools/dist-tool-plugin/1.0-SNAPSHOT/dist-tool-plugin-1.0-SNAPSHOT.jar
channel stopped

Mime
View raw message