maven-notifications mailing list archives

Site index · List index
Message view « Date » · « Thread »
Top « Date » · « Thread »
From Apache Jenkins Server <jenk...@builds.apache.org>
Subject Build failed in Jenkins: maven-plugins-ITs-m3-windows #1931
Date Wed, 12 Jul 2017 23:39:15 GMT
See <https://builds.apache.org/job/maven-plugins-ITs-m3-windows/1931/display/redirect?page=changes>

Changes:

[Robert Scholte] [MJAVADOC-456] Upgrade to Maven3 plugin
Change package to org.apache.maven.plugins

------------------------------------------
[...truncated 3.22 MB...]
[INFO] Building: analyze-ignore-unused-declared-dependency\pom.xml
[INFO] ..SUCCESS (8.0 s)
[INFO] Building: analyze-ignore-used-undeclared-dependency\pom.xml
[INFO] ..SUCCESS (8.4 s)
[INFO] Building: analyze-multimodule-project\pom.xml
[INFO] ..SUCCESS (9.1 s)
[INFO] Building: analyze-report\pom.xml
[INFO] run script verify.bsh
[INFO] ..SUCCESS (9.0 s)
[INFO] Building: build-classpath\pom.xml
[INFO] run script verify.bsh
[INFO] ..SUCCESS (6.4 s)
[INFO] Building: build-classpath-output-file-and-property\pom.xml
[INFO] run script verify.bsh
[INFO] ..SUCCESS (8.7 s)
[INFO] Building: collect\pom.xml
[INFO] ..SUCCESS (6.4 s)
[INFO] Building: copy\pom.xml
[INFO] run script verify.bsh
[INFO] ..SUCCESS (6.4 s)
[INFO] Building: copy-and-unpack-with-alternate-local-repo\pom.xml
[INFO] run script verify.bsh
[INFO] ..SUCCESS (7.9 s)
[INFO] Building: copy-cli\pom.xml
[INFO] run script verify.bsh
[INFO] ..SUCCESS (6.6 s)
[INFO] Building: copy-dependencies\pom.xml
[INFO] run script verify.bsh
[INFO] ..SUCCESS (7.2 s)
[INFO] Building: copy-from-reactor\pom.xml
[INFO] run script verify.bsh
[INFO] ..SUCCESS (7.8 s)
[INFO] Building: copy-from-remote-repository\pom.xml
[INFO] run script setup.bsh
[INFO] run script verify.bsh
[INFO] ..SUCCESS (8.0 s)
[INFO] Building: dependency-properties\pom.xml
[INFO] run script verify.bsh
[INFO] ..SUCCESS (6.5 s)
[INFO] Building: filterunpack\pom.xml
[INFO] run script verify.groovy
[INFO] ..SUCCESS (6.3 s)
[INFO] Building: get-artifact\pom.xml
[INFO] run script setup.bsh
[INFO] run script verify.bsh
[INFO] ..SUCCESS (6.5 s)
[INFO] Building: get-artifact-maven-plugin\pom.xml
[INFO] run script setup.bsh
[INFO] run script verify.bsh
[INFO] ..SUCCESS (6.3 s)
[INFO] Building: get-artifact-no-transitive\pom.xml
[INFO] run script setup.bsh
[INFO] run script verify.bsh
[INFO] ..SUCCESS (6.4 s)
[INFO] Building: get-gav\pom.xml
[INFO] run script setup.bsh
[INFO] run script verify.bsh
[INFO] ..SUCCESS (6.5 s)
[INFO] Building: go-offline\pom.xml
[INFO] ..SUCCESS (7.9 s)
[INFO] Building: list-repositories\pom.xml
[INFO] ..SUCCESS (6.4 s)
[INFO] Building: mdep-439-analyze-java8\pom.xml
[INFO] ..SKIPPED due to JRE version
[INFO] Building: mdep-450-project-with-ancestor\pom.xml
[INFO] run script verify.groovy
[INFO] ..SUCCESS (6.6 s)
[INFO] Building: mdep-450-project-without-ancestor\pom.xml
[INFO] run script verify.groovy
[INFO] ..SUCCESS (6.4 s)
[INFO] Building: mdep-506-dependency-without-version-in-depmgt\pom.xml
[INFO] ..SUCCESS (7.3 s)
[INFO] Building: mdep-571-list-java9\pom.xml
[INFO] ..SKIPPED due to JRE version
[INFO] Building: mdep-572-unpack-tar-long-file\pom.xml
[INFO] run script verify.bsh
[INFO] ..SUCCESS (8.0 s)
[INFO] Building: purge-local-repository\pom.xml
[INFO] run script setup.bsh
[INFO] run script verify.bsh
[INFO] ..SUCCESS (6.6 s)
[INFO] Building: purge-local-repository-bad-dep\pom.xml
[INFO] run script verify.groovy
[INFO] ..SUCCESS (6.8 s)
[INFO] Building: purge-local-repository-include\pom.xml
[INFO] run script verify.groovy
[INFO] ..SUCCESS (6.7 s)
[INFO] Building: purge-local-repository-multi-module\pom.xml
[INFO] run script setup.bsh
[INFO] run script verify.bsh
[INFO] ..SUCCESS (6.5 s)
[INFO] Building: purge-local-repository-multi-module-execution\pom.xml
[INFO] run script setup.bsh
[INFO] run script verify.bsh
[INFO] ..SUCCESS (7.4 s)
[INFO] Building: purge-local-repository-non-transitive\pom.xml
[INFO] run script verify.bsh
[INFO] ..SUCCESS (6.4 s)
[INFO] Building: purge-local-repository-reresolve\pom.xml
[INFO] run script verify.bsh
[INFO] ..SUCCESS (6.5 s)
[INFO] Building: purge-local-repository-snapshots-only\pom.xml
[INFO] run script setup.bsh
[INFO] run script verify.bsh
[INFO] ..SUCCESS (7.0 s)
[INFO] Building: purge-local-repository-version-range\pom.xml
[INFO] run script verify.bsh
[INFO] ..SUCCESS (6.6 s)
[INFO] Building: resolve\pom.xml
[INFO] ..SUCCESS (6.5 s)
[INFO] Building: resolve-plugins\pom.xml
[INFO] ..SUCCESS (7.5 s)
[INFO] Building: resolve-plugins-exclude-reactor\pom.xml
[INFO] run script verify.groovy
[INFO] ..SUCCESS (8.1 s)
[INFO] Building: resolve-plugins-with-exclude\pom.xml
[INFO] run script verify.groovy
[INFO] ..SUCCESS (7.4 s)
[INFO] Building: sources\pom.xml
[INFO] ..SUCCESS (6.8 s)
[INFO] Building: tree\pom.xml
[INFO] run script verify.bsh
[INFO] ..SUCCESS (6.5 s)
[INFO] Building: tree-includes\pom.xml
[INFO] run script verify.bsh
[INFO] ..SUCCESS (6.5 s)
[INFO] Building: tree-multimodule\pom.xml
[INFO] run script verify.bsh
[INFO] ..SUCCESS (7.1 s)
[INFO] Building: unpack\pom.xml
[INFO] run script verify.bsh
[INFO] ..SUCCESS (7.7 s)
[INFO] Building: unpack-cli\pom.xml
[INFO] run script verify.bsh
[INFO] ..SUCCESS (6.6 s)
[INFO] Building: unpack-custom-ear\pom.xml
[INFO] run script verify.groovy
[INFO] ..SUCCESS (6.8 s)
[INFO] Building: unpack-dependencies\pom.xml
[INFO] run script verify.groovy
[INFO] ..SUCCESS (8.2 s)
[INFO] Building: unpack-from-remote-repository\pom.xml
[INFO] run script setup.bsh
[INFO] run script verify.bsh
[INFO] ..SUCCESS (7.8 s)
[INFO] Building: used-dependencies\pom.xml
[INFO] ..SUCCESS (8.3 s)
[INFO] Building: purge-local-repository-without-pom
[INFO] run script setup.bsh
[INFO] run script verify.bsh
[INFO] ..SUCCESS (6.6 s)
[INFO] 
[INFO] --- mrm-maven-plugin:1.0.0:stop (default) @ maven-dependency-plugin ---
[INFO] Stopping Mock Repository Manager on http://localhost:53622
[INFO] Mock Repository Manager http://localhost:53622 is stopped.
[INFO] 
[INFO] --- maven-checkstyle-plugin:2.15:check (checkstyle-check) @ maven-dependency-plugin
---
[INFO] There is 1 error reported by Checkstyle 6.1.1 with config/maven_checks.xml ruleset.
[INFO] Ignored 1 error, 0 violation remaining.
[INFO] 
[INFO] --- maven-invoker-plugin:2.0.0:verify (integration-test) @ maven-dependency-plugin
---
[INFO] -------------------------------------------------
[INFO] Build Summary:
[INFO]   Passed: 53, Failed: 0, Errors: 0, Skipped: 2
[INFO] -------------------------------------------------
[INFO] 
[INFO] --- maven-install-plugin:2.5.2:install (default-install) @ maven-dependency-plugin
---
[INFO] Installing F:\jenkins\jenkins-slave\workspace\maven-plugins-ITs-m3-windows\maven-dependency-plugin\target\maven-dependency-plugin-3.0.2-SNAPSHOT.jar
to C:\Users\jenkins\.m2\repository\org\apache\maven\plugins\maven-dependency-plugin\3.0.2-SNAPSHOT\maven-dependency-plugin-3.0.2-SNAPSHOT.jar
[INFO] Installing F:\jenkins\jenkins-slave\workspace\maven-plugins-ITs-m3-windows\maven-dependency-plugin\pom.xml
to C:\Users\jenkins\.m2\repository\org\apache\maven\plugins\maven-dependency-plugin\3.0.2-SNAPSHOT\maven-dependency-plugin-3.0.2-SNAPSHOT.pom
[INFO]                                                                         
[INFO] ------------------------------------------------------------------------
[INFO] Building Apache Maven Plugins Aggregator 1-SNAPSHOT
[INFO] ------------------------------------------------------------------------
[INFO] 
[INFO] --- maven-clean-plugin:2.5:clean (default-clean) @ maven-plugins-aggregator ---
[INFO] 
[INFO] --- maven-enforcer-plugin:1.3.1:enforce (enforce-bytecode-version) @ maven-plugins-aggregator
---
[INFO] 
[INFO] --- maven-enforcer-plugin:1.3.1:enforce (ban-known-bad-maven-versions) @ maven-plugins-aggregator
---
[INFO] 
[INFO] --- maven-remote-resources-plugin:1.5:process (default) @ maven-plugins-aggregator
---
[INFO] 
[INFO] --- maven-site-plugin:3.3:attach-descriptor (attach-descriptor) @ maven-plugins-aggregator
---
[INFO] 
[INFO] --- maven-install-plugin:2.5.1:install (default-install) @ maven-plugins-aggregator
---
[INFO] Installing <https://builds.apache.org/job/maven-plugins-ITs-m3-windows/ws/pom.xml>
to C:\Users\jenkins\.m2\repository\org\apache\maven\plugins\maven-plugins-aggregator\1-SNAPSHOT\maven-plugins-aggregator-1-SNAPSHOT.pom
[INFO] ------------------------------------------------------------------------
[INFO] Reactor Summary:
[INFO] 
[INFO] Apache Maven ACR Plugin ............................ SUCCESS [ 49.539 s]
[INFO] Apache Maven AntRun Plugin ......................... SUCCESS [02:47 min]
[INFO] Apache Maven Changelog Plugin ...................... SUCCESS [01:22 min]
[INFO] Apache Maven Changes Plugin ........................ SUCCESS [02:18 min]
[INFO] Apache Maven Clean Plugin .......................... SUCCESS [ 53.593 s]
[INFO] Apache Maven Compiler Plugin ....................... SUCCESS [04:17 min]
[INFO] Apache Maven Deploy Plugin ......................... SUCCESS [03:50 min]
[INFO] Apache Maven Documentation Checker Plugin .......... SUCCESS [ 10.648 s]
[INFO] Apache Maven EAR Plugin ............................ SUCCESS [10:48 min]
[INFO] Apache Maven EJB Plugin ............................ SUCCESS [01:17 min]
[INFO] Apache Maven Help Plugin ........................... SUCCESS [03:35 min]
[INFO] Apache Maven Install Plugin ........................ SUCCESS [03:25 min]
[INFO] Apache Maven Jarsigner Plugin ...................... SUCCESS [01:26 min]
[INFO] Apache Maven Javadoc Plugin ........................ SUCCESS [10:35 min]
[INFO] Apache Maven JDeps Plugin .......................... SUCCESS [  4.184 s]
[INFO] Apache Maven Linkcheck Plugin ...................... SUCCESS [  6.084 s]
[INFO] Apache Maven Patch Plugin .......................... SUCCESS [ 11.415 s]
[INFO] Apache Maven PDF Plugin ............................ SUCCESS [ 44.580 s]
[INFO] Apache Maven RAR Plugin ............................ SUCCESS [ 19.902 s]
[INFO] Apache Maven Repository Plugin ..................... SUCCESS [ 45.137 s]
[INFO] Apache Maven Resources Plugin ...................... SUCCESS [02:22 min]
[INFO] Apache Maven Site Plugin ........................... SUCCESS [11:36 min]
[INFO] Apache Maven Source Plugin ......................... SUCCESS [01:41 min]
[INFO] Apache Maven Stage Plugin .......................... SUCCESS [  4.233 s]
[INFO] Apache Maven Toolchains Plugin ..................... SUCCESS [ 25.655 s]
[INFO] Apache Maven Verifier Plugin ....................... SUCCESS [ 15.945 s]
[INFO] Apache Maven WAR Plugin ............................ SUCCESS [03:11 min]
[INFO] Apache Maven DOAP Plugin ........................... SUCCESS [ 33.048 s]
[INFO] Apache Maven Invoker Plugin ........................ FAILURE [  0.173 s]
[INFO] Apache Maven JAR Plugin ............................ SUCCESS [02:58 min]
[INFO] Apache Maven Assembly Plugin ....................... SUCCESS [18:07 min]
[INFO] Apache Maven Checkstyle Plugin ..................... SUCCESS [06:54 min]
[INFO] Apache Maven PMD Plugin ............................ SUCCESS [03:35 min]
[INFO] Apache Maven Project Info Reports Plugin ........... SUCCESS [03:25 min]
[INFO] Apache Maven Remote Resources Plugin ............... SUCCESS [01:37 min]
[INFO] Apache Maven Shade Plugin .......................... SUCCESS [06:30 min]
[INFO] Apache Maven SCM Publish Plugin .................... SUCCESS [01:15 min]
[INFO] Apache Maven Dependency Plugin ..................... SUCCESS [07:28 min]
[INFO] Apache Maven Plugins Aggregator .................... SUCCESS [  0.939 s]
[INFO] ------------------------------------------------------------------------
[INFO] BUILD FAILURE
[INFO] ------------------------------------------------------------------------
[INFO] Total time: 02:01 h
[INFO] Finished at: 2017-07-12T23:38:03+00:00
[INFO] Final Memory: 154M/486M
[INFO] ------------------------------------------------------------------------
[WARNING] The requested profile "apache.snapshots" could not be activated because it does
not exist.
[ERROR] Failed to execute goal on project maven-invoker-plugin: Could not resolve dependencies
for project org.apache.maven.plugins:maven-invoker-plugin:maven-plugin:3.0.2-SNAPSHOT: Could
not find artifact org.apache.maven.shared:maven-script-interpreter:jar:1.2 in central (https://repo.maven.apache.org/maven2)
-> [Help 1]
[ERROR] 
[ERROR] To see the full stack trace of the errors, re-run Maven with the -e switch.
[ERROR] Re-run Maven using the -X switch to enable full debug logging.
[ERROR] 
[ERROR] For more information about the errors and possible solutions, please read the following
articles:
[ERROR] [Help 1] http://cwiki.apache.org/confluence/display/MAVEN/DependencyResolutionException
[ERROR] 
[ERROR] After correcting the problems, you can resume the build with the command
[ERROR]   mvn <goals> -rf :maven-invoker-plugin
Build step 'Invoke top-level Maven targets' marked build as failure
Deleting 1 temporary files
Recording test results

Mime
View raw message