maven-notifications mailing list archives

Site index · List index
Message view « Date » · « Thread »
Top « Date » · « Thread »
From Apache Jenkins Server <jenk...@builds.apache.org>
Subject Build failed in Jenkins: maven-plugins-ITs-m3-windows #1849
Date Tue, 11 Apr 2017 23:49:37 GMT
See <https://builds.apache.org/job/maven-plugins-ITs-m3-windows/1849/display/redirect?page=changes>

Changes:

[Michael Osipov] [MLINKCHECK-29] Upgrade to Maven Invoker 3.0.0

Submitted-by: Archimedes Trajano <developer@trajano.net>

This closes #108

[Michael Osipov] Fix link to assembly-component.html

Submitted-by: Arend von Reinersdorff <arend@arendvr.com>

This fixes #103

------------------------------------------
[...truncated 3.21 MB...]
[INFO] Installing F:\jenkins\jenkins-slave\workspace\maven-plugins-ITs-m3-windows\maven-dependency-plugin\pom.xml
to F:\jenkins\jenkins-slave\workspace\maven-plugins-ITs-m3-windows\maven-dependency-plugin\target\local-repo\org\apache\maven\plugins\maven-dependency-plugin\3.0.1-SNAPSHOT\maven-dependency-plugin-3.0.1-SNAPSHOT.pom
[INFO] Installing F:\jenkins\jenkins-slave\workspace\maven-plugins-ITs-m3-windows\maven-dependency-plugin\target\maven-dependency-plugin-3.0.1-SNAPSHOT.jar
to F:\jenkins\jenkins-slave\workspace\maven-plugins-ITs-m3-windows\maven-dependency-plugin\target\local-repo\org\apache\maven\plugins\maven-dependency-plugin\3.0.1-SNAPSHOT\maven-dependency-plugin-3.0.1-SNAPSHOT.jar
[INFO] 
[INFO] --- mrm-maven-plugin:1.0.0:start (default) @ maven-dependency-plugin ---
[INFO] Configuring Mock Repository Manager...
[INFO]   Mock content (source: F:\jenkins\jenkins-slave\workspace\maven-plugins-ITs-m3-windows\maven-dependency-plugin\src\it\mrm\repository)
[INFO]   Proxy (source: this Maven session)
[INFO] Starting Mock Repository Manager
[INFO] Logging to org.slf4j.impl.SimpleLogger(org.mortbay.log) via org.mortbay.log.Slf4jLog
[INFO] jetty-6.1.5
[INFO] Started SocketConnector@0.0.0.0:59510
[INFO] Mock Repository Manager http://localhost:59510 is started.
[INFO] Setting property 'repository.proxy.url' to 'http://localhost:59510'.
[INFO] 
[INFO] --- maven-invoker-plugin:2.0.0:integration-test (integration-test) @ maven-dependency-plugin
---
[INFO] Building: setup-custom-ear-lifecycle\pom.xml
[INFO] ..SUCCESS (11.4 s)
[INFO] Building: analyze\pom.xml
[INFO] run script verify.bsh
[INFO] ..SUCCESS (7.9 s)
[INFO] Building: analyze-dep-mgt\pom.xml
[INFO] ..SUCCESS (6.0 s)
[INFO] Building: analyze-ignore-dependency\pom.xml
[INFO] ..SUCCESS (7.4 s)
[INFO] Building: analyze-ignore-unused-declared-dependency\pom.xml
[INFO] ..SUCCESS (7.6 s)
[INFO] Building: analyze-ignore-used-undeclared-dependency\pom.xml
[INFO] ..SUCCESS (7.2 s)
[INFO] Building: analyze-multimodule-project\pom.xml
[INFO] ..SUCCESS (7.4 s)
[INFO] Building: analyze-report\pom.xml
[INFO] run script verify.bsh
[INFO] ..SUCCESS (7.8 s)
[INFO] Building: build-classpath\pom.xml
[INFO] run script verify.bsh
[INFO] ..SUCCESS (5.7 s)
[INFO] Building: build-classpath-output-file-and-property\pom.xml
[INFO] run script verify.bsh
[INFO] ..SUCCESS (7.2 s)
[INFO] Building: collect\pom.xml
[INFO] ..SUCCESS (5.4 s)
[INFO] Building: copy\pom.xml
[INFO] run script verify.bsh
[INFO] ..SUCCESS (5.5 s)
[INFO] Building: copy-and-unpack-with-alternate-local-repo\pom.xml
[INFO] run script verify.bsh
[INFO] ..SUCCESS (6.8 s)
[INFO] Building: copy-cli\pom.xml
[INFO] run script verify.bsh
[INFO] ..SUCCESS (5.5 s)
[INFO] Building: copy-dependencies\pom.xml
[INFO] run script verify.bsh
[INFO] ..SUCCESS (6.4 s)
[INFO] Building: copy-from-reactor\pom.xml
[INFO] run script verify.bsh
[INFO] ..SUCCESS (6.9 s)
[INFO] Building: copy-from-remote-repository\pom.xml
[INFO] run script setup.bsh
[INFO] run script verify.bsh
[INFO] ..SUCCESS (6.8 s)
[INFO] Building: dependency-properties\pom.xml
[INFO] run script verify.bsh
[INFO] ..SUCCESS (5.4 s)
[INFO] Building: filterunpack\pom.xml
[INFO] run script verify.groovy
[INFO] ..SUCCESS (5.4 s)
[INFO] Building: get-artifact\pom.xml
[INFO] run script setup.bsh
[INFO] run script verify.bsh
[INFO] ..SUCCESS (5.3 s)
[INFO] Building: get-artifact-maven-plugin\pom.xml
[INFO] run script setup.bsh
[INFO] run script verify.bsh
[INFO] ..SUCCESS (5.4 s)
[INFO] Building: get-artifact-no-transitive\pom.xml
[INFO] run script setup.bsh
[INFO] run script verify.bsh
[INFO] ..SUCCESS (5.2 s)
[INFO] Building: get-gav\pom.xml
[INFO] run script setup.bsh
[INFO] run script verify.bsh
[INFO] ..SUCCESS (5.3 s)
[INFO] Building: go-offline\pom.xml
[INFO] ..SUCCESS (6.7 s)
[INFO] Building: list-repositories\pom.xml
[INFO] ..SUCCESS (5.4 s)
[INFO] Building: mdep-439-analyze-java8\pom.xml
[INFO] ..SKIPPED due to JRE version
[INFO] Building: mdep-450-project-with-ancestor\pom.xml
[INFO] run script verify.groovy
[INFO] ..SUCCESS (5.2 s)
[INFO] Building: mdep-450-project-without-ancestor\pom.xml
[INFO] run script verify.groovy
[INFO] ..SUCCESS (5.2 s)
[INFO] Building: mdep-506-dependency-without-version-in-depmgt\pom.xml
[INFO] ..SUCCESS (6.4 s)
[INFO] Building: purge-local-repository\pom.xml
[INFO] run script setup.bsh
[INFO] run script verify.bsh
[INFO] ..SUCCESS (6.1 s)
[INFO] Building: purge-local-repository-non-transitive\pom.xml
[INFO] run script verify.bsh
[INFO] ..SUCCESS (6.1 s)
[INFO] Building: purge-local-repository-reresolve\pom.xml
[INFO] run script verify.bsh
[INFO] ..SUCCESS (6.0 s)
[INFO] Building: purge-local-repository-snapshots-only\pom.xml
[INFO] run script setup.bsh
[INFO] run script verify.bsh
[INFO] ..SUCCESS (6.6 s)
[INFO] Building: purge-local-repository-version-range\pom.xml
[INFO] run script verify.bsh
[INFO] ..SUCCESS (6.4 s)
[INFO] Building: resolve\pom.xml
[INFO] ..SUCCESS (5.6 s)
[INFO] Building: resolve-plugins\pom.xml
[INFO] ..SUCCESS (6.0 s)
[INFO] Building: resolve-plugins-exclude-reactor\pom.xml
[INFO] run script verify.groovy
[INFO] ..SUCCESS (7.1 s)
[INFO] Building: resolve-plugins-with-exclude\pom.xml
[INFO] run script verify.groovy
[INFO] ..SUCCESS (6.1 s)
[INFO] Building: sources\pom.xml
[INFO] ..SUCCESS (5.8 s)
[INFO] Building: tree\pom.xml
[INFO] run script verify.bsh
[INFO] ..SUCCESS (5.5 s)
[INFO] Building: tree-includes\pom.xml
[INFO] run script verify.bsh
[INFO] ..SUCCESS (5.6 s)
[INFO] Building: unpack\pom.xml
[INFO] run script verify.bsh
[INFO] ..SUCCESS (7.0 s)
[INFO] Building: unpack-cli\pom.xml
[INFO] run script verify.bsh
[INFO] ..SUCCESS (5.6 s)
[INFO] Building: unpack-custom-ear\pom.xml
[INFO] run script verify.groovy
[INFO] ..SUCCESS (5.9 s)
[INFO] Building: unpack-dependencies\pom.xml
[INFO] run script verify.groovy
[INFO] ..SUCCESS (7.6 s)
[INFO] Building: unpack-from-remote-repository\pom.xml
[INFO] run script setup.bsh
[INFO] run script verify.bsh
[INFO] ..SUCCESS (7.2 s)
[INFO] Building: purge-local-repository-without-pom
[INFO] run script setup.bsh
[INFO] run script verify.bsh
[INFO] ..SUCCESS (5.8 s)
[INFO] 
[INFO] --- mrm-maven-plugin:1.0.0:stop (default) @ maven-dependency-plugin ---
[INFO] Stopping Mock Repository Manager on http://localhost:59510
[INFO] Mock Repository Manager http://localhost:59510 is stopped.
[INFO] 
[INFO] --- maven-checkstyle-plugin:2.15:check (checkstyle-check) @ maven-dependency-plugin
---
[INFO] There is 1 error reported by Checkstyle 6.1.1 with config/maven_checks.xml ruleset.
[INFO] Ignored 1 error, 0 violation remaining.
[INFO] 
[INFO] --- maven-invoker-plugin:2.0.0:verify (integration-test) @ maven-dependency-plugin
---
[INFO] -------------------------------------------------
[INFO] Build Summary:
[INFO]   Passed: 46, Failed: 0, Errors: 0, Skipped: 1
[INFO] -------------------------------------------------
[INFO] 
[INFO] --- maven-install-plugin:2.5.2:install (default-install) @ maven-dependency-plugin
---
[INFO] Installing F:\jenkins\jenkins-slave\workspace\maven-plugins-ITs-m3-windows\maven-dependency-plugin\target\maven-dependency-plugin-3.0.1-SNAPSHOT.jar
to C:\Users\jenkins\.m2\repository\org\apache\maven\plugins\maven-dependency-plugin\3.0.1-SNAPSHOT\maven-dependency-plugin-3.0.1-SNAPSHOT.jar
[INFO] Installing F:\jenkins\jenkins-slave\workspace\maven-plugins-ITs-m3-windows\maven-dependency-plugin\pom.xml
to C:\Users\jenkins\.m2\repository\org\apache\maven\plugins\maven-dependency-plugin\3.0.1-SNAPSHOT\maven-dependency-plugin-3.0.1-SNAPSHOT.pom
[INFO]                                                                         
[INFO] ------------------------------------------------------------------------
[INFO] Building Apache Maven Plugins Aggregator 1-SNAPSHOT
[INFO] ------------------------------------------------------------------------
[INFO] 
[INFO] --- maven-clean-plugin:2.5:clean (default-clean) @ maven-plugins-aggregator ---
[INFO] 
[INFO] --- maven-enforcer-plugin:1.3.1:enforce (enforce-bytecode-version) @ maven-plugins-aggregator
---
[INFO] 
[INFO] --- maven-enforcer-plugin:1.3.1:enforce (ban-known-bad-maven-versions) @ maven-plugins-aggregator
---
[INFO] 
[INFO] --- maven-remote-resources-plugin:1.5:process (default) @ maven-plugins-aggregator
---
[INFO] 
[INFO] --- maven-site-plugin:3.3:attach-descriptor (attach-descriptor) @ maven-plugins-aggregator
---
[INFO] 
[INFO] --- maven-install-plugin:2.5.1:install (default-install) @ maven-plugins-aggregator
---
[INFO] Installing <https://builds.apache.org/job/maven-plugins-ITs-m3-windows/ws/pom.xml>
to C:\Users\jenkins\.m2\repository\org\apache\maven\plugins\maven-plugins-aggregator\1-SNAPSHOT\maven-plugins-aggregator-1-SNAPSHOT.pom
[INFO] ------------------------------------------------------------------------
[INFO] Reactor Summary:
[INFO] 
[INFO] Apache Maven ACR Plugin ............................ SUCCESS [ 39.869 s]
[INFO] Apache Maven AntRun Plugin ......................... SUCCESS [01:31 min]
[INFO] Apache Maven Changelog Plugin ...................... SUCCESS [01:06 min]
[INFO] Apache Maven Changes Plugin ........................ SUCCESS [01:49 min]
[INFO] Apache Maven Clean Plugin .......................... SUCCESS [ 41.062 s]
[INFO] Apache Maven Compiler Plugin ....................... SUCCESS [03:18 min]
[INFO] Apache Maven Deploy Plugin ......................... SUCCESS [03:03 min]
[INFO] Apache Maven Documentation Checker Plugin .......... SUCCESS [  7.731 s]
[INFO] Apache Maven EAR Plugin ............................ SUCCESS [08:22 min]
[INFO] Apache Maven EJB Plugin ............................ SUCCESS [ 59.019 s]
[INFO] Apache Maven Help Plugin ........................... SUCCESS [02:40 min]
[INFO] Apache Maven Install Plugin ........................ SUCCESS [02:33 min]
[INFO] Apache Maven Jarsigner Plugin ...................... SUCCESS [01:06 min]
[INFO] Apache Maven Javadoc Plugin ........................ SUCCESS [07:41 min]
[INFO] Apache Maven JDeps Plugin .......................... SUCCESS [  3.106 s]
[INFO] Apache Maven Linkcheck Plugin ...................... SUCCESS [  5.176 s]
[INFO] Apache Maven Patch Plugin .......................... SUCCESS [  8.629 s]
[INFO] Apache Maven PDF Plugin ............................ SUCCESS [ 37.163 s]
[INFO] Apache Maven RAR Plugin ............................ SUCCESS [ 17.410 s]
[INFO] Apache Maven Repository Plugin ..................... SUCCESS [ 38.887 s]
[INFO] Apache Maven Resources Plugin ...................... SUCCESS [01:58 min]
[INFO] Apache Maven Site Plugin ........................... SUCCESS [09:25 min]
[INFO] Apache Maven Source Plugin ......................... SUCCESS [01:32 min]
[INFO] Apache Maven Stage Plugin .......................... SUCCESS [  3.433 s]
[INFO] Apache Maven Toolchains Plugin ..................... SUCCESS [ 23.458 s]
[INFO] Apache Maven Verifier Plugin ....................... SUCCESS [ 13.826 s]
[INFO] Apache Maven WAR Plugin ............................ SUCCESS [02:38 min]
[INFO] Apache Maven DOAP Plugin ........................... SUCCESS [ 27.994 s]
[INFO] Apache Maven Invoker Plugin ........................ SUCCESS [09:27 min]
[INFO] Apache Maven JAR Plugin ............................ SUCCESS [02:29 min]
[INFO] Apache Maven Checkstyle Plugin ..................... SUCCESS [05:55 min]
[INFO] Apache Maven PMD Plugin ............................ SUCCESS [02:58 min]
[INFO] Apache Maven Project Info Reports Plugin ........... SUCCESS [03:10 min]
[INFO] Apache Maven Remote Resources Plugin ............... SUCCESS [01:25 min]
[INFO] Apache Maven Shade Plugin .......................... SUCCESS [05:36 min]
[INFO] Apache Maven SCM Publish Plugin .................... SUCCESS [01:02 min]
[INFO] Apache Maven Assembly Plugin ....................... FAILURE [16:22 min]
[INFO] Apache Maven Dependency Plugin ..................... SUCCESS [05:50 min]
[INFO] Apache Maven Plugins Aggregator .................... SUCCESS [  0.832 s]
[INFO] ------------------------------------------------------------------------
[INFO] BUILD FAILURE
[INFO] ------------------------------------------------------------------------
[INFO] Total time: 01:48 h
[INFO] Finished at: 2017-04-11T23:48:06+00:00
[INFO] Final Memory: 151M/579M
[INFO] ------------------------------------------------------------------------
[WARNING] The requested profile "apache.snapshots" could not be activated because it does
not exist.
[ERROR] Failed to execute goal org.apache.maven.plugins:maven-invoker-plugin:3.0.0-SNAPSHOT:verify
(integration-test) on project maven-assembly-plugin: 1 build failed. See console output above
for details. -> [Help 1]
[ERROR] 
[ERROR] To see the full stack trace of the errors, re-run Maven with the -e switch.
[ERROR] Re-run Maven using the -X switch to enable full debug logging.
[ERROR] 
[ERROR] For more information about the errors and possible solutions, please read the following
articles:
[ERROR] [Help 1] http://cwiki.apache.org/confluence/display/MAVEN/MojoFailureException
[ERROR] 
[ERROR] After correcting the problems, you can resume the build with the command
[ERROR]   mvn <goals> -rf :maven-assembly-plugin
Build step 'Invoke top-level Maven targets' marked build as failure
Deleting 1 temporary files
Recording test results

Mime
View raw message