maven-notifications mailing list archives

Site index · List index
Message view « Date » · « Thread »
Top « Date » · « Thread »
From Apache Jenkins Server <jenk...@builds.apache.org>
Subject Build failed in Jenkins: core-it-maven-3-win #1520
Date Sun, 05 Mar 2017 17:49:42 GMT
See <https://builds.apache.org/job/core-it-maven-3-win/1520/display/redirect?page=changes>

Changes:

[Robert Scholte] [MNG-6181] HttpClient produces a lot of noise at debug loglevel

------------------------------------------
[...truncated 369.51 KB...]
[INFO] 
[INFO] --- maven-remote-resources-plugin:1.5:process (default) @ maven-compat ---
[INFO] 
[INFO] --- maven-resources-plugin:2.7:resources (default-resources) @ maven-compat ---
[INFO] Using 'UTF-8' encoding to copy filtered resources.
[INFO] Copying 4 resources
[INFO] Copying 3 resources
[INFO] 
[INFO] --- maven-compiler-plugin:3.2:compile (default-compile) @ maven-compat ---
[INFO] Changes detected - recompiling the module!
[INFO] Compiling 146 source files to F:\ws\m3-its\maven-3-trunk\maven-compat\target\classes
[INFO] /F:/ws/m3-its/maven-3-trunk/maven-compat/src/main/java/org/apache/maven/project/DefaultMavenProjectBuilder.java:
Some input files use or override a deprecated API.
[INFO] /F:/ws/m3-its/maven-3-trunk/maven-compat/src/main/java/org/apache/maven/project/DefaultMavenProjectBuilder.java:
Recompile with -Xlint:deprecation for details.
[INFO] /F:/ws/m3-its/maven-3-trunk/maven-compat/target/generated-sources/modello/org/apache/maven/usability/plugin/ExpressionDocumentation.java:
Some input files use unchecked or unsafe operations.
[INFO] /F:/ws/m3-its/maven-3-trunk/maven-compat/target/generated-sources/modello/org/apache/maven/usability/plugin/ExpressionDocumentation.java:
Recompile with -Xlint:unchecked for details.
[INFO] 
[INFO] --- animal-sniffer-maven-plugin:1.15:check (check-java-1.6-compat) @ maven-compat ---
[INFO] Checking unresolved references to org.codehaus.mojo.signature:java17:1.0
[INFO] 
[INFO] --- plexus-component-metadata:1.7.1:generate-metadata (default) @ maven-compat ---
[INFO] Discovered 34 component descriptors(s)
[INFO] 
[INFO] --- maven-resources-plugin:2.7:testResources (default-testResources) @ maven-compat
---
[INFO] Using 'UTF-8' encoding to copy filtered resources.
[INFO] Copying 156 resources
[INFO] Copying 3 resources
[INFO] 
[INFO] --- maven-compiler-plugin:3.2:testCompile (default-testCompile) @ maven-compat ---
[INFO] Changes detected - recompiling the module!
[INFO] Compiling 71 source files to F:\ws\m3-its\maven-3-trunk\maven-compat\target\test-classes
[INFO] /F:/ws/m3-its/maven-3-trunk/maven-compat/src/test/java/org/apache/maven/artifact/metadata/TestMetadataSource.java:
Some input files use or override a deprecated API.
[INFO] /F:/ws/m3-its/maven-3-trunk/maven-compat/src/test/java/org/apache/maven/artifact/metadata/TestMetadataSource.java:
Recompile with -Xlint:deprecation for details.
[INFO] /F:/ws/m3-its/maven-3-trunk/maven-compat/src/test/java/org/apache/maven/repository/legacy/resolver/DefaultArtifactCollectorTest.java:
F:\ws\m3-its\maven-3-trunk\maven-compat\src\test\java\org\apache\maven\repository\legacy\resolver\DefaultArtifactCollectorTest.java
uses unchecked or unsafe operations.
[INFO] /F:/ws/m3-its/maven-3-trunk/maven-compat/src/test/java/org/apache/maven/repository/legacy/resolver/DefaultArtifactCollectorTest.java:
Recompile with -Xlint:unchecked for details.
[INFO] 
[INFO] --- plexus-component-metadata:1.7.1:generate-test-metadata (default) @ maven-compat
---
[INFO] Discovered 12 component descriptors(s)
[INFO] 
[INFO] --- maven-surefire-plugin:2.18.1:test (default-test) @ maven-compat ---
[INFO] Tests are skipped.
[INFO] 
[INFO] --- maven-jar-plugin:2.5:jar (default-jar) @ maven-compat ---
[INFO] Building jar: F:\ws\m3-its\maven-3-trunk\maven-compat\target\maven-compat-3.5.0-SNAPSHOT.jar
[INFO] 
[INFO] --- maven-site-plugin:3.4:attach-descriptor (attach-descriptor) @ maven-compat ---
[INFO]                                                                         
[INFO] ------------------------------------------------------------------------
[INFO] Building Maven Embedder 3.5.0-SNAPSHOT
[INFO] ------------------------------------------------------------------------
[INFO] Downloading: https://repo.maven.apache.org/maven2/org/slf4j/slf4j-simple/1.7.22/slf4j-simple-1.7.22.pom
[INFO] Downloaded: https://repo.maven.apache.org/maven2/org/slf4j/slf4j-simple/1.7.22/slf4j-simple-1.7.22.pom
(1015 B at 66.1 KB/sec)
[INFO] Downloading: https://repo.maven.apache.org/maven2/ch/qos/logback/logback-classic/1.2.1/logback-classic-1.2.1.pom
[INFO] Downloaded: https://repo.maven.apache.org/maven2/ch/qos/logback/logback-classic/1.2.1/logback-classic-1.2.1.pom
(13 KB at 1272.1 KB/sec)
[INFO] Downloading: https://repo.maven.apache.org/maven2/ch/qos/logback/logback-parent/1.2.1/logback-parent-1.2.1.pom
[INFO] Downloaded: https://repo.maven.apache.org/maven2/ch/qos/logback/logback-parent/1.2.1/logback-parent-1.2.1.pom
(18 KB at 1751.6 KB/sec)
[INFO] Downloading: https://repo.maven.apache.org/maven2/ch/qos/logback/logback-core/1.2.1/logback-core-1.2.1.pom
[INFO] Downloaded: https://repo.maven.apache.org/maven2/ch/qos/logback/logback-core/1.2.1/logback-core-1.2.1.pom
(5 KB at 389.0 KB/sec)
[INFO] Downloading: https://repo.maven.apache.org/maven2/commons-cli/commons-cli/1.3.1/commons-cli-1.3.1.pom
[INFO] Downloaded: https://repo.maven.apache.org/maven2/commons-cli/commons-cli/1.3.1/commons-cli-1.3.1.pom
(11 KB at 845.8 KB/sec)
[INFO] Downloading: https://repo.maven.apache.org/maven2/org/apache/commons/commons-parent/37/commons-parent-37.pom
[INFO] Downloaded: https://repo.maven.apache.org/maven2/org/apache/commons/commons-parent/37/commons-parent-37.pom
(62 KB at 4104.3 KB/sec)
[INFO] Downloading: https://repo.maven.apache.org/maven2/ch/qos/logback/logback-core/1.2.1/logback-core-1.2.1.jar
[INFO] Downloading: https://repo.maven.apache.org/maven2/commons-cli/commons-cli/1.3.1/commons-cli-1.3.1.jar
[INFO] Downloading: https://repo.maven.apache.org/maven2/org/slf4j/slf4j-simple/1.7.22/slf4j-simple-1.7.22.jar
[INFO] Downloading: https://repo.maven.apache.org/maven2/ch/qos/logback/logback-classic/1.2.1/logback-classic-1.2.1.jar
[INFO] Downloaded: https://repo.maven.apache.org/maven2/org/slf4j/slf4j-simple/1.7.22/slf4j-simple-1.7.22.jar
(11 KB at 772.2 KB/sec)
[INFO] Downloaded: https://repo.maven.apache.org/maven2/ch/qos/logback/logback-core/1.2.1/logback-core-1.2.1.jar
(463 KB at 16500.9 KB/sec)
[INFO] Downloaded: https://repo.maven.apache.org/maven2/commons-cli/commons-cli/1.3.1/commons-cli-1.3.1.jar
(52 KB at 1669.2 KB/sec)
[INFO] Downloaded: https://repo.maven.apache.org/maven2/ch/qos/logback/logback-classic/1.2.1/logback-classic-1.2.1.jar
(304 KB at 6590.6 KB/sec)
[INFO] 
[INFO] --- maven-clean-plugin:2.5:clean (default-clean) @ maven-embedder ---
[INFO] Deleting F:\ws\m3-its\maven-3-trunk\maven-embedder\target
[INFO] 
[INFO] --- maven-enforcer-plugin:1.3.1:enforce (enforce-bytecode-version) @ maven-embedder
---
[INFO] 
[INFO] --- maven-enforcer-plugin:1.3.1:enforce (ban-known-bad-maven-versions) @ maven-embedder
---
[INFO] 
[INFO] --- maven-enforcer-plugin:1.3.1:enforce (enforce-maven) @ maven-embedder ---
[INFO] 
[INFO] --- apache-rat-plugin:0.11:check (rat-check) @ maven-embedder ---
[INFO] 51 implicit excludes (use -debug for more details).
[INFO] Exclude: src/test/resources*/**
[INFO] Exclude: src/test/projects/**
[INFO] Exclude: src/test/remote-repo/**
[INFO] Exclude: **/*.odg
[INFO] Exclude: src/main/resources/META-INF/MANIFEST.MF
[INFO] Exclude: src/test/*-projects/**
[INFO] Exclude: src/test/*-project/**
[INFO] Exclude: src/test/plugin-version-references/**
[INFO] Exclude: bootstrap/**
[INFO] Exclude: README.bootstrap.txt
[INFO] Exclude: .repository/**
[INFO] Exclude: .maven/spy.log
[INFO] Exclude: .java-version
[INFO] Exclude: README.md
[INFO] Exclude: DEPENDENCIES
[INFO] 45 resources included (use -debug for more details)
[INFO] Rat check: Summary of files. Unapproved: 0 unknown: 0 generated: 0 approved: 45 licence.
[INFO] 
[INFO] --- modello-maven-plugin:1.8.3:java (standard) @ maven-embedder ---
[INFO] outputDirectory: F:\ws\m3-its\maven-3-trunk\maven-embedder\target\generated-sources\modello
[INFO] Working on model: src/main/mdo/core-extensions.mdo
[INFO] Generating current version: 1.0.0
[INFO] 
[INFO] --- modello-maven-plugin:1.8.3:xpp3-reader (standard) @ maven-embedder ---
[INFO] outputDirectory: F:\ws\m3-its\maven-3-trunk\maven-embedder\target\generated-sources\modello
[INFO] Working on model: src/main/mdo/core-extensions.mdo
[INFO] Generating current version: 1.0.0
[INFO] 
[INFO] --- modello-maven-plugin:1.8.3:xpp3-writer (standard) @ maven-embedder ---
[INFO] outputDirectory: F:\ws\m3-its\maven-3-trunk\maven-embedder\target\generated-sources\modello
[INFO] Working on model: src/main/mdo/core-extensions.mdo
[INFO] Generating current version: 1.0.0
[INFO] 
[INFO] --- maven-remote-resources-plugin:1.5:process (default) @ maven-embedder ---
[INFO] 
[INFO] --- maven-resources-plugin:2.7:resources (default-resources) @ maven-embedder ---
[INFO] Using 'UTF-8' encoding to copy filtered resources.
[INFO] Copying 1 resource
[INFO] Copying 3 resources
[INFO] 
[INFO] --- maven-compiler-plugin:3.2:compile (default-compile) @ maven-embedder ---
[INFO] Changes detected - recompiling the module!
[INFO] Compiling 32 source files to F:\ws\m3-its\maven-3-trunk\maven-embedder\target\classes
[INFO] /F:/ws/m3-its/maven-3-trunk/maven-embedder/src/main/java/org/apache/maven/cli/CLIManager.java:
F:\ws\m3-its\maven-3-trunk\maven-embedder\src\main\java\org\apache\maven\cli\CLIManager.java
uses or overrides a deprecated API.
[INFO] /F:/ws/m3-its/maven-3-trunk/maven-embedder/src/main/java/org/apache/maven/cli/CLIManager.java:
Recompile with -Xlint:deprecation for details.
[INFO] /F:/ws/m3-its/maven-3-trunk/maven-embedder/target/generated-sources/modello/org/apache/maven/cli/internal/extension/model/io/xpp3/CoreExtensionsXpp3Reader.java:
F:\ws\m3-its\maven-3-trunk\maven-embedder\target\generated-sources\modello\org\apache\maven\cli\internal\extension\model\io\xpp3\CoreExtensionsXpp3Reader.java
uses unchecked or unsafe operations.
[INFO] /F:/ws/m3-its/maven-3-trunk/maven-embedder/target/generated-sources/modello/org/apache/maven/cli/internal/extension/model/io/xpp3/CoreExtensionsXpp3Reader.java:
Recompile with -Xlint:unchecked for details.
[INFO] 
[INFO] --- animal-sniffer-maven-plugin:1.15:check (check-java-1.6-compat) @ maven-embedder
---
[INFO] Checking unresolved references to org.codehaus.mojo.signature:java17:1.0
[INFO] 
[INFO] --- sisu-maven-plugin:0.3.3:main-index (default) @ maven-embedder ---
[INFO] 
[INFO] --- plexus-component-metadata:1.7.1:generate-metadata (default) @ maven-embedder ---
[INFO] Discovered 1 component descriptors(s)
[INFO] 
[INFO] --- maven-resources-plugin:2.7:testResources (default-testResources) @ maven-embedder
---
[INFO] Using 'UTF-8' encoding to copy filtered resources.
[INFO] Copying 7 resources
[INFO] Copying 3 resources
[INFO] 
[INFO] --- maven-compiler-plugin:3.2:testCompile (default-testCompile) @ maven-embedder ---
[INFO] Changes detected - recompiling the module!
[INFO] Compiling 5 source files to F:\ws\m3-its\maven-3-trunk\maven-embedder\target\test-classes
[INFO] 
[INFO] --- sisu-maven-plugin:0.3.3:test-index (default) @ maven-embedder ---
[INFO] 
[INFO] --- plexus-component-metadata:1.7.1:generate-test-metadata (default) @ maven-embedder
---
[INFO] 
[INFO] --- maven-surefire-plugin:2.18.1:test (default-test) @ maven-embedder ---
[INFO] Tests are skipped.
[INFO] 
[INFO] --- maven-jar-plugin:2.5:jar (default-jar) @ maven-embedder ---
[INFO] Building jar: F:\ws\m3-its\maven-3-trunk\maven-embedder\target\maven-embedder-3.5.0-SNAPSHOT.jar
[INFO] 
[INFO] --- maven-site-plugin:3.4:attach-descriptor (attach-descriptor) @ maven-embedder ---
[INFO]                                                                         
[INFO] ------------------------------------------------------------------------
[INFO] Building Apache Maven Distribution 3.5.0-SNAPSHOT
[INFO] ------------------------------------------------------------------------
[INFO] Downloading: https://repo.maven.apache.org/maven2/org/apache/maven/plugins/maven-assembly-plugin/2.4.1/maven-assembly-plugin-2.4.1.pom
[INFO] Downloaded: https://repo.maven.apache.org/maven2/org/apache/maven/plugins/maven-assembly-plugin/2.4.1/maven-assembly-plugin-2.4.1.pom
(17 KB at 1169.2 KB/sec)
[INFO] Downloading: https://repo.maven.apache.org/maven2/org/apache/maven/plugins/maven-assembly-plugin/2.4.1/maven-assembly-plugin-2.4.1.jar
[INFO] Downloaded: https://repo.maven.apache.org/maven2/org/apache/maven/plugins/maven-assembly-plugin/2.4.1/maven-assembly-plugin-2.4.1.jar
(212 KB at 10570.1 KB/sec)
[INFO] Downloading: https://repo.maven.apache.org/maven2/org/apache/maven/wagon/wagon-http/2.12/wagon-http-2.12.pom
[INFO] Downloaded: https://repo.maven.apache.org/maven2/org/apache/maven/wagon/wagon-http/2.12/wagon-http-2.12.pom
(7 KB at 543.5 KB/sec)
[INFO] Downloading: https://repo.maven.apache.org/maven2/org/slf4j/jcl-over-slf4j/1.7.22/jcl-over-slf4j-1.7.22.pom
[INFO] Downloaded: https://repo.maven.apache.org/maven2/org/slf4j/jcl-over-slf4j/1.7.22/jcl-over-slf4j-1.7.22.pom
(963 B at 104.5 KB/sec)
[INFO] Downloading: https://repo.maven.apache.org/maven2/org/fusesource/jansi/jansi/1.13/jansi-1.13.pom
[INFO] Downloaded: https://repo.maven.apache.org/maven2/org/fusesource/jansi/jansi/1.13/jansi-1.13.pom
(4 KB at 402.8 KB/sec)
[INFO] Downloading: https://repo.maven.apache.org/maven2/org/fusesource/jansi/jansi-project/1.13/jansi-project-1.13.pom
[INFO] Downloaded: https://repo.maven.apache.org/maven2/org/fusesource/jansi/jansi-project/1.13/jansi-project-1.13.pom
(12 KB at 1048.8 KB/sec)
[INFO] Downloading: https://repo.maven.apache.org/maven2/org/fusesource/fusesource-pom/1.11/fusesource-pom-1.11.pom
[INFO] Downloaded: https://repo.maven.apache.org/maven2/org/fusesource/fusesource-pom/1.11/fusesource-pom-1.11.pom
(15 KB at 1423.0 KB/sec)
[INFO] Downloading: https://repo.maven.apache.org/maven2/org/apache/maven/wagon/wagon-http/2.12/wagon-http-2.12-shaded.jar
[INFO] Downloading: https://repo.maven.apache.org/maven2/org/fusesource/jansi/jansi/1.13/jansi-1.13.jar
[INFO] Downloading: https://repo.maven.apache.org/maven2/org/slf4j/jcl-over-slf4j/1.7.22/jcl-over-slf4j-1.7.22.jar
[INFO] Downloaded: https://repo.maven.apache.org/maven2/org/slf4j/jcl-over-slf4j/1.7.22/jcl-over-slf4j-1.7.22.jar
(17 KB at 1241.1 KB/sec)
[INFO] Downloaded: https://repo.maven.apache.org/maven2/org/fusesource/jansi/jansi/1.13/jansi-1.13.jar
(149 KB at 8724.4 KB/sec)
[INFO] Downloaded: https://repo.maven.apache.org/maven2/org/apache/maven/wagon/wagon-http/2.12/wagon-http-2.12-shaded.jar
(2117 KB at 29391.7 KB/sec)
[INFO] 
[INFO] --- maven-clean-plugin:2.5:clean (default-clean) @ apache-maven ---
[INFO] Deleting F:\ws\m3-its\maven-3-trunk\apache-maven\target
[INFO] 
[INFO] --- maven-enforcer-plugin:1.3.1:enforce (enforce-bytecode-version) @ apache-maven ---
[INFO] 
[INFO] --- maven-enforcer-plugin:1.3.1:enforce (ban-known-bad-maven-versions) @ apache-maven
---
[INFO] 
[INFO] --- maven-enforcer-plugin:1.3.1:enforce (enforce-maven) @ apache-maven ---
[INFO] 
[INFO] --- apache-rat-plugin:0.11:check (rat-check) @ apache-maven ---
[INFO] 51 implicit excludes (use -debug for more details).
[INFO] Exclude: src/test/resources*/**
[INFO] Exclude: src/test/projects/**
[INFO] Exclude: src/test/remote-repo/**
[INFO] Exclude: **/*.odg
[INFO] Exclude: src/bin/m2.conf
[INFO] Exclude: bootstrap/**
[INFO] Exclude: README.bootstrap.txt
[INFO] Exclude: .repository/**
[INFO] Exclude: .maven/spy.log
[INFO] Exclude: .java-version
[INFO] Exclude: README.md
[INFO] Exclude: DEPENDENCIES
[INFO] 18 resources included (use -debug for more details)
[INFO] Rat check: Summary of files. Unapproved: 0 unknown: 0 generated: 0 approved: 16 licence.
[INFO] 
[INFO] --- maven-remote-resources-plugin:1.5:process (default) @ apache-maven ---
[INFO] ------------------------------------------------------------------------
[INFO] Reactor Summary:
[INFO] 
[INFO] Apache Maven ....................................... SUCCESS [ 13.430 s]
[INFO] Maven Model ........................................ SUCCESS [  8.550 s]
[INFO] Maven Artifact ..................................... SUCCESS [  2.037 s]
[INFO] Maven Plugin API ................................... SUCCESS [  2.297 s]
[INFO] Maven Builder Support .............................. SUCCESS [  0.704 s]
[INFO] Maven Model Builder ................................ SUCCESS [  4.397 s]
[INFO] Maven Settings ..................................... SUCCESS [  0.826 s]
[INFO] Maven Settings Builder ............................. SUCCESS [  1.345 s]
[INFO] Maven Repository Metadata Model .................... SUCCESS [  0.769 s]
[INFO] Maven Artifact Resolver Provider ................... SUCCESS [  2.866 s]
[INFO] Maven Core ......................................... SUCCESS [ 13.218 s]
[INFO] Maven SLF4J Simple Provider ........................ SUCCESS [  5.712 s]
[INFO] Maven Compat ....................................... SUCCESS [  7.268 s]
[INFO] Maven Embedder ..................................... SUCCESS [  3.030 s]
[INFO] Apache Maven Distribution .......................... FAILURE [ 19.543 s]
[INFO] ------------------------------------------------------------------------
[INFO] BUILD FAILURE
[INFO] ------------------------------------------------------------------------
[INFO] Total time: 01:28 min
[INFO] Finished at: 2017-03-05T17:49:38+00:00
[INFO] Final Memory: 168M/2172M
[INFO] ------------------------------------------------------------------------
[ERROR] Failed to execute goal org.apache.maven.plugins:maven-remote-resources-plugin:1.5:process
(default) on project apache-maven: Error rendering velocity resource. Invocation of method
'getResourceAsFile' in  class org.codehaus.plexus.resource.DefaultResourceManager threw exception
org.codehaus.plexus.resource.loader.ResourceNotFoundException: Could not find resource 'http://www.eclipse.org/legal/epl-v10.html'.
at remote-resources[line 38, column 26] -> [Help 1]
[ERROR] 
[ERROR] To see the full stack trace of the errors, re-run Maven with the -e switch.
[ERROR] Re-run Maven using the -X switch to enable full debug logging.
[ERROR] 
[ERROR] For more information about the errors and possible solutions, please read the following
articles:
[ERROR] [Help 1] http://cwiki.apache.org/confluence/display/MAVEN/MojoExecutionException
[ERROR] 
[ERROR] After correcting the problems, you can resume the build with the command
[ERROR]   mvn <goals> -rf :apache-maven
Build step 'Invoke top-level Maven targets' marked build as failure
Recording test results
ERROR: Step ‘Publish JUnit test result report’ failed: Test reports were found but none
of them are new. Did tests run? 
For example, <https://builds.apache.org/job/core-it-maven-3-win/ws/core-integration-testing-trunk\core-it-suite\target\surefire-reports\TEST-org.apache.maven.it.IntegrationTestSuite.xml>
is 1 day 19 hr old


Mime
View raw message