maven-notifications mailing list archives

Site index · List index
Message view « Date » · « Thread »
Top « Date » · « Thread »
From Apache Jenkins Server <jenk...@builds.apache.org>
Subject Build failed in Jenkins: core-it-maven-3-win #1405
Date Sun, 18 Dec 2016 08:42:27 GMT
See <https://builds.apache.org/job/core-it-maven-3-win/1405/changes>

Changes:

[schulte] [MNG-4721] Create an integration test to check handling of optional

------------------------------------------
[...truncated 11316 lines...]
0134WarLifecycle(it0134)............................. OK (4.8 s)
0133JarLifecycle(it0133)............................. OK (4.7 s)
0132PomLifecycle(it0132)............................. OK (4.4 s)
0131SiteLifecycle(it0131)............................ OK (4.3 s)
0130CleanLifecycle(it0130)........................... OK (4.2 s)
0113ServerAuthzAvailableToWagonMgrInPlugin(it0113)... OK (4.7 s)
0090EnvVarInterpolation(it0090)...................... OK (4.5 s)
0087PluginRealmWithProjectLevelDeps(it0087).......... OK (4.5 s)
0086PluginRealm(it0086).............................. OK (4.5 s)
0085TransitiveSystemScope(it0085).................... OK (4.9 s)
0072InterpolationWithDottedProperty(it0072).......... OK (4.4 s)
0071PluginConfigWithDottedProperty(it0071)........... OK (4.6 s)
0064MojoConfigViaSetters(it0064)..................... OK (4.4 s)
0063SystemScopeDependency(it0063).................... OK (4.7 s)
0056MultipleGoalExecutions(it0056)................... OK (4.3 s)
0052ReleaseProfile(it0052)........................... OK (4.6 s)
0051ReleaseProfile(it0051)........................... OK (4.9 s)
0041ArtifactTypeFromPluginExtension(it0041).......... OK (5.8 s)
0040PackagingFromPluginExtension(it0040)............. OK (4.4 s)
0039ReleasePomInReactor(it0039)...................... SKIPPED - Maven version 3.4.0-SNAPSHOT
not in range [2.0,3.0-alpha-1)
0038AlternatePomFileDifferentDir(it0038)............. OK (4.5 s)
0037AlternatePomFileSameDir(it0037).................. OK (4.2 s)
0036ReleasePom(it0036)............................... SKIPPED - Maven version 3.4.0-SNAPSHOT
not in range (2.0,3.0-alpha-1)
0032MavenPrerequisite(it0032)........................ OK (3.9 s)
0030DepPomDepMngtInheritance(it0030)................. OK (9.0 s)
0025MultipleExecutionLevelConfigs(it0025)............ OK (4.4 s)
0024MultipleGoalExecutions(it0024)................... OK (4.2 s)
0023SettingsProfile(it0023).......................... OK (4.6 s)
0021PomProfile(it0021)............................... OK (4.9 s)
0019PluginVersionMngtBySuperPom(it0019).............. OK (5.1 s)
0018DependencyManagement(it0018)..................... OK (4.8 s)
0012PomInterpolation(it0012)......................... OK (4.4 s)
0011DefaultVersionByDependencyManagement(it0011)..... OK (4.6 s)
0010DependencyClosureResolution(it0010).............. OK (4.8 s)
0009GoalConfiguration(it0009)........................ OK (4.4 s)
0008SimplePlugin(it0008)............................. OK (4.6 s)
Tests run: 798, Failures: 0, Errors: 1, Skipped: 0, Time elapsed: 4,372.357 sec <<<
FAILURE! - in org.apache.maven.it.IntegrationTestSuite
testCoreExtensionRetrievedFromAMirrorWithBasicAuthentication(org.apache.maven.it.MavenITmng5771CoreExtensionsTest)
 Time elapsed: 6.235 sec  <<< ERROR!
org.apache.maven.it.VerificationException: Exit code was non-zero: 1; command line and log
= 
<https://builds.apache.org/job/core-it-maven-3-win/ws/apache-maven-3-SNAPSHOT\bin\mvn>
--global-settings F:\ws\m3-its\core-integration-testing-trunk\core-it-suite\target\test-classes\settings.xml
-s F:\ws\m3-its\core-integration-testing-trunk\core-it-suite\target\test-classes\mng-5771-core-extensions\settings.xml
-e --batch-mode -Dmaven.repo.local=<https://builds.apache.org/job/core-it-maven-3-win/ws/it-local-repo>
validate
[INFO] Downloading from repoman: http://localhost:55441/org/apache/maven/its/it-core-extensions/maven-it-core-extensions/0.1/maven-it-core-extensions-0.1.pom
[WARNING] Could not validate integrity of download from http://localhost:55441/org/apache/maven/its/it-core-extensions/maven-it-core-extensions/0.1/maven-it-core-extensions-0.1.pom:
Checksum validation failed, no checksums available
[WARNING] Checksum validation failed, no checksums available from repoman for http://localhost:55441/org/apache/maven/its/it-core-extensions/maven-it-core-extensions/0.1/maven-it-core-extensions-0.1.pom
[INFO] Downloaded from repoman: http://localhost:55441/org/apache/maven/its/it-core-extensions/maven-it-core-extensions/0.1/maven-it-core-extensions-0.1.pom
(1.9 kB at 4.0 kB/s)
[INFO] Downloading from repoman: http://localhost:55441/org/apache/maven/maven-core/3.0.3/maven-core-3.0.3.pom
[WARNING] Failed to read extensions descriptor F:\ws\m3-its\core-integration-testing-trunk\core-it-suite\target\test-classes\mng-5771-core-extensions\client\.mvn\extensions.xml:
Plugin org.apache.maven.its.it-core-extensions:maven-it-core-extensions:0.1 or one of its
dependencies could not be resolved: Failed to collect dependencies at org.apache.maven.its.it-core-extensions:maven-it-core-extensions:jar:0.1
-> org.apache.maven:maven-core:jar:3.0.3
[INFO] Error stacktraces are turned on.
[INFO] Scanning for projects...
[INFO] 
[INFO] ------------------------------------------------------------------------
[INFO] Building Maven Integration Test :: it-core-extensions 0.1
[INFO] ------------------------------------------------------------------------
[INFO] Downloading from repoman: http://localhost:55441/org/apache/maven/its/it-core-extensions/maven-it-plugin-core-extensions-client/0.1/maven-it-plugin-core-extensions-client-0.1.pom
[WARNING] Could not validate integrity of download from http://localhost:55441/org/apache/maven/its/it-core-extensions/maven-it-plugin-core-extensions-client/0.1/maven-it-plugin-core-extensions-client-0.1.pom:
Checksum validation failed, no checksums available
[WARNING] Checksum validation failed, no checksums available from repoman for http://localhost:55441/org/apache/maven/its/it-core-extensions/maven-it-plugin-core-extensions-client/0.1/maven-it-plugin-core-extensions-client-0.1.pom
[INFO] Downloaded from repoman: http://localhost:55441/org/apache/maven/its/it-core-extensions/maven-it-plugin-core-extensions-client/0.1/maven-it-plugin-core-extensions-client-0.1.pom
(2.2 kB at 145 kB/s)
[INFO] Downloading from repoman: http://localhost:55441/org/apache/maven/its/it-core-extensions/maven-it-plugin-core-extensions-client/0.1/maven-it-plugin-core-extensions-client-0.1.jar
[WARNING] Could not validate integrity of download from http://localhost:55441/org/apache/maven/its/it-core-extensions/maven-it-plugin-core-extensions-client/0.1/maven-it-plugin-core-extensions-client-0.1.jar:
Checksum validation failed, no checksums available
[WARNING] Checksum validation failed, no checksums available from repoman for http://localhost:55441/org/apache/maven/its/it-core-extensions/maven-it-plugin-core-extensions-client/0.1/maven-it-plugin-core-extensions-client-0.1.jar
[INFO] Downloaded from repoman: http://localhost:55441/org/apache/maven/its/it-core-extensions/maven-it-plugin-core-extensions-client/0.1/maven-it-plugin-core-extensions-client-0.1.jar
(6.4 kB at 426 kB/s)
[INFO] 
[INFO] --- maven-it-plugin-core-extensions-client:0.1:validate-component (validate-extensions)
@ test ---
[INFO] ------------------------------------------------------------------------
[INFO] BUILD FAILURE
[INFO] ------------------------------------------------------------------------
[INFO] Total time: 0.703 s
[INFO] Finished at: 2016-12-17T23:33:11-08:00
[INFO] Final Memory: 21M/736M
[INFO] ------------------------------------------------------------------------
[ERROR] Failed to execute goal org.apache.maven.its.it-core-extensions:maven-it-plugin-core-extensions-client:0.1:validate-component
(validate-extensions) on project test: Expected core extension component is not available
-> [Help 1]
org.apache.maven.lifecycle.LifecycleExecutionException: Failed to execute goal org.apache.maven.its.it-core-extensions:maven-it-plugin-core-extensions-client:0.1:validate-component
(validate-extensions) on project test: Expected core extension component is not available
	at org.apache.maven.lifecycle.internal.MojoExecutor.execute(MojoExecutor.java:214)
	at org.apache.maven.lifecycle.internal.MojoExecutor.execute(MojoExecutor.java:155)
	at org.apache.maven.lifecycle.internal.MojoExecutor.execute(MojoExecutor.java:147)
	at org.apache.maven.lifecycle.internal.LifecycleModuleBuilder.buildProject(LifecycleModuleBuilder.java:116)
	at org.apache.maven.lifecycle.internal.LifecycleModuleBuilder.buildProject(LifecycleModuleBuilder.java:80)
	at org.apache.maven.lifecycle.internal.builder.singlethreaded.SingleThreadedBuilder.build(SingleThreadedBuilder.java:51)
	at org.apache.maven.lifecycle.internal.LifecycleStarter.execute(LifecycleStarter.java:128)
	at org.apache.maven.DefaultMaven.doExecute(DefaultMaven.java:285)
	at org.apache.maven.DefaultMaven.doExecute(DefaultMaven.java:194)
	at org.apache.maven.DefaultMaven.execute(DefaultMaven.java:107)
	at org.apache.maven.cli.MavenCli.execute(MavenCli.java:1019)
	at org.apache.maven.cli.MavenCli.doMain(MavenCli.java:316)
	at org.apache.maven.cli.MavenCli.main(MavenCli.java:219)
	at sun.reflect.NativeMethodAccessorImpl.invoke0(Native Method)
	at sun.reflect.NativeMethodAccessorImpl.invoke(NativeMethodAccessorImpl.java:57)
	at sun.reflect.DelegatingMethodAccessorImpl.invoke(DelegatingMethodAccessorImpl.java:43)
	at java.lang.reflect.Method.invoke(Method.java:606)
	at org.codehaus.plexus.classworlds.launcher.Launcher.launchEnhanced(Launcher.java:289)
	at org.codehaus.plexus.classworlds.launcher.Launcher.launch(Launcher.java:229)
	at org.codehaus.plexus.classworlds.launcher.Launcher.mainWithExitCode(Launcher.java:415)
	at org.codehaus.plexus.classworlds.launcher.Launcher.main(Launcher.java:356)
Caused by: org.apache.maven.plugin.MojoExecutionException: Expected core extension component
is not available
	at org.apache.maven.its.it_core_extensions.plugin.ValidateComponentMojo.execute(ValidateComponentMojo.java:25)
	at org.apache.maven.plugin.DefaultBuildPluginManager.executeMojo(DefaultBuildPluginManager.java:134)
	at org.apache.maven.lifecycle.internal.MojoExecutor.execute(MojoExecutor.java:209)
	... 20 more
[ERROR] 
[ERROR] Re-run Maven using the -X switch to enable full debug logging.
[ERROR] 
[ERROR] For more information about the errors and possible solutions, please read the following
articles:
[ERROR] [Help 1] http://cwiki.apache.org/confluence/display/MAVEN/MojoExecutionException

	at org.apache.maven.it.Verifier.executeGoals(Verifier.java:1377)
	at org.apache.maven.it.Verifier.executeGoal(Verifier.java:1259)
	at org.apache.maven.it.Verifier.executeGoal(Verifier.java:1253)
	at org.apache.maven.it.MavenITmng5771CoreExtensionsTest.testCoreExtensionRetrievedFromAMirrorWithBasicAuthentication(MavenITmng5771CoreExtensionsTest.java:104)


Results :

Tests in error: 
  MavenITmng5771CoreExtensionsTest>AbstractMavenIntegrationTestCase.runTest:223->testCoreExtensionRetrievedFromAMirrorWithBasicAuthentication:104
ยป Verification

Tests run: 798, Failures: 0, Errors: 1, Skipped: 0

[INFO] ------------------------------------------------------------------------
[INFO] Reactor Summary:
[INFO] 
[INFO] Maven Core ITs ..................................... SUCCESS [ 25.510 s]
[INFO] Maven IT Support ................................... SUCCESS [  1.565 s]
[INFO] Maven IT :: Plugins ................................ SUCCESS [  1.402 s]
[INFO] Maven IT Plugin :: Active Collection ............... SUCCESS [  6.865 s]
[INFO] Maven IT Plugin :: Ant-Based ....................... SUCCESS [  4.317 s]
[INFO] Maven IT Plugin :: Artifact ........................ SUCCESS [  2.627 s]
[INFO] Maven IT Plugin :: Class Loader :: Dependency A .... SUCCESS [  1.203 s]
[INFO] Maven IT Plugin :: Class Loader :: Dependency B .... SUCCESS [  1.249 s]
[INFO] Maven IT Plugin :: Class Loader :: Dependency C .... SUCCESS [  1.118 s]
[INFO] Maven IT Plugin :: Class Loader .................... SUCCESS [  2.600 s]
[INFO] Maven IT Plugin :: Class Loader :: Aggregator ...... SUCCESS [  1.058 s]
[INFO] Maven IT Plugin :: Configuration ................... SUCCESS [  1.677 s]
[INFO] Maven IT Plugin :: Context Passing ................. SUCCESS [  1.272 s]
[INFO] Maven ITs :: Core Plugin Stubs ..................... SUCCESS [  1.197 s]
[INFO] Maven IT Clean Plugin Stub ......................... SUCCESS [  1.390 s]
[INFO] Maven IT Compiler Plugin Stub ...................... SUCCESS [  1.472 s]
[INFO] Maven IT Deploy Plugin Stub ........................ SUCCESS [  1.443 s]
[INFO] Maven IT EAR Plugin Stub ........................... SUCCESS [  1.417 s]
[INFO] Maven IT EJB Plugin Stub ........................... SUCCESS [  1.376 s]
[INFO] Maven IT Install Plugin Stub ....................... SUCCESS [  1.335 s]
[INFO] Maven IT JAR Plugin Stub ........................... SUCCESS [  1.353 s]
[INFO] Maven IT Javadoc Plugin Stub ....................... SUCCESS [  1.307 s]
[INFO] Maven IT Plugin Plugin Stub ........................ SUCCESS [  1.839 s]
[INFO] Maven IT RAR Plugin Stub ........................... SUCCESS [  1.363 s]
[INFO] Maven IT Resources Plugin Stub ..................... SUCCESS [  1.450 s]
[INFO] Maven IT Site Plugin Stub .......................... SUCCESS [  1.434 s]
[INFO] Maven IT Source Plugin Stub ........................ SUCCESS [  1.359 s]
[INFO] Maven IT Surefire Plugin Stub ...................... SUCCESS [  1.269 s]
[INFO] Maven IT WAR Plugin Stub ........................... SUCCESS [  1.317 s]
[INFO] Maven IT Plugin :: Dependency Collection ........... SUCCESS [  1.476 s]
[INFO] Maven IT Plugin :: Dependency Resolution ........... SUCCESS [  6.351 s]
[INFO] Maven IT Plugin :: Expression ...................... SUCCESS [  1.948 s]
[INFO] Maven IT Plugin :: Error Mojos ..................... SUCCESS [  2.361 s]
[INFO] Maven IT Component ................................. SUCCESS [  1.193 s]
[INFO] Maven IT Plugin :: Extension Consumer .............. SUCCESS [  1.291 s]
[INFO] Maven IT Plugin :: Extension Provider .............. SUCCESS [  1.289 s]
[INFO] Maven IT Plugin :: Fork ............................ SUCCESS [  1.465 s]
[INFO] Maven IT Plugin :: Invalid Descriptor .............. SUCCESS [  1.221 s]
[INFO] Maven IT Plugin :: Log File ........................ SUCCESS [  1.279 s]
[INFO] Maven IT Helper Library ............................ SUCCESS [  3.594 s]
[INFO] Maven IT Plugin :: Model Interpolation ............. SUCCESS [  1.696 s]
[INFO] Maven IT Plugin :: No Default Component ............ SUCCESS [  1.232 s]
[INFO] Maven IT Plugin :: No Project ...................... SUCCESS [  1.220 s]
[INFO] Maven IT Plugin :: Online .......................... SUCCESS [  1.315 s]
[INFO] Maven IT Plugin :: Optional Mojos .................. SUCCESS [  1.353 s]
[INFO] Maven IT Plugin :: Packaging ....................... SUCCESS [  1.174 s]
[INFO] Maven IT Plugin :: Parameter Implementation ........ SUCCESS [  1.188 s]
[INFO] Maven IT Plugin :: Plugin Dependency ............... SUCCESS [  1.298 s]
[INFO] Maven IT Plugin :: Project ......................... SUCCESS [  1.409 s]
[INFO] Maven IT Plugin :: Project Interpolation ........... SUCCESS [  1.528 s]
[INFO] Maven IT Plugin :: Setter .......................... SUCCESS [  1.219 s]
[INFO] Maven IT Plugin :: Singleton Component ............. SUCCESS [  1.286 s]
[INFO] Maven IT Plugin :: Site ............................ SUCCESS [  2.408 s]
[INFO] Maven IT Plugin :: Toolchain ....................... SUCCESS [  4.383 s]
[INFO] Maven IT Plugin :: Touch ........................... SUCCESS [  1.613 s]
[INFO] Maven IT Plugin :: Uses Properties Plugin .......... SUCCESS [  1.178 s]
[INFO] Maven IT Plugin :: Uses Wagon Plugin ............... SUCCESS [  2.198 s]
[INFO] Maven IT Plugin :: This plugin should contain the mojos needed by all tests. SUCCESS
[  1.391 s]
[INFO] Maven IT Plugin :: Plexus Utils 1.1 ................ SUCCESS [  1.283 s]
[INFO] Maven IT Plugin :: Plexus Utils New ................ SUCCESS [  1.291 s]
[INFO] Maven IT Plugin :: Plexus Component API ............ SUCCESS [  1.886 s]
[INFO] Maven IT Plugin :: Log4J Client .................... SUCCESS [  1.349 s]
[INFO] Maven IT Plugin :: Extension 1 ..................... SUCCESS [  1.178 s]
[INFO] Maven IT Plugin :: Extension 2 ..................... SUCCESS [  1.227 s]
[INFO] Maven IT Plugin :: Plexus Lifecycle ................ SUCCESS [  2.255 s]
[INFO] Maven IT Plugin :: Settings ........................ SUCCESS [  1.501 s]
[INFO] Maven IT Plugin :: mng-5805 extension .............. SUCCESS [  1.117 s]
[INFO] Maven IT Plugin :: mng-5805 plugin ................. SUCCESS [  1.321 s]
[INFO] Maven IT Plugin :: mng-5805 plugin-dep ............. SUCCESS [  1.600 s]
[INFO] Maven IT Plugin :: mng-5958 extension .............. SUCCESS [  3.398 s]
[INFO] Maven IT Toolchain ................................. SUCCESS [  1.997 s]
[INFO] Maven IT Wagon ..................................... SUCCESS [  1.396 s]
[INFO] Maven IT Support Artifacts ......................... SUCCESS [  3.073 s]
[INFO] Maven IT Extension ................................. SUCCESS [  1.105 s]
[INFO] Maven ITs .......................................... FAILURE [  01:13 h]
[INFO] ------------------------------------------------------------------------
[INFO] BUILD FAILURE
[INFO] ------------------------------------------------------------------------
[INFO] Total time: 01:15 h
[INFO] Finished at: 2016-12-18T00:42:25-08:00
[INFO] Final Memory: 61M/765M
[INFO] ------------------------------------------------------------------------
[ERROR] Failed to execute goal org.apache.maven.plugins:maven-surefire-plugin:2.18.1:test
(default-test) on project core-it-suite: There are test failures.
[ERROR] 
[ERROR] Please refer to F:\ws\m3-its\core-integration-testing-trunk\core-it-suite\target\surefire-reports
for the individual test results.
[ERROR] -> [Help 1]
org.apache.maven.lifecycle.LifecycleExecutionException: Failed to execute goal org.apache.maven.plugins:maven-surefire-plugin:2.18.1:test
(default-test) on project core-it-suite: There are test failures.

Please refer to F:\ws\m3-its\core-integration-testing-trunk\core-it-suite\target\surefire-reports
for the individual test results.
	at org.apache.maven.lifecycle.internal.MojoExecutor.execute(MojoExecutor.java:212)
	at org.apache.maven.lifecycle.internal.MojoExecutor.execute(MojoExecutor.java:153)
	at org.apache.maven.lifecycle.internal.MojoExecutor.execute(MojoExecutor.java:145)
	at org.apache.maven.lifecycle.internal.LifecycleModuleBuilder.buildProject(LifecycleModuleBuilder.java:116)
	at org.apache.maven.lifecycle.internal.LifecycleModuleBuilder.buildProject(LifecycleModuleBuilder.java:80)
	at org.apache.maven.lifecycle.internal.builder.singlethreaded.SingleThreadedBuilder.build(SingleThreadedBuilder.java:51)
	at org.apache.maven.lifecycle.internal.LifecycleStarter.execute(LifecycleStarter.java:128)
	at org.apache.maven.DefaultMaven.doExecute(DefaultMaven.java:307)
	at org.apache.maven.DefaultMaven.doExecute(DefaultMaven.java:193)
	at org.apache.maven.DefaultMaven.execute(DefaultMaven.java:106)
	at org.apache.maven.cli.MavenCli.execute(MavenCli.java:863)
	at org.apache.maven.cli.MavenCli.doMain(MavenCli.java:288)
	at org.apache.maven.cli.MavenCli.main(MavenCli.java:199)
	at sun.reflect.NativeMethodAccessorImpl.invoke0(Native Method)
	at sun.reflect.NativeMethodAccessorImpl.invoke(NativeMethodAccessorImpl.java:57)
	at sun.reflect.DelegatingMethodAccessorImpl.invoke(DelegatingMethodAccessorImpl.java:43)
	at java.lang.reflect.Method.invoke(Method.java:606)
	at org.codehaus.plexus.classworlds.launcher.Launcher.launchEnhanced(Launcher.java:289)
	at org.codehaus.plexus.classworlds.launcher.Launcher.launch(Launcher.java:229)
	at org.codehaus.plexus.classworlds.launcher.Launcher.mainWithExitCode(Launcher.java:415)
	at org.codehaus.plexus.classworlds.launcher.Launcher.main(Launcher.java:356)
Caused by: org.apache.maven.plugin.MojoFailureException: There are test failures.

Please refer to F:\ws\m3-its\core-integration-testing-trunk\core-it-suite\target\surefire-reports
for the individual test results.
	at org.apache.maven.plugin.surefire.SurefireHelper.reportExecution(SurefireHelper.java:82)
	at org.apache.maven.plugin.surefire.SurefirePlugin.handleSummary(SurefirePlugin.java:254)
	at org.apache.maven.plugin.surefire.AbstractSurefireMojo.executeAfterPreconditionsChecked(AbstractSurefireMojo.java:854)
	at org.apache.maven.plugin.surefire.AbstractSurefireMojo.execute(AbstractSurefireMojo.java:722)
	at org.apache.maven.plugin.DefaultBuildPluginManager.executeMojo(DefaultBuildPluginManager.java:134)
	at org.apache.maven.lifecycle.internal.MojoExecutor.execute(MojoExecutor.java:207)
	... 20 more
[ERROR] 
[ERROR] Re-run Maven using the -X switch to enable full debug logging.
[ERROR] 
[ERROR] For more information about the errors and possible solutions, please read the following
articles:
[ERROR] [Help 1] http://cwiki.apache.org/confluence/display/MAVEN/MojoFailureException
[ERROR] 
[ERROR] After correcting the problems, you can resume the build with the command
[ERROR]   mvn <goals> -rf :core-it-suite
Build step 'Invoke top-level Maven targets' marked build as failure
Recording test results

Mime
View raw message