maven-notifications mailing list archives

Site index · List index
Message view « Date » · « Thread »
Top « Date » · « Thread »
From Apache Jenkins Server <jenk...@builds.apache.org>
Subject Build failed in Jenkins: maven-plugins-ITs-m3-windows #1786
Date Sun, 18 Dec 2016 01:29:44 GMT
See <https://builds.apache.org/job/maven-plugins-ITs-m3-windows/1786/changes>

Changes:

[schulte] o Updated to latest parent SNAPSHOT.

------------------------------------------
Started by an SCM change
[EnvInject] - Loading node environment variables.
Building remotely on windows-2012-1 (Windows) in workspace <https://builds.apache.org/job/maven-plugins-ITs-m3-windows/ws/>
Updating http://svn.apache.org/repos/asf/maven/plugins/trunk at revision '2016-12-17T17:29:07.218
-0800'
U         maven-javadoc-plugin\pom.xml
U         maven-pdf-plugin\pom.xml
U         maven-compiler-plugin\pom.xml
U         maven-verifier-plugin\pom.xml
U         maven-jar-plugin\pom.xml
U         maven-invoker-plugin\pom.xml
U         maven-gpg-plugin\pom.xml
U         maven-dependency-plugin\pom.xml
U         maven-assembly-plugin\pom.xml
U         maven-repository-plugin\pom.xml
U         maven-pmd-plugin\pom.xml
U         maven-clean-plugin\pom.xml
U         maven-docck-plugin\pom.xml
U         maven-doap-plugin\pom.xml
U         maven-rar-plugin\pom.xml
U         maven-scm-publish-plugin\pom.xml
U         maven-help-plugin\pom.xml
U         maven-jmod-plugin\pom.xml
U         maven-linkcheck-plugin\pom.xml
U         maven-project-info-reports-plugin\pom.xml
U         maven-deploy-plugin\pom.xml
U         maven-patch-plugin\pom.xml
U         maven-ejb-plugin\pom.xml
U         maven-source-plugin\pom.xml
U         maven-toolchains-plugin\pom.xml
U         maven-acr-plugin\pom.xml
U         maven-jdeps-plugin\pom.xml
U         maven-install-plugin\pom.xml
U         maven-ear-plugin\pom.xml
U         maven-jlink-plugin\pom.xml
U         maven-antrun-plugin\pom.xml
U         maven-changes-plugin\pom.xml
U         maven-ant-plugin\pom.xml
U         maven-jarsigner-plugin\pom.xml
U         maven-shade-plugin\pom.xml
U         maven-changelog-plugin\pom.xml
U         maven-war-plugin\pom.xml
U         pom.xml
U         maven-checkstyle-plugin\pom.xml
U         maven-scripting-plugin\pom.xml
U         maven-remote-resources-plugin\pom.xml
U         maven-stage-plugin\pom.xml
U         maven-site-plugin\pom.xml
At revision 1774839

provisoning config files...
copy managed file [simple-deploy-settings-no-mirror] to file:/f:/jenkins/jenkins-slave/workspace/maven-plugins-ITs-m3-windows@tmp/config3474028504949681954tmp
[maven-plugins-ITs-m3-windows] $ cmd.exe /C "F:\jenkins\tools\maven\apache-maven-3.3.9\bin\mvn.cmd
clean install -Prun-its -U -B -V -fae -Papache.snapshots -s <https://builds.apache.org/job/maven-plugins-ITs-m3-windows/ws/@tmp\config3474028504949681954tmp>
&& exit %%ERRORLEVEL%%"
Apache Maven 3.3.9 (bb52d8502b132ec0a5a3f4c09453c07478323dc5; 2015-11-10T08:41:47-08:00)
Maven home: F:\jenkins\tools\maven\apache-maven-3.3.9
Java version: 1.7.0_79, vendor: Oracle Corporation
Java home: F:\hudson\tools\java\jdk1.7.0_79-unlimited-security\jre
Default locale: en_US, platform encoding: Cp1252
OS name: "windows server 2012 r2", version: "6.3", arch: "amd64", family: "windows"
[INFO] Scanning for projects...
[ERROR] [ERROR] Some problems were encountered while processing the POMs:
[FATAL] Non-resolvable parent POM for org.apache.maven.plugins:maven-plugins-aggregator:1-SNAPSHOT:
Could not find artifact org.apache.maven:maven-parent:pom:31-SNAPSHOT and 'parent.relativePath'
points at wrong local POM @ line 23, column 11
 @ 
[ERROR] The build could not read 1 project -> [Help 1]
[ERROR]   
[ERROR]   The project org.apache.maven.plugins:maven-plugins-aggregator:1-SNAPSHOT (<https://builds.apache.org/job/maven-plugins-ITs-m3-windows/ws/pom.xml)>
has 1 error
[ERROR]     Non-resolvable parent POM for org.apache.maven.plugins:maven-plugins-aggregator:1-SNAPSHOT:
Could not find artifact org.apache.maven:maven-parent:pom:31-SNAPSHOT and 'parent.relativePath'
points at wrong local POM @ line 23, column 11 -> [Help 2]
[ERROR] 
[ERROR] To see the full stack trace of the errors, re-run Maven with the -e switch.
[ERROR] Re-run Maven using the -X switch to enable full debug logging.
[ERROR] 
[ERROR] For more information about the errors and possible solutions, please read the following
articles:
[ERROR] [Help 1] http://cwiki.apache.org/confluence/display/MAVEN/ProjectBuildingException
[ERROR] [Help 2] http://cwiki.apache.org/confluence/display/MAVEN/UnresolvableModelException
Build step 'Invoke top-level Maven targets' marked build as failure
Deleting 1 temporary files
Recording test results
ERROR: Step ‘Publish JUnit test result report’ failed: Test reports were found but none
of them are new. Did tests run? 
For example, <https://builds.apache.org/job/maven-plugins-ITs-m3-windows/ws/maven-ant-plugin\target\it\single-test-it\target\test-reports\TEST-it.GoodTest.xml>
is 3 hr 56 min old



Mime
View raw message