maven-notifications mailing list archives

Site index · List index
Message view « Date » · « Thread »
Top « Date » · « Thread »
From Apache Jenkins Server <jenk...@builds.apache.org>
Subject Build failed in Jenkins: core-it-maven-3-win #1401
Date Sat, 17 Dec 2016 21:36:43 GMT
See <https://builds.apache.org/job/core-it-maven-3-win/1401/changes>

Changes:

[Michael Osipov] [MNG-5457] Show repository id when downloading or uploading from/to a

------------------------------------------
[...truncated 12189 lines...]
	... 26 more
Caused by: org.eclipse.aether.transfer.ArtifactNotFoundException: Failure to find org.codehaus.plexus:plexus-component-api:jar:1.0-alpha-16
in file:target/null was cached in the local repository, resolution will not be reattempted
until the update interval of central has elapsed or updates are forced
	at org.eclipse.aether.internal.impl.DefaultUpdateCheckManager.newException(DefaultUpdateCheckManager.java:233)
	at org.eclipse.aether.internal.impl.DefaultUpdateCheckManager.checkArtifact(DefaultUpdateCheckManager.java:208)
	at org.eclipse.aether.internal.impl.DefaultArtifactResolver.gatherDownloads(DefaultArtifactResolver.java:563)
	at org.eclipse.aether.internal.impl.DefaultArtifactResolver.performDownloads(DefaultArtifactResolver.java:481)
	at org.eclipse.aether.internal.impl.DefaultArtifactResolver.resolve(DefaultArtifactResolver.java:399)
	... 29 more
[ERROR] 
[ERROR] Re-run Maven using the -X switch to enable full debug logging.
[ERROR] 
[ERROR] For more information about the errors and possible solutions, please read the following
articles:
[ERROR] [Help 1] http://cwiki.apache.org/confluence/display/MAVEN/PluginResolutionException

	at org.apache.maven.it.Verifier.executeGoals(Verifier.java:1377)
	at org.apache.maven.it.Verifier.executeGoal(Verifier.java:1259)
	at org.apache.maven.it.Verifier.executeGoal(Verifier.java:1253)
	at org.apache.maven.it.MavenITmng3581PluginUsesWagonDependencyTest.testit(MavenITmng3581PluginUsesWagonDependencyTest.java:52)

testit0113(org.apache.maven.it.MavenIT0113ServerAuthzAvailableToWagonMgrInPluginTest)  Time
elapsed: 4.24 sec  <<< ERROR!
org.apache.maven.it.VerificationException: Exit code was non-zero: 1; command line and log
= 
<https://builds.apache.org/job/core-it-maven-3-win/ws/apache-maven-3-SNAPSHOT\bin\mvn>
--global-settings F:\ws\m3-its\core-integration-testing-trunk\core-it-suite\target\test-classes\settings.xml
--settings settings.xml -e --batch-mode -Dmaven.repo.local=<https://builds.apache.org/job/core-it-maven-3-win/ws/it-local-repo>
validate
[INFO] Error stacktraces are turned on.
[INFO] Scanning for projects...
[INFO] 
[INFO] ------------------------------------------------------------------------
[INFO] Building test 1.0-SNAPSHOT
[INFO] ------------------------------------------------------------------------
[INFO] 
[INFO] --- maven-it-plugin-uses-wagon:2.1-SNAPSHOT:dump-auth (test) @ test ---
[INFO] ------------------------------------------------------------------------
[INFO] BUILD FAILURE
[INFO] ------------------------------------------------------------------------
[INFO] Total time: 0.882 s
[INFO] Finished at: 2016-12-17T13:34:24-08:00
[INFO] Final Memory: 16M/736M
[INFO] ------------------------------------------------------------------------
[ERROR] Failed to execute goal org.apache.maven.its.plugins:maven-it-plugin-uses-wagon:2.1-SNAPSHOT:dump-auth
(test) on project test: Execution test of goal org.apache.maven.its.plugins:maven-it-plugin-uses-wagon:2.1-SNAPSHOT:dump-auth
failed: Plugin org.apache.maven.its.plugins:maven-it-plugin-uses-wagon:2.1-SNAPSHOT or one
of its dependencies could not be resolved: Failure to find org.codehaus.plexus:plexus-component-api:jar:1.0-alpha-16
in file:target/null was cached in the local repository, resolution will not be reattempted
until the update interval of central has elapsed or updates are forced -> [Help 1]
org.apache.maven.lifecycle.LifecycleExecutionException: Failed to execute goal org.apache.maven.its.plugins:maven-it-plugin-uses-wagon:2.1-SNAPSHOT:dump-auth
(test) on project test: Execution test of goal org.apache.maven.its.plugins:maven-it-plugin-uses-wagon:2.1-SNAPSHOT:dump-auth
failed: Plugin org.apache.maven.its.plugins:maven-it-plugin-uses-wagon:2.1-SNAPSHOT or one
of its dependencies could not be resolved: Failure to find org.codehaus.plexus:plexus-component-api:jar:1.0-alpha-16
in file:target/null was cached in the local repository, resolution will not be reattempted
until the update interval of central has elapsed or updates are forced
	at org.apache.maven.lifecycle.internal.MojoExecutor.execute(MojoExecutor.java:214)
	at org.apache.maven.lifecycle.internal.MojoExecutor.execute(MojoExecutor.java:155)
	at org.apache.maven.lifecycle.internal.MojoExecutor.execute(MojoExecutor.java:147)
	at org.apache.maven.lifecycle.internal.LifecycleModuleBuilder.buildProject(LifecycleModuleBuilder.java:116)
	at org.apache.maven.lifecycle.internal.LifecycleModuleBuilder.buildProject(LifecycleModuleBuilder.java:80)
	at org.apache.maven.lifecycle.internal.builder.singlethreaded.SingleThreadedBuilder.build(SingleThreadedBuilder.java:51)
	at org.apache.maven.lifecycle.internal.LifecycleStarter.execute(LifecycleStarter.java:128)
	at org.apache.maven.DefaultMaven.doExecute(DefaultMaven.java:285)
	at org.apache.maven.DefaultMaven.doExecute(DefaultMaven.java:194)
	at org.apache.maven.DefaultMaven.execute(DefaultMaven.java:107)
	at org.apache.maven.cli.MavenCli.execute(MavenCli.java:1019)
	at org.apache.maven.cli.MavenCli.doMain(MavenCli.java:316)
	at org.apache.maven.cli.MavenCli.main(MavenCli.java:219)
	at sun.reflect.NativeMethodAccessorImpl.invoke0(Native Method)
	at sun.reflect.NativeMethodAccessorImpl.invoke(NativeMethodAccessorImpl.java:57)
	at sun.reflect.DelegatingMethodAccessorImpl.invoke(DelegatingMethodAccessorImpl.java:43)
	at java.lang.reflect.Method.invoke(Method.java:606)
	at org.codehaus.plexus.classworlds.launcher.Launcher.launchEnhanced(Launcher.java:289)
	at org.codehaus.plexus.classworlds.launcher.Launcher.launch(Launcher.java:229)
	at org.codehaus.plexus.classworlds.launcher.Launcher.mainWithExitCode(Launcher.java:415)
	at org.codehaus.plexus.classworlds.launcher.Launcher.main(Launcher.java:356)
Caused by: org.apache.maven.plugin.PluginExecutionException: Execution test of goal org.apache.maven.its.plugins:maven-it-plugin-uses-wagon:2.1-SNAPSHOT:dump-auth
failed: Plugin org.apache.maven.its.plugins:maven-it-plugin-uses-wagon:2.1-SNAPSHOT or one
of its dependencies could not be resolved: Failure to find org.codehaus.plexus:plexus-component-api:jar:1.0-alpha-16
in file:target/null was cached in the local repository, resolution will not be reattempted
until the update interval of central has elapsed or updates are forced
	at org.apache.maven.plugin.DefaultBuildPluginManager.executeMojo(DefaultBuildPluginManager.java:106)
	at org.apache.maven.lifecycle.internal.MojoExecutor.execute(MojoExecutor.java:209)
	... 20 more
Caused by: org.apache.maven.plugin.PluginResolutionException: Plugin org.apache.maven.its.plugins:maven-it-plugin-uses-wagon:2.1-SNAPSHOT
or one of its dependencies could not be resolved: Failure to find org.codehaus.plexus:plexus-component-api:jar:1.0-alpha-16
in file:target/null was cached in the local repository, resolution will not be reattempted
until the update interval of central has elapsed or updates are forced
	at org.apache.maven.plugin.internal.DefaultPluginDependenciesResolver.resolveInternal(DefaultPluginDependenciesResolver.java:339)
	at org.apache.maven.plugin.internal.DefaultPluginDependenciesResolver.resolve(DefaultPluginDependenciesResolver.java:152)
	at org.apache.maven.plugin.internal.DefaultMavenPluginManager.createPluginRealm(DefaultMavenPluginManager.java:398)
	at org.apache.maven.plugin.internal.DefaultMavenPluginManager.setupPluginRealm(DefaultMavenPluginManager.java:370)
	at org.apache.maven.plugin.DefaultBuildPluginManager.getPluginRealm(DefaultBuildPluginManager.java:231)
	at org.apache.maven.plugin.DefaultBuildPluginManager.executeMojo(DefaultBuildPluginManager.java:102)
	... 21 more
Caused by: org.eclipse.aether.resolution.ArtifactResolutionException: Failure to find org.codehaus.plexus:plexus-component-api:jar:1.0-alpha-16
in file:target/null was cached in the local repository, resolution will not be reattempted
until the update interval of central has elapsed or updates are forced
	at org.eclipse.aether.internal.impl.DefaultArtifactResolver.resolve(DefaultArtifactResolver.java:422)
	at org.eclipse.aether.internal.impl.DefaultArtifactResolver.resolveArtifacts(DefaultArtifactResolver.java:224)
	at org.eclipse.aether.internal.impl.DefaultRepositorySystem.resolveDependencies(DefaultRepositorySystem.java:339)
	at org.apache.maven.plugin.internal.DefaultPluginDependenciesResolver.resolveInternal(DefaultPluginDependenciesResolver.java:330)
	... 26 more
Caused by: org.eclipse.aether.transfer.ArtifactNotFoundException: Failure to find org.codehaus.plexus:plexus-component-api:jar:1.0-alpha-16
in file:target/null was cached in the local repository, resolution will not be reattempted
until the update interval of central has elapsed or updates are forced
	at org.eclipse.aether.internal.impl.DefaultUpdateCheckManager.newException(DefaultUpdateCheckManager.java:233)
	at org.eclipse.aether.internal.impl.DefaultUpdateCheckManager.checkArtifact(DefaultUpdateCheckManager.java:208)
	at org.eclipse.aether.internal.impl.DefaultArtifactResolver.gatherDownloads(DefaultArtifactResolver.java:563)
	at org.eclipse.aether.internal.impl.DefaultArtifactResolver.performDownloads(DefaultArtifactResolver.java:481)
	at org.eclipse.aether.internal.impl.DefaultArtifactResolver.resolve(DefaultArtifactResolver.java:399)
	... 29 more
[ERROR] 
[ERROR] Re-run Maven using the -X switch to enable full debug logging.
[ERROR] 
[ERROR] For more information about the errors and possible solutions, please read the following
articles:
[ERROR] [Help 1] http://cwiki.apache.org/confluence/display/MAVEN/PluginResolutionException

	at org.apache.maven.it.Verifier.executeGoals(Verifier.java:1377)
	at org.apache.maven.it.Verifier.executeGoal(Verifier.java:1259)
	at org.apache.maven.it.Verifier.executeGoal(Verifier.java:1253)
	at org.apache.maven.it.MavenIT0113ServerAuthzAvailableToWagonMgrInPluginTest.testit0113(MavenIT0113ServerAuthzAvailableToWagonMgrInPluginTest.java:50)


Results :

Failed tests: 
  MavenITmng4196ExclusionOnPluginDepTest>AbstractMavenIntegrationTestCase.runTest:223->testit:59
Expected: <null> but was: 1864184191
  MavenITmng4274PluginRealmArtifactsTest>AbstractMavenIntegrationTestCase.runTest:223->testit:67
null
  MavenITmng4276WrongTransitivePlexusUtilsTest>AbstractMavenIntegrationTestCase.runTest:223->testit:65
null
  MavenITmng4580ProjectLevelPluginDepUsedForCliInvocInReactorTest>AbstractMavenIntegrationTestCase.runTest:223->testit:67
Expected: <null> but was: 763763032
Tests in error: 
  MavenIT0113ServerAuthzAvailableToWagonMgrInPluginTest>AbstractMavenIntegrationTestCase.runTest:223->testit0113:50
» Verification
  MavenITmng3581PluginUsesWagonDependencyTest>AbstractMavenIntegrationTestCase.runTest:223->testit:52
» Verification
  MavenITmng3805ExtensionClassPathOrderingTest>AbstractMavenIntegrationTestCase.runTest:223->testitMNG3805:58
» Verification
  MavenITmng4360WebDavSupportTest>AbstractMavenIntegrationTestCase.runTest:223->testitJackrabbitBasedImpl:62->test:133
» Verification
  MavenITmng4396AntBased20xMojoSupportTest>AbstractMavenIntegrationTestCase.runTest:223->testit:53
» Verification
  MavenITmng4474PerLookupWagonInstantiationTest>AbstractMavenIntegrationTestCase.runTest:223->testit:53
» Verification
  MavenITmng5771CoreExtensionsTest>AbstractMavenIntegrationTestCase.runTest:223->testCoreExtensionRetrievedFromAMirrorWithBasicAuthentication:104
» Verification
  MavenITmng5898BuildMultimoduleWithEARFailsToResolveWARTest>AbstractMavenIntegrationTestCase.runTest:223->testit:51
» Verification

Tests run: 798, Failures: 4, Errors: 8, Skipped: 0

[INFO] ------------------------------------------------------------------------
[INFO] Reactor Summary:
[INFO] 
[INFO] Maven Core ITs ..................................... SUCCESS [ 23.111 s]
[INFO] Maven IT Support ................................... SUCCESS [  1.241 s]
[INFO] Maven IT :: Plugins ................................ SUCCESS [  1.045 s]
[INFO] Maven IT Plugin :: Active Collection ............... SUCCESS [  6.329 s]
[INFO] Maven IT Plugin :: Ant-Based ....................... SUCCESS [  3.924 s]
[INFO] Maven IT Plugin :: Artifact ........................ SUCCESS [  2.021 s]
[INFO] Maven IT Plugin :: Class Loader :: Dependency A .... SUCCESS [  0.941 s]
[INFO] Maven IT Plugin :: Class Loader :: Dependency B .... SUCCESS [  0.950 s]
[INFO] Maven IT Plugin :: Class Loader :: Dependency C .... SUCCESS [  0.906 s]
[INFO] Maven IT Plugin :: Class Loader .................... SUCCESS [  2.122 s]
[INFO] Maven IT Plugin :: Class Loader :: Aggregator ...... SUCCESS [  0.825 s]
[INFO] Maven IT Plugin :: Configuration ................... SUCCESS [  1.370 s]
[INFO] Maven IT Plugin :: Context Passing ................. SUCCESS [  0.915 s]
[INFO] Maven ITs :: Core Plugin Stubs ..................... SUCCESS [  0.840 s]
[INFO] Maven IT Clean Plugin Stub ......................... SUCCESS [  1.093 s]
[INFO] Maven IT Compiler Plugin Stub ...................... SUCCESS [  1.155 s]
[INFO] Maven IT Deploy Plugin Stub ........................ SUCCESS [  1.049 s]
[INFO] Maven IT EAR Plugin Stub ........................... SUCCESS [  1.065 s]
[INFO] Maven IT EJB Plugin Stub ........................... SUCCESS [  1.065 s]
[INFO] Maven IT Install Plugin Stub ....................... SUCCESS [  1.033 s]
[INFO] Maven IT JAR Plugin Stub ........................... SUCCESS [  1.052 s]
[INFO] Maven IT Javadoc Plugin Stub ....................... SUCCESS [  1.017 s]
[INFO] Maven IT Plugin Plugin Stub ........................ SUCCESS [  1.417 s]
[INFO] Maven IT RAR Plugin Stub ........................... SUCCESS [  1.011 s]
[INFO] Maven IT Resources Plugin Stub ..................... SUCCESS [  1.071 s]
[INFO] Maven IT Site Plugin Stub .......................... SUCCESS [  1.134 s]
[INFO] Maven IT Source Plugin Stub ........................ SUCCESS [  1.042 s]
[INFO] Maven IT Surefire Plugin Stub ...................... SUCCESS [  1.015 s]
[INFO] Maven IT WAR Plugin Stub ........................... SUCCESS [  1.016 s]
[INFO] Maven IT Plugin :: Dependency Collection ........... SUCCESS [  1.048 s]
[INFO] Maven IT Plugin :: Dependency Resolution ........... SUCCESS [  4.225 s]
[INFO] Maven IT Plugin :: Expression ...................... SUCCESS [  1.440 s]
[INFO] Maven IT Plugin :: Error Mojos ..................... SUCCESS [  2.099 s]
[INFO] Maven IT Component ................................. SUCCESS [  0.872 s]
[INFO] Maven IT Plugin :: Extension Consumer .............. SUCCESS [  0.921 s]
[INFO] Maven IT Plugin :: Extension Provider .............. SUCCESS [  0.985 s]
[INFO] Maven IT Plugin :: Fork ............................ SUCCESS [  1.104 s]
[INFO] Maven IT Plugin :: Invalid Descriptor .............. SUCCESS [  0.920 s]
[INFO] Maven IT Plugin :: Log File ........................ SUCCESS [  0.932 s]
[INFO] Maven IT Helper Library ............................ SUCCESS [  3.929 s]
[INFO] Maven IT Plugin :: Model Interpolation ............. SUCCESS [  1.282 s]
[INFO] Maven IT Plugin :: No Default Component ............ SUCCESS [  0.899 s]
[INFO] Maven IT Plugin :: No Project ...................... SUCCESS [  0.889 s]
[INFO] Maven IT Plugin :: Online .......................... SUCCESS [  0.875 s]
[INFO] Maven IT Plugin :: Optional Mojos .................. SUCCESS [  1.054 s]
[INFO] Maven IT Plugin :: Packaging ....................... SUCCESS [  0.941 s]
[INFO] Maven IT Plugin :: Parameter Implementation ........ SUCCESS [  0.901 s]
[INFO] Maven IT Plugin :: Plugin Dependency ............... SUCCESS [  0.992 s]
[INFO] Maven IT Plugin :: Project ......................... SUCCESS [  1.124 s]
[INFO] Maven IT Plugin :: Project Interpolation ........... SUCCESS [  1.159 s]
[INFO] Maven IT Plugin :: Setter .......................... SUCCESS [  0.889 s]
[INFO] Maven IT Plugin :: Singleton Component ............. SUCCESS [  0.898 s]
[INFO] Maven IT Plugin :: Site ............................ SUCCESS [  1.940 s]
[INFO] Maven IT Plugin :: Toolchain ....................... SUCCESS [  3.753 s]
[INFO] Maven IT Plugin :: Touch ........................... SUCCESS [  1.237 s]
[INFO] Maven IT Plugin :: Uses Properties Plugin .......... SUCCESS [  0.872 s]
[INFO] Maven IT Plugin :: Uses Wagon Plugin ............... SUCCESS [  1.763 s]
[INFO] Maven IT Plugin :: This plugin should contain the mojos needed by all tests. SUCCESS
[  0.882 s]
[INFO] Maven IT Plugin :: Plexus Utils 1.1 ................ SUCCESS [  0.976 s]
[INFO] Maven IT Plugin :: Plexus Utils New ................ SUCCESS [  1.010 s]
[INFO] Maven IT Plugin :: Plexus Component API ............ SUCCESS [  1.471 s]
[INFO] Maven IT Plugin :: Log4J Client .................... SUCCESS [  1.020 s]
[INFO] Maven IT Plugin :: Extension 1 ..................... SUCCESS [  0.871 s]
[INFO] Maven IT Plugin :: Extension 2 ..................... SUCCESS [  0.908 s]
[INFO] Maven IT Plugin :: Plexus Lifecycle ................ SUCCESS [  1.640 s]
[INFO] Maven IT Plugin :: Settings ........................ SUCCESS [  1.037 s]
[INFO] Maven IT Plugin :: mng-5805 extension .............. SUCCESS [  0.817 s]
[INFO] Maven IT Plugin :: mng-5805 plugin ................. SUCCESS [  1.036 s]
[INFO] Maven IT Plugin :: mng-5805 plugin-dep ............. SUCCESS [  0.840 s]
[INFO] Maven IT Plugin :: mng-5958 extension .............. SUCCESS [  3.168 s]
[INFO] Maven IT Toolchain ................................. SUCCESS [  1.401 s]
[INFO] Maven IT Wagon ..................................... SUCCESS [  0.985 s]
[INFO] Maven IT Support Artifacts ......................... SUCCESS [  2.050 s]
[INFO] Maven IT Extension ................................. SUCCESS [  0.814 s]
[INFO] Maven ITs .......................................... FAILURE [  01:04 h]
[INFO] ------------------------------------------------------------------------
[INFO] BUILD FAILURE
[INFO] ------------------------------------------------------------------------
[INFO] Total time: 01:06 h
[INFO] Finished at: 2016-12-17T13:36:27-08:00
[INFO] Final Memory: 61M/765M
[INFO] ------------------------------------------------------------------------
[ERROR] Failed to execute goal org.apache.maven.plugins:maven-surefire-plugin:2.18.1:test
(default-test) on project core-it-suite: There are test failures.
[ERROR] 
[ERROR] Please refer to F:\ws\m3-its\core-integration-testing-trunk\core-it-suite\target\surefire-reports
for the individual test results.
[ERROR] -> [Help 1]
org.apache.maven.lifecycle.LifecycleExecutionException: Failed to execute goal org.apache.maven.plugins:maven-surefire-plugin:2.18.1:test
(default-test) on project core-it-suite: There are test failures.

Please refer to F:\ws\m3-its\core-integration-testing-trunk\core-it-suite\target\surefire-reports
for the individual test results.
	at org.apache.maven.lifecycle.internal.MojoExecutor.execute(MojoExecutor.java:212)
	at org.apache.maven.lifecycle.internal.MojoExecutor.execute(MojoExecutor.java:153)
	at org.apache.maven.lifecycle.internal.MojoExecutor.execute(MojoExecutor.java:145)
	at org.apache.maven.lifecycle.internal.LifecycleModuleBuilder.buildProject(LifecycleModuleBuilder.java:116)
	at org.apache.maven.lifecycle.internal.LifecycleModuleBuilder.buildProject(LifecycleModuleBuilder.java:80)
	at org.apache.maven.lifecycle.internal.builder.singlethreaded.SingleThreadedBuilder.build(SingleThreadedBuilder.java:51)
	at org.apache.maven.lifecycle.internal.LifecycleStarter.execute(LifecycleStarter.java:128)
	at org.apache.maven.DefaultMaven.doExecute(DefaultMaven.java:307)
	at org.apache.maven.DefaultMaven.doExecute(DefaultMaven.java:193)
	at org.apache.maven.DefaultMaven.execute(DefaultMaven.java:106)
	at org.apache.maven.cli.MavenCli.execute(MavenCli.java:863)
	at org.apache.maven.cli.MavenCli.doMain(MavenCli.java:288)
	at org.apache.maven.cli.MavenCli.main(MavenCli.java:199)
	at sun.reflect.NativeMethodAccessorImpl.invoke0(Native Method)
	at sun.reflect.NativeMethodAccessorImpl.invoke(NativeMethodAccessorImpl.java:57)
	at sun.reflect.DelegatingMethodAccessorImpl.invoke(DelegatingMethodAccessorImpl.java:43)
	at java.lang.reflect.Method.invoke(Method.java:606)
	at org.codehaus.plexus.classworlds.launcher.Launcher.launchEnhanced(Launcher.java:289)
	at org.codehaus.plexus.classworlds.launcher.Launcher.launch(Launcher.java:229)
	at org.codehaus.plexus.classworlds.launcher.Launcher.mainWithExitCode(Launcher.java:415)
	at org.codehaus.plexus.classworlds.launcher.Launcher.main(Launcher.java:356)
Caused by: org.apache.maven.plugin.MojoFailureException: There are test failures.

Please refer to F:\ws\m3-its\core-integration-testing-trunk\core-it-suite\target\surefire-reports
for the individual test results.
	at org.apache.maven.plugin.surefire.SurefireHelper.reportExecution(SurefireHelper.java:82)
	at org.apache.maven.plugin.surefire.SurefirePlugin.handleSummary(SurefirePlugin.java:254)
	at org.apache.maven.plugin.surefire.AbstractSurefireMojo.executeAfterPreconditionsChecked(AbstractSurefireMojo.java:854)
	at org.apache.maven.plugin.surefire.AbstractSurefireMojo.execute(AbstractSurefireMojo.java:722)
	at org.apache.maven.plugin.DefaultBuildPluginManager.executeMojo(DefaultBuildPluginManager.java:134)
	at org.apache.maven.lifecycle.internal.MojoExecutor.execute(MojoExecutor.java:207)
	... 20 more
[ERROR] 
[ERROR] Re-run Maven using the -X switch to enable full debug logging.
[ERROR] 
[ERROR] For more information about the errors and possible solutions, please read the following
articles:
[ERROR] [Help 1] http://cwiki.apache.org/confluence/display/MAVEN/MojoFailureException
[ERROR] 
[ERROR] After correcting the problems, you can resume the build with the command
[ERROR]   mvn <goals> -rf :core-it-suite
Build step 'Invoke top-level Maven targets' marked build as failure
Recording test results

Mime
View raw message