maven-notifications mailing list archives

Site index · List index
Message view « Date » · « Thread »
Top « Date » · « Thread »
From Apache Jenkins Server <jenk...@builds.apache.org>
Subject Build failed in Jenkins: maven-plugins-windows #1814
Date Mon, 07 Nov 2016 22:47:39 GMT
See <https://builds.apache.org/job/maven-plugins-windows/1814/changes>

Changes:

[andham] [MASSEMBLY-794] more updates to site docs for 3.0.0 release

[andham] Fixed some site formatting errors

------------------------------------------
[...truncated 5831 lines...]
[ERROR] /F:/jenkins/jenkins-slave/workspace/maven-plugins-windows/maven-assembly-plugin/src/main/java/org/apache/maven/plugins/assembly/mojos/AbstractAssemblyMojo.java:[561,16]
cannot find symbol
[ERROR] symbol:   variable FixedStringSearchInterpolator
[ERROR] location: class org.apache.maven.plugins.assembly.mojos.AbstractAssemblyMojo
[ERROR] /F:/jenkins/jenkins-slave/workspace/maven-plugins-windows/maven-assembly-plugin/src/main/java/org/apache/maven/plugins/assembly/mojos/AbstractAssemblyMojo.java:[577,9]
cannot find symbol
[ERROR] symbol:   class PropertiesBasedValueSource
[ERROR] location: class org.apache.maven.plugins.assembly.mojos.AbstractAssemblyMojo
[ERROR] /F:/jenkins/jenkins-slave/workspace/maven-plugins-windows/maven-assembly-plugin/src/main/java/org/apache/maven/plugins/assembly/mojos/AbstractAssemblyMojo.java:[577,51]
cannot find symbol
[ERROR] symbol:   class PropertiesBasedValueSource
[ERROR] location: class org.apache.maven.plugins.assembly.mojos.AbstractAssemblyMojo
[ERROR] /F:/jenkins/jenkins-slave/workspace/maven-plugins-windows/maven-assembly-plugin/src/main/java/org/apache/maven/plugins/assembly/mojos/AbstractAssemblyMojo.java:[578,16]
cannot find symbol
[ERROR] symbol:   variable FixedStringSearchInterpolator
[ERROR] location: class org.apache.maven.plugins.assembly.mojos.AbstractAssemblyMojo
[ERROR] /F:/jenkins/jenkins-slave/workspace/maven-plugins-windows/maven-assembly-plugin/src/main/java/org/apache/maven/plugins/assembly/mojos/AbstractAssemblyMojo.java:[584,9]
cannot find symbol
[ERROR] symbol:   class PrefixedPropertiesValueSource
[ERROR] location: class org.apache.maven.plugins.assembly.mojos.AbstractAssemblyMojo
[ERROR] /F:/jenkins/jenkins-slave/workspace/maven-plugins-windows/maven-assembly-plugin/src/main/java/org/apache/maven/plugins/assembly/mojos/AbstractAssemblyMojo.java:[584,54]
cannot find symbol
[ERROR] symbol:   class PrefixedPropertiesValueSource
[ERROR] location: class org.apache.maven.plugins.assembly.mojos.AbstractAssemblyMojo
[ERROR] /F:/jenkins/jenkins-slave/workspace/maven-plugins-windows/maven-assembly-plugin/src/main/java/org/apache/maven/plugins/assembly/mojos/AbstractAssemblyMojo.java:[587,16]
cannot find symbol
[ERROR] symbol:   variable FixedStringSearchInterpolator
[ERROR] location: class org.apache.maven.plugins.assembly.mojos.AbstractAssemblyMojo
[ERROR] /F:/jenkins/jenkins-slave/workspace/maven-plugins-windows/maven-assembly-plugin/src/main/java/org/apache/maven/plugins/assembly/interpolation/AssemblyExpressionEvaluator.java:[52,15]
cannot find symbol
[ERROR] symbol:   class FixedStringSearchInterpolator
[ERROR] location: class org.apache.maven.plugins.assembly.interpolation.AssemblyExpressionEvaluator
[ERROR] /F:/jenkins/jenkins-slave/workspace/maven-plugins-windows/maven-assembly-plugin/src/main/java/org/apache/maven/plugins/assembly/interpolation/AssemblyExpressionEvaluator.java:[78,9]
cannot find symbol
[ERROR] symbol:   class InterpolationState
[ERROR] location: class org.apache.maven.plugins.assembly.interpolation.AssemblyExpressionEvaluator
[ERROR] /F:/jenkins/jenkins-slave/workspace/maven-plugins-windows/maven-assembly-plugin/src/main/java/org/apache/maven/plugins/assembly/interpolation/AssemblyExpressionEvaluator.java:[78,37]
cannot find symbol
[ERROR] symbol:   class InterpolationState
[ERROR] location: class org.apache.maven.plugins.assembly.interpolation.AssemblyExpressionEvaluator
[ERROR] /F:/jenkins/jenkins-slave/workspace/maven-plugins-windows/maven-assembly-plugin/src/main/java/org/apache/maven/plugins/assembly/io/DefaultAssemblyReader.java:[84,58]
cannot find symbol
[ERROR] symbol:   class PrefixedPropertiesValueSource
[ERROR] location: class org.apache.maven.plugins.assembly.io.DefaultAssemblyReader
[ERROR] /F:/jenkins/jenkins-slave/workspace/maven-plugins-windows/maven-assembly-plugin/src/main/java/org/apache/maven/plugins/assembly/io/DefaultAssemblyReader.java:[86,58]
cannot find symbol
[ERROR] symbol:   class PrefixedObjectValueSource
[ERROR] location: class org.apache.maven.plugins.assembly.io.DefaultAssemblyReader
[ERROR] /F:/jenkins/jenkins-slave/workspace/maven-plugins-windows/maven-assembly-plugin/src/main/java/org/apache/maven/plugins/assembly/io/DefaultAssemblyReader.java:[84,16]
cannot find symbol
[ERROR] symbol:   variable FixedStringSearchInterpolator
[ERROR] location: class org.apache.maven.plugins.assembly.io.DefaultAssemblyReader
[ERROR] /F:/jenkins/jenkins-slave/workspace/maven-plugins-windows/maven-assembly-plugin/src/main/java/org/apache/maven/plugins/assembly/io/DefaultAssemblyReader.java:[341,13]
cannot find symbol
[ERROR] symbol:   class InterpolationState
[ERROR] location: class org.apache.maven.plugins.assembly.io.DefaultAssemblyReader
[ERROR] /F:/jenkins/jenkins-slave/workspace/maven-plugins-windows/maven-assembly-plugin/src/main/java/org/apache/maven/plugins/assembly/io/DefaultAssemblyReader.java:[341,41]
cannot find symbol
[ERROR] symbol:   class InterpolationState
[ERROR] location: class org.apache.maven.plugins.assembly.io.DefaultAssemblyReader
[ERROR] /F:/jenkins/jenkins-slave/workspace/maven-plugins-windows/maven-assembly-plugin/src/main/java/org/apache/maven/plugins/assembly/io/DefaultAssemblyReader.java:[346,13]
cannot find symbol
[ERROR] symbol:   class FixedStringSearchInterpolator
[ERROR] location: class org.apache.maven.plugins.assembly.io.DefaultAssemblyReader
[ERROR] /F:/jenkins/jenkins-slave/workspace/maven-plugins-windows/maven-assembly-plugin/src/main/java/org/apache/maven/plugins/assembly/utils/AssemblyFormatUtils.java:[87,20]
cannot find symbol
[ERROR] symbol:   variable FixedStringSearchInterpolator
[ERROR] location: class org.apache.maven.plugins.assembly.utils.AssemblyFormatUtils
[ERROR] /F:/jenkins/jenkins-slave/workspace/maven-plugins-windows/maven-assembly-plugin/src/main/java/org/apache/maven/plugins/assembly/utils/AssemblyFormatUtils.java:[90,58]
cannot find symbol
[ERROR] symbol:   class PropertiesBasedValueSource
[ERROR] location: class org.apache.maven.plugins.assembly.utils.AssemblyFormatUtils
[ERROR] /F:/jenkins/jenkins-slave/workspace/maven-plugins-windows/maven-assembly-plugin/src/main/java/org/apache/maven/plugins/assembly/utils/AssemblyFormatUtils.java:[90,16]
cannot find symbol
[ERROR] symbol:   variable FixedStringSearchInterpolator
[ERROR] location: class org.apache.maven.plugins.assembly.utils.AssemblyFormatUtils
[ERROR] /F:/jenkins/jenkins-slave/workspace/maven-plugins-windows/maven-assembly-plugin/src/main/java/org/apache/maven/plugins/assembly/utils/AssemblyFormatUtils.java:[99,21]
cannot find symbol
[ERROR] symbol:   class PrefixedObjectValueSource
[ERROR] location: class org.apache.maven.plugins.assembly.utils.AssemblyFormatUtils
[ERROR] /F:/jenkins/jenkins-slave/workspace/maven-plugins-windows/maven-assembly-plugin/src/main/java/org/apache/maven/plugins/assembly/utils/AssemblyFormatUtils.java:[100,21]
cannot find symbol
[ERROR] symbol:   class PrefixedPropertiesValueSource
[ERROR] location: class org.apache.maven.plugins.assembly.utils.AssemblyFormatUtils
[ERROR] /F:/jenkins/jenkins-slave/workspace/maven-plugins-windows/maven-assembly-plugin/src/main/java/org/apache/maven/plugins/assembly/utils/AssemblyFormatUtils.java:[102,27]
cannot find symbol
[ERROR] symbol:   class PrefixedObjectValueSource
[ERROR] location: class org.apache.maven.plugins.assembly.utils.AssemblyFormatUtils
[ERROR] /F:/jenkins/jenkins-slave/workspace/maven-plugins-windows/maven-assembly-plugin/src/main/java/org/apache/maven/plugins/assembly/utils/AssemblyFormatUtils.java:[98,20]
cannot find symbol
[ERROR] symbol:   variable FixedStringSearchInterpolator
[ERROR] location: class org.apache.maven.plugins.assembly.utils.AssemblyFormatUtils
[ERROR] /F:/jenkins/jenkins-slave/workspace/maven-plugins-windows/maven-assembly-plugin/src/main/java/org/apache/maven/plugins/assembly/utils/AssemblyFormatUtils.java:[107,20]
cannot find symbol
[ERROR] symbol:   variable FixedStringSearchInterpolator
[ERROR] location: class org.apache.maven.plugins.assembly.utils.AssemblyFormatUtils
[ERROR] /F:/jenkins/jenkins-slave/workspace/maven-plugins-windows/maven-assembly-plugin/src/main/java/org/apache/maven/plugins/assembly/utils/AssemblyFormatUtils.java:[117,62]
cannot find symbol
[ERROR] symbol:   class PrefixedObjectValueSource
[ERROR] location: class org.apache.maven.plugins.assembly.utils.AssemblyFormatUtils
[ERROR] /F:/jenkins/jenkins-slave/workspace/maven-plugins-windows/maven-assembly-plugin/src/main/java/org/apache/maven/plugins/assembly/utils/AssemblyFormatUtils.java:[118,62]
cannot find symbol
[ERROR] symbol:   class PrefixedObjectValueSource
[ERROR] location: class org.apache.maven.plugins.assembly.utils.AssemblyFormatUtils
[ERROR] /F:/jenkins/jenkins-slave/workspace/maven-plugins-windows/maven-assembly-plugin/src/main/java/org/apache/maven/plugins/assembly/utils/AssemblyFormatUtils.java:[121,62]
cannot find symbol
[ERROR] symbol:   class PrefixedObjectValueSource
[ERROR] location: class org.apache.maven.plugins.assembly.utils.AssemblyFormatUtils
[ERROR] /F:/jenkins/jenkins-slave/workspace/maven-plugins-windows/maven-assembly-plugin/src/main/java/org/apache/maven/plugins/assembly/utils/AssemblyFormatUtils.java:[117,20]
cannot find symbol
[ERROR] symbol:   variable FixedStringSearchInterpolator
[ERROR] location: class org.apache.maven.plugins.assembly.utils.AssemblyFormatUtils
[ERROR] /F:/jenkins/jenkins-slave/workspace/maven-plugins-windows/maven-assembly-plugin/src/main/java/org/apache/maven/plugins/assembly/utils/AssemblyFormatUtils.java:[128,20]
cannot find symbol
[ERROR] symbol:   variable FixedStringSearchInterpolator
[ERROR] location: class org.apache.maven.plugins.assembly.utils.AssemblyFormatUtils
[ERROR] /F:/jenkins/jenkins-slave/workspace/maven-plugins-windows/maven-assembly-plugin/src/main/java/org/apache/maven/plugins/assembly/utils/AssemblyFormatUtils.java:[138,13]
cannot find symbol
[ERROR] symbol:   class PrefixedObjectValueSource
[ERROR] location: class org.apache.maven.plugins.assembly.utils.AssemblyFormatUtils
[ERROR] /F:/jenkins/jenkins-slave/workspace/maven-plugins-windows/maven-assembly-plugin/src/main/java/org/apache/maven/plugins/assembly/utils/AssemblyFormatUtils.java:[141,26]
cannot find symbol
[ERROR] symbol:   class PrefixedObjectValueSource
[ERROR] location: class org.apache.maven.plugins.assembly.utils.AssemblyFormatUtils
[ERROR] /F:/jenkins/jenkins-slave/workspace/maven-plugins-windows/maven-assembly-plugin/src/main/java/org/apache/maven/plugins/assembly/utils/AssemblyFormatUtils.java:[145,21]
cannot find symbol
[ERROR] symbol:   class PrefixedObjectValueSource
[ERROR] location: class org.apache.maven.plugins.assembly.utils.AssemblyFormatUtils
[ERROR] /F:/jenkins/jenkins-slave/workspace/maven-plugins-windows/maven-assembly-plugin/src/main/java/org/apache/maven/plugins/assembly/utils/AssemblyFormatUtils.java:[146,21]
cannot find symbol
[ERROR] symbol:   class PrefixedPropertiesValueSource
[ERROR] location: class org.apache.maven.plugins.assembly.utils.AssemblyFormatUtils
[ERROR] /F:/jenkins/jenkins-slave/workspace/maven-plugins-windows/maven-assembly-plugin/src/main/java/org/apache/maven/plugins/assembly/utils/AssemblyFormatUtils.java:[144,20]
cannot find symbol
[ERROR] symbol:   variable FixedStringSearchInterpolator
[ERROR] location: class org.apache.maven.plugins.assembly.utils.AssemblyFormatUtils
[ERROR] /F:/jenkins/jenkins-slave/workspace/maven-plugins-windows/maven-assembly-plugin/src/main/java/org/apache/maven/plugins/assembly/utils/AssemblyFormatUtils.java:[152,20]
cannot find symbol
[ERROR] symbol:   variable FixedStringSearchInterpolator
[ERROR] location: class org.apache.maven.plugins.assembly.utils.AssemblyFormatUtils
[ERROR] /F:/jenkins/jenkins-slave/workspace/maven-plugins-windows/maven-assembly-plugin/src/main/java/org/apache/maven/plugins/assembly/utils/AssemblyFormatUtils.java:[161,58]
cannot find symbol
[ERROR] symbol:   class PrefixedObjectValueSource
[ERROR] location: class org.apache.maven.plugins.assembly.utils.AssemblyFormatUtils
[ERROR] /F:/jenkins/jenkins-slave/workspace/maven-plugins-windows/maven-assembly-plugin/src/main/java/org/apache/maven/plugins/assembly/utils/AssemblyFormatUtils.java:[162,58]
cannot find symbol
[ERROR] symbol:   class PrefixedObjectValueSource
[ERROR] location: class org.apache.maven.plugins.assembly.utils.AssemblyFormatUtils
[ERROR] /F:/jenkins/jenkins-slave/workspace/maven-plugins-windows/maven-assembly-plugin/src/main/java/org/apache/maven/plugins/assembly/utils/AssemblyFormatUtils.java:[164,58]
cannot find symbol
[ERROR] symbol:   class PrefixedObjectValueSource
[ERROR] location: class org.apache.maven.plugins.assembly.utils.AssemblyFormatUtils
[ERROR] /F:/jenkins/jenkins-slave/workspace/maven-plugins-windows/maven-assembly-plugin/src/main/java/org/apache/maven/plugins/assembly/utils/AssemblyFormatUtils.java:[161,16]
cannot find symbol
[ERROR] symbol:   variable FixedStringSearchInterpolator
[ERROR] location: class org.apache.maven.plugins.assembly.utils.AssemblyFormatUtils
[ERROR] /F:/jenkins/jenkins-slave/workspace/maven-plugins-windows/maven-assembly-plugin/src/main/java/org/apache/maven/plugins/assembly/utils/AssemblyFormatUtils.java:[186,58]
cannot find symbol
[ERROR] symbol:   class PropertiesBasedValueSource
[ERROR] location: class org.apache.maven.plugins.assembly.utils.AssemblyFormatUtils
[ERROR] -> [Help 1]
org.apache.maven.lifecycle.LifecycleExecutionException: Failed to execute goal org.apache.maven.plugins:maven-compiler-plugin:3.5.1:compile
(default-compile) on project maven-assembly-plugin: Compilation failure
	at org.apache.maven.lifecycle.internal.MojoExecutor.execute(MojoExecutor.java:213)
	at org.apache.maven.lifecycle.internal.MojoExecutor.execute(MojoExecutor.java:153)
	at org.apache.maven.lifecycle.internal.MojoExecutor.execute(MojoExecutor.java:145)
	at org.apache.maven.lifecycle.internal.LifecycleModuleBuilder.buildProject(LifecycleModuleBuilder.java:84)
	at org.apache.maven.lifecycle.internal.LifecycleModuleBuilder.buildProject(LifecycleModuleBuilder.java:59)
	at org.apache.maven.lifecycle.internal.LifecycleStarter.singleThreadedBuild(LifecycleStarter.java:183)
	at org.apache.maven.lifecycle.internal.LifecycleStarter.execute(LifecycleStarter.java:161)
	at org.apache.maven.DefaultMaven.doExecute(DefaultMaven.java:320)
	at org.apache.maven.DefaultMaven.execute(DefaultMaven.java:156)
	at org.jvnet.hudson.maven3.launcher.Maven3Launcher.main(Maven3Launcher.java:117)
	at sun.reflect.NativeMethodAccessorImpl.invoke0(Native Method)
	at sun.reflect.NativeMethodAccessorImpl.invoke(NativeMethodAccessorImpl.java:57)
	at sun.reflect.DelegatingMethodAccessorImpl.invoke(DelegatingMethodAccessorImpl.java:43)
	at java.lang.reflect.Method.invoke(Method.java:606)
	at org.codehaus.plexus.classworlds.launcher.Launcher.launchStandard(Launcher.java:329)
	at org.codehaus.plexus.classworlds.launcher.Launcher.launch(Launcher.java:239)
	at org.jvnet.hudson.maven3.agent.Maven3Main.launch(Maven3Main.java:181)
	at sun.reflect.NativeMethodAccessorImpl.invoke0(Native Method)
	at sun.reflect.NativeMethodAccessorImpl.invoke(NativeMethodAccessorImpl.java:57)
	at sun.reflect.DelegatingMethodAccessorImpl.invoke(DelegatingMethodAccessorImpl.java:43)
	at java.lang.reflect.Method.invoke(Method.java:606)
	at hudson.maven.Maven3Builder.call(Maven3Builder.java:136)
	at hudson.maven.Maven3Builder.call(Maven3Builder.java:71)
	at hudson.remoting.UserRequest.perform(UserRequest.java:120)
	at hudson.remoting.UserRequest.perform(UserRequest.java:48)
	at hudson.remoting.Request$2.run(Request.java:326)
	at hudson.remoting.InterceptingExecutorService$1.call(InterceptingExecutorService.java:68)
	at java.util.concurrent.FutureTask.run(FutureTask.java:262)
	at java.util.concurrent.ThreadPoolExecutor.runWorker(ThreadPoolExecutor.java:1145)
	at java.util.concurrent.ThreadPoolExecutor$Worker.run(ThreadPoolExecutor.java:615)
	at java.lang.Thread.run(Thread.java:745)
Caused by: org.apache.maven.plugin.compiler.CompilationFailureException: Compilation failure
	at org.apache.maven.plugin.compiler.AbstractCompilerMojo.execute(AbstractCompilerMojo.java:972)
	at org.apache.maven.plugin.compiler.CompilerMojo.execute(CompilerMojo.java:129)
	at org.apache.maven.plugin.DefaultBuildPluginManager.executeMojo(DefaultBuildPluginManager.java:101)
	at org.apache.maven.lifecycle.internal.MojoExecutor.execute(MojoExecutor.java:209)
	... 30 more
[ERROR] 
[ERROR] Re-run Maven using the -X switch to enable full debug logging.
[ERROR] 
[ERROR] For more information about the errors and possible solutions, please read the following
articles:
[ERROR] [Help 1] http://cwiki.apache.org/confluence/display/MAVEN/MojoFailureException
[ERROR] 
[ERROR] After correcting the problems, you can resume the build with the command
[ERROR]   mvn <goals> -rf :maven-assembly-plugin
[JENKINS] Archiving F:\jenkins\jenkins-slave\workspace\maven-plugins-windows\maven-antrun-plugin\pom.xml
to org.apache.maven.plugins/maven-antrun-plugin/1.9-SNAPSHOT/maven-antrun-plugin-1.9-SNAPSHOT.pom
[JENKINS] Archiving F:\jenkins\jenkins-slave\workspace\maven-plugins-windows\maven-antrun-plugin\target\maven-antrun-plugin-1.9-SNAPSHOT.jar
to org.apache.maven.plugins/maven-antrun-plugin/1.9-SNAPSHOT/maven-antrun-plugin-1.9-SNAPSHOT.jar
[JENKINS] Archiving F:\jenkins\jenkins-slave\workspace\maven-plugins-windows\maven-linkcheck-plugin\pom.xml
to org.apache.maven.plugins/maven-linkcheck-plugin/1.3-SNAPSHOT/maven-linkcheck-plugin-1.3-SNAPSHOT.pom
[JENKINS] Archiving F:\jenkins\jenkins-slave\workspace\maven-plugins-windows\maven-linkcheck-plugin\target\maven-linkcheck-plugin-1.3-SNAPSHOT.jar
to org.apache.maven.plugins/maven-linkcheck-plugin/1.3-SNAPSHOT/maven-linkcheck-plugin-1.3-SNAPSHOT.jar
[JENKINS] Archiving F:\jenkins\jenkins-slave\workspace\maven-plugins-windows\maven-scm-publish-plugin\pom.xml
to org.apache.maven.plugins/maven-scm-publish-plugin/1.2-SNAPSHOT/maven-scm-publish-plugin-1.2-SNAPSHOT.pom
[JENKINS] Archiving F:\jenkins\jenkins-slave\workspace\maven-plugins-windows\maven-scm-publish-plugin\target\maven-scm-publish-plugin-1.2-SNAPSHOT.jar
to org.apache.maven.plugins/maven-scm-publish-plugin/1.2-SNAPSHOT/maven-scm-publish-plugin-1.2-SNAPSHOT.jar
[JENKINS] Archiving F:\jenkins\jenkins-slave\workspace\maven-plugins-windows\maven-acr-plugin\pom.xml
to org.apache.maven.plugins/maven-acr-plugin/3.0.1-SNAPSHOT/maven-acr-plugin-3.0.1-SNAPSHOT.pom
[JENKINS] Archiving F:\jenkins\jenkins-slave\workspace\maven-plugins-windows\maven-acr-plugin\target\maven-acr-plugin-3.0.1-SNAPSHOT.jar
to org.apache.maven.plugins/maven-acr-plugin/3.0.1-SNAPSHOT/maven-acr-plugin-3.0.1-SNAPSHOT.jar
[JENKINS] Archiving F:\jenkins\jenkins-slave\workspace\maven-plugins-windows\maven-install-plugin\pom.xml
to org.apache.maven.plugins/maven-install-plugin/3.0.0-SNAPSHOT/maven-install-plugin-3.0.0-SNAPSHOT.pom
[JENKINS] Archiving F:\jenkins\jenkins-slave\workspace\maven-plugins-windows\maven-install-plugin\target\maven-install-plugin-3.0.0-SNAPSHOT.jar
to org.apache.maven.plugins/maven-install-plugin/3.0.0-SNAPSHOT/maven-install-plugin-3.0.0-SNAPSHOT.jar
[JENKINS] Archiving F:\jenkins\jenkins-slave\workspace\maven-plugins-windows\maven-assembly-plugin\pom.xml
to org.apache.maven.plugins/maven-assembly-plugin/3.0.0-SNAPSHOT/maven-assembly-plugin-3.0.0-SNAPSHOT.pom
[JENKINS] Archiving F:\jenkins\jenkins-slave\workspace\maven-plugins-windows\maven-docck-plugin\pom.xml
to org.apache.maven.plugins/maven-docck-plugin/1.2-SNAPSHOT/maven-docck-plugin-1.2-SNAPSHOT.pom
[JENKINS] Archiving F:\jenkins\jenkins-slave\workspace\maven-plugins-windows\maven-docck-plugin\target\maven-docck-plugin-1.2-SNAPSHOT.jar
to org.apache.maven.plugins/maven-docck-plugin/1.2-SNAPSHOT/maven-docck-plugin-1.2-SNAPSHOT.jar
[JENKINS] Archiving <https://builds.apache.org/job/maven-plugins-windows/ws/pom.xml>
to org.apache.maven.plugins/maven-plugins-aggregator/1-SNAPSHOT/maven-plugins-aggregator-1-SNAPSHOT.pom
[JENKINS] Archiving F:\jenkins\jenkins-slave\workspace\maven-plugins-windows\maven-clean-plugin\pom.xml
to org.apache.maven.plugins/maven-clean-plugin/3.0.1-SNAPSHOT/maven-clean-plugin-3.0.1-SNAPSHOT.pom
[JENKINS] Archiving F:\jenkins\jenkins-slave\workspace\maven-plugins-windows\maven-clean-plugin\target\maven-clean-plugin-3.0.1-SNAPSHOT.jar
to org.apache.maven.plugins/maven-clean-plugin/3.0.1-SNAPSHOT/maven-clean-plugin-3.0.1-SNAPSHOT.jar
[JENKINS] Archiving F:\jenkins\jenkins-slave\workspace\maven-plugins-windows\maven-resources-plugin\pom.xml
to org.apache.maven.plugins/maven-resources-plugin/3.0.2-SNAPSHOT/maven-resources-plugin-3.0.2-SNAPSHOT.pom
[JENKINS] Archiving F:\jenkins\jenkins-slave\workspace\maven-plugins-windows\maven-resources-plugin\target\maven-resources-plugin-3.0.2-SNAPSHOT.jar
to org.apache.maven.plugins/maven-resources-plugin/3.0.2-SNAPSHOT/maven-resources-plugin-3.0.2-SNAPSHOT.jar
[JENKINS] Archiving F:\jenkins\jenkins-slave\workspace\maven-plugins-windows\maven-pmd-plugin\pom.xml
to org.apache.maven.plugins/maven-pmd-plugin/3.8-SNAPSHOT/maven-pmd-plugin-3.8-SNAPSHOT.pom
[JENKINS] Archiving F:\jenkins\jenkins-slave\workspace\maven-plugins-windows\maven-pmd-plugin\target\maven-pmd-plugin-3.8-SNAPSHOT.jar
to org.apache.maven.plugins/maven-pmd-plugin/3.8-SNAPSHOT/maven-pmd-plugin-3.8-SNAPSHOT.jar
[JENKINS] Archiving F:\jenkins\jenkins-slave\workspace\maven-plugins-windows\maven-shade-plugin\pom.xml
to org.apache.maven.plugins/maven-shade-plugin/3.0.0-SNAPSHOT/maven-shade-plugin-3.0.0-SNAPSHOT.pom
[JENKINS] Archiving F:\jenkins\jenkins-slave\workspace\maven-plugins-windows\maven-shade-plugin\target\maven-shade-plugin-3.0.0-SNAPSHOT.jar
to org.apache.maven.plugins/maven-shade-plugin/3.0.0-SNAPSHOT/maven-shade-plugin-3.0.0-SNAPSHOT.jar
[JENKINS] Archiving F:\jenkins\jenkins-slave\workspace\maven-plugins-windows\maven-toolchains-plugin\pom.xml
to org.apache.maven.plugins/maven-toolchains-plugin/3.0.0-SNAPSHOT/maven-toolchains-plugin-3.0.0-SNAPSHOT.pom
[JENKINS] Archiving F:\jenkins\jenkins-slave\workspace\maven-plugins-windows\maven-toolchains-plugin\target\maven-toolchains-plugin-3.0.0-SNAPSHOT.jar
to org.apache.maven.plugins/maven-toolchains-plugin/3.0.0-SNAPSHOT/maven-toolchains-plugin-3.0.0-SNAPSHOT.jar
[JENKINS] Archiving F:\jenkins\jenkins-slave\workspace\maven-plugins-windows\maven-remote-resources-plugin\pom.xml
to org.apache.maven.plugins/maven-remote-resources-plugin/1.6-SNAPSHOT/maven-remote-resources-plugin-1.6-SNAPSHOT.pom
[JENKINS] Archiving F:\jenkins\jenkins-slave\workspace\maven-plugins-windows\maven-remote-resources-plugin\target\maven-remote-resources-plugin-1.6-SNAPSHOT.jar
to org.apache.maven.plugins/maven-remote-resources-plugin/1.6-SNAPSHOT/maven-remote-resources-plugin-1.6-SNAPSHOT.jar
[JENKINS] Archiving F:\jenkins\jenkins-slave\workspace\maven-plugins-windows\maven-project-info-reports-plugin\pom.xml
to org.apache.maven.plugins/maven-project-info-reports-plugin/2.10-SNAPSHOT/maven-project-info-reports-plugin-2.10-SNAPSHOT.pom
[JENKINS] Archiving F:\jenkins\jenkins-slave\workspace\maven-plugins-windows\maven-project-info-reports-plugin\target\maven-project-info-reports-plugin-2.10-SNAPSHOT.jar
to org.apache.maven.plugins/maven-project-info-reports-plugin/2.10-SNAPSHOT/maven-project-info-reports-plugin-2.10-SNAPSHOT.jar
[JENKINS] Archiving F:\jenkins\jenkins-slave\workspace\maven-plugins-windows\maven-patch-plugin\pom.xml
to org.apache.maven.plugins/maven-patch-plugin/1.3-SNAPSHOT/maven-patch-plugin-1.3-SNAPSHOT.pom
[JENKINS] Archiving F:\jenkins\jenkins-slave\workspace\maven-plugins-windows\maven-patch-plugin\target\maven-patch-plugin-1.3-SNAPSHOT.jar
to org.apache.maven.plugins/maven-patch-plugin/1.3-SNAPSHOT/maven-patch-plugin-1.3-SNAPSHOT.jar
[JENKINS] Archiving F:\jenkins\jenkins-slave\workspace\maven-plugins-windows\maven-compiler-plugin\pom.xml
to org.apache.maven.plugins/maven-compiler-plugin/3.6.1-SNAPSHOT/maven-compiler-plugin-3.6.1-SNAPSHOT.pom
[JENKINS] Archiving F:\jenkins\jenkins-slave\workspace\maven-plugins-windows\maven-compiler-plugin\target\maven-compiler-plugin-3.6.1-SNAPSHOT.jar
to org.apache.maven.plugins/maven-compiler-plugin/3.6.1-SNAPSHOT/maven-compiler-plugin-3.6.1-SNAPSHOT.jar
[JENKINS] Archiving F:\jenkins\jenkins-slave\workspace\maven-plugins-windows\maven-stage-plugin\pom.xml
to org.apache.maven.plugins/maven-stage-plugin/1.1-SNAPSHOT/maven-stage-plugin-1.1-SNAPSHOT.pom
[JENKINS] Archiving F:\jenkins\jenkins-slave\workspace\maven-plugins-windows\maven-stage-plugin\target\maven-stage-plugin-1.1-SNAPSHOT.jar
to org.apache.maven.plugins/maven-stage-plugin/1.1-SNAPSHOT/maven-stage-plugin-1.1-SNAPSHOT.jar
[JENKINS] Archiving F:\jenkins\jenkins-slave\workspace\maven-plugins-windows\maven-verifier-plugin\pom.xml
to org.apache.maven.plugins/maven-verifier-plugin/3.0.0-SNAPSHOT/maven-verifier-plugin-3.0.0-SNAPSHOT.pom
[JENKINS] Archiving F:\jenkins\jenkins-slave\workspace\maven-plugins-windows\maven-verifier-plugin\target\maven-verifier-plugin-3.0.0-SNAPSHOT.jar
to org.apache.maven.plugins/maven-verifier-plugin/3.0.0-SNAPSHOT/maven-verifier-plugin-3.0.0-SNAPSHOT.jar
[JENKINS] Archiving F:\jenkins\jenkins-slave\workspace\maven-plugins-windows\maven-ant-plugin\pom.xml
to org.apache.maven.plugins/maven-ant-plugin/2.5-SNAPSHOT/maven-ant-plugin-2.5-SNAPSHOT.pom
[JENKINS] Archiving F:\jenkins\jenkins-slave\workspace\maven-plugins-windows\maven-ant-plugin\target\maven-ant-plugin-2.5-SNAPSHOT.jar
to org.apache.maven.plugins/maven-ant-plugin/2.5-SNAPSHOT/maven-ant-plugin-2.5-SNAPSHOT.jar
[JENKINS] Archiving F:\jenkins\jenkins-slave\workspace\maven-plugins-windows\maven-jarsigner-plugin\pom.xml
to org.apache.maven.plugins/maven-jarsigner-plugin/1.5-SNAPSHOT/maven-jarsigner-plugin-1.5-SNAPSHOT.pom
[JENKINS] Archiving F:\jenkins\jenkins-slave\workspace\maven-plugins-windows\maven-jarsigner-plugin\target\maven-jarsigner-plugin-1.5-SNAPSHOT.jar
to org.apache.maven.plugins/maven-jarsigner-plugin/1.5-SNAPSHOT/maven-jarsigner-plugin-1.5-SNAPSHOT.jar
[JENKINS] Archiving F:\jenkins\jenkins-slave\workspace\maven-plugins-windows\maven-ejb-plugin\pom.xml
to org.apache.maven.plugins/maven-ejb-plugin/2.5.2-SNAPSHOT/maven-ejb-plugin-2.5.2-SNAPSHOT.pom
[JENKINS] Archiving F:\jenkins\jenkins-slave\workspace\maven-plugins-windows\maven-ejb-plugin\target\maven-ejb-plugin-2.5.2-SNAPSHOT.jar
to org.apache.maven.plugins/maven-ejb-plugin/2.5.2-SNAPSHOT/maven-ejb-plugin-2.5.2-SNAPSHOT.jar
[JENKINS] Archiving F:\jenkins\jenkins-slave\workspace\maven-plugins-windows\maven-changelog-plugin\pom.xml
to org.apache.maven.plugins/maven-changelog-plugin/2.4-SNAPSHOT/maven-changelog-plugin-2.4-SNAPSHOT.pom
[JENKINS] Archiving F:\jenkins\jenkins-slave\workspace\maven-plugins-windows\maven-changelog-plugin\target\maven-changelog-plugin-2.4-SNAPSHOT.jar
to org.apache.maven.plugins/maven-changelog-plugin/2.4-SNAPSHOT/maven-changelog-plugin-2.4-SNAPSHOT.jar
[JENKINS] Archiving F:\jenkins\jenkins-slave\workspace\maven-plugins-windows\maven-help-plugin\pom.xml
to org.apache.maven.plugins/maven-help-plugin/2.2.1-SNAPSHOT/maven-help-plugin-2.2.1-SNAPSHOT.pom
[JENKINS] Archiving F:\jenkins\jenkins-slave\workspace\maven-plugins-windows\maven-help-plugin\target\maven-help-plugin-2.2.1-SNAPSHOT.jar
to org.apache.maven.plugins/maven-help-plugin/2.2.1-SNAPSHOT/maven-help-plugin-2.2.1-SNAPSHOT.jar
[JENKINS] Archiving F:\jenkins\jenkins-slave\workspace\maven-plugins-windows\maven-war-plugin\pom.xml
to org.apache.maven.plugins/maven-war-plugin/3.0.1-SNAPSHOT/maven-war-plugin-3.0.1-SNAPSHOT.pom
[JENKINS] Archiving F:\jenkins\jenkins-slave\workspace\maven-plugins-windows\maven-war-plugin\target\maven-war-plugin-3.0.1-SNAPSHOT.jar
to org.apache.maven.plugins/maven-war-plugin/3.0.1-SNAPSHOT/maven-war-plugin-3.0.1-SNAPSHOT.jar
[JENKINS] Archiving F:\jenkins\jenkins-slave\workspace\maven-plugins-windows\maven-ear-plugin\pom.xml
to org.apache.maven.plugins/maven-ear-plugin/3.0.0-SNAPSHOT/maven-ear-plugin-3.0.0-SNAPSHOT.pom
[JENKINS] Archiving F:\jenkins\jenkins-slave\workspace\maven-plugins-windows\maven-ear-plugin\target\maven-ear-plugin-3.0.0-SNAPSHOT.jar
to org.apache.maven.plugins/maven-ear-plugin/3.0.0-SNAPSHOT/maven-ear-plugin-3.0.0-SNAPSHOT.jar
[JENKINS] Archiving F:\jenkins\jenkins-slave\workspace\maven-plugins-windows\maven-invoker-plugin\pom.xml
to org.apache.maven.plugins/maven-invoker-plugin/3.0.0-SNAPSHOT/maven-invoker-plugin-3.0.0-SNAPSHOT.pom
[JENKINS] Archiving F:\jenkins\jenkins-slave\workspace\maven-plugins-windows\maven-invoker-plugin\target\maven-invoker-plugin-3.0.0-SNAPSHOT.jar
to org.apache.maven.plugins/maven-invoker-plugin/3.0.0-SNAPSHOT/maven-invoker-plugin-3.0.0-SNAPSHOT.jar
[JENKINS] Archiving F:\jenkins\jenkins-slave\workspace\maven-plugins-windows\maven-jdeps-plugin\pom.xml
to org.apache.maven.plugins/maven-jdeps-plugin/3.0.1-SNAPSHOT/maven-jdeps-plugin-3.0.1-SNAPSHOT.pom
[JENKINS] Archiving F:\jenkins\jenkins-slave\workspace\maven-plugins-windows\maven-jdeps-plugin\target\maven-jdeps-plugin-3.0.1-SNAPSHOT.jar
to org.apache.maven.plugins/maven-jdeps-plugin/3.0.1-SNAPSHOT/maven-jdeps-plugin-3.0.1-SNAPSHOT.jar
[JENKINS] Archiving F:\jenkins\jenkins-slave\workspace\maven-plugins-windows\maven-doap-plugin\pom.xml
to org.apache.maven.plugins/maven-doap-plugin/1.3-SNAPSHOT/maven-doap-plugin-1.3-SNAPSHOT.pom
[JENKINS] Archiving F:\jenkins\jenkins-slave\workspace\maven-plugins-windows\maven-doap-plugin\target\maven-doap-plugin-1.3-SNAPSHOT.jar
to org.apache.maven.plugins/maven-doap-plugin/1.3-SNAPSHOT/maven-doap-plugin-1.3-SNAPSHOT.jar
[JENKINS] Archiving F:\jenkins\jenkins-slave\workspace\maven-plugins-windows\maven-site-plugin\dependency-reduced-pom.xml
to org.apache.maven.plugins/maven-site-plugin/3.7-SNAPSHOT/maven-site-plugin-3.7-SNAPSHOT.pom
[JENKINS] Archiving F:\jenkins\jenkins-slave\workspace\maven-plugins-windows\maven-site-plugin\target\maven-site-plugin-3.7-SNAPSHOT.jar
to org.apache.maven.plugins/maven-site-plugin/3.7-SNAPSHOT/maven-site-plugin-3.7-SNAPSHOT.jar
[JENKINS] Archiving F:\jenkins\jenkins-slave\workspace\maven-plugins-windows\maven-changes-plugin\pom.xml
to org.apache.maven.plugins/maven-changes-plugin/3.0.0-SNAPSHOT/maven-changes-plugin-3.0.0-SNAPSHOT.pom
[JENKINS] Archiving F:\jenkins\jenkins-slave\workspace\maven-plugins-windows\maven-changes-plugin\target\maven-changes-plugin-3.0.0-SNAPSHOT.jar
to org.apache.maven.plugins/maven-changes-plugin/3.0.0-SNAPSHOT/maven-changes-plugin-3.0.0-SNAPSHOT.jar
[JENKINS] Archiving F:\jenkins\jenkins-slave\workspace\maven-plugins-windows\maven-deploy-plugin\pom.xml
to org.apache.maven.plugins/maven-deploy-plugin/3.0.0-SNAPSHOT/maven-deploy-plugin-3.0.0-SNAPSHOT.pom
[JENKINS] Archiving F:\jenkins\jenkins-slave\workspace\maven-plugins-windows\maven-deploy-plugin\target\maven-deploy-plugin-3.0.0-SNAPSHOT.jar
to org.apache.maven.plugins/maven-deploy-plugin/3.0.0-SNAPSHOT/maven-deploy-plugin-3.0.0-SNAPSHOT.jar
[JENKINS] Archiving F:\jenkins\jenkins-slave\workspace\maven-plugins-windows\maven-repository-plugin\pom.xml
to org.apache.maven.plugins/maven-repository-plugin/2.5-SNAPSHOT/maven-repository-plugin-2.5-SNAPSHOT.pom
[JENKINS] Archiving F:\jenkins\jenkins-slave\workspace\maven-plugins-windows\maven-repository-plugin\target\maven-repository-plugin-2.5-SNAPSHOT.jar
to org.apache.maven.plugins/maven-repository-plugin/2.5-SNAPSHOT/maven-repository-plugin-2.5-SNAPSHOT.jar
[JENKINS] Archiving F:\jenkins\jenkins-slave\workspace\maven-plugins-windows\maven-source-plugin\pom.xml
to org.apache.maven.plugins/maven-source-plugin/3.0.2-SNAPSHOT/maven-source-plugin-3.0.2-SNAPSHOT.pom
[JENKINS] Archiving F:\jenkins\jenkins-slave\workspace\maven-plugins-windows\maven-source-plugin\target\maven-source-plugin-3.0.2-SNAPSHOT.jar
to org.apache.maven.plugins/maven-source-plugin/3.0.2-SNAPSHOT/maven-source-plugin-3.0.2-SNAPSHOT.jar
[JENKINS] Archiving F:\jenkins\jenkins-slave\workspace\maven-plugins-windows\maven-pdf-plugin\pom.xml
to org.apache.maven.plugins/maven-pdf-plugin/1.4-SNAPSHOT/maven-pdf-plugin-1.4-SNAPSHOT.pom
[JENKINS] Archiving F:\jenkins\jenkins-slave\workspace\maven-plugins-windows\maven-pdf-plugin\target\maven-pdf-plugin-1.4-SNAPSHOT.jar
to org.apache.maven.plugins/maven-pdf-plugin/1.4-SNAPSHOT/maven-pdf-plugin-1.4-SNAPSHOT.jar
[JENKINS] Archiving F:\jenkins\jenkins-slave\workspace\maven-plugins-windows\maven-jar-plugin\pom.xml
to org.apache.maven.plugins/maven-jar-plugin/3.0.3-SNAPSHOT/maven-jar-plugin-3.0.3-SNAPSHOT.pom
[JENKINS] Archiving F:\jenkins\jenkins-slave\workspace\maven-plugins-windows\maven-jar-plugin\target\maven-jar-plugin-3.0.3-SNAPSHOT.jar
to org.apache.maven.plugins/maven-jar-plugin/3.0.3-SNAPSHOT/maven-jar-plugin-3.0.3-SNAPSHOT.jar
[JENKINS] Archiving F:\jenkins\jenkins-slave\workspace\maven-plugins-windows\maven-javadoc-plugin\pom.xml
to org.apache.maven.plugins/maven-javadoc-plugin/3.0.0-SNAPSHOT/maven-javadoc-plugin-3.0.0-SNAPSHOT.pom
[JENKINS] Archiving F:\jenkins\jenkins-slave\workspace\maven-plugins-windows\maven-javadoc-plugin\target\maven-javadoc-plugin-3.0.0-SNAPSHOT.jar
to org.apache.maven.plugins/maven-javadoc-plugin/3.0.0-SNAPSHOT/maven-javadoc-plugin-3.0.0-SNAPSHOT.jar
Compressed 414.89 KB of artifacts by 23.1% relative to #1813
[JENKINS] Archiving F:\jenkins\jenkins-slave\workspace\maven-plugins-windows\maven-dependency-plugin\pom.xml
to org.apache.maven.plugins/maven-dependency-plugin/3.0.0-SNAPSHOT/maven-dependency-plugin-3.0.0-SNAPSHOT.pom
[JENKINS] Archiving F:\jenkins\jenkins-slave\workspace\maven-plugins-windows\maven-dependency-plugin\target\maven-dependency-plugin-3.0.0-SNAPSHOT.jar
to org.apache.maven.plugins/maven-dependency-plugin/3.0.0-SNAPSHOT/maven-dependency-plugin-3.0.0-SNAPSHOT.jar
[JENKINS] Archiving F:\jenkins\jenkins-slave\workspace\maven-plugins-windows\maven-rar-plugin\pom.xml
to org.apache.maven.plugins/maven-rar-plugin/3.0.0-SNAPSHOT/maven-rar-plugin-3.0.0-SNAPSHOT.pom
[JENKINS] Archiving F:\jenkins\jenkins-slave\workspace\maven-plugins-windows\maven-rar-plugin\target\maven-rar-plugin-3.0.0-SNAPSHOT.jar
to org.apache.maven.plugins/maven-rar-plugin/3.0.0-SNAPSHOT/maven-rar-plugin-3.0.0-SNAPSHOT.jar
[JENKINS] Archiving F:\jenkins\jenkins-slave\workspace\maven-plugins-windows\maven-checkstyle-plugin\pom.xml
to org.apache.maven.plugins/maven-checkstyle-plugin/2.18-SNAPSHOT/maven-checkstyle-plugin-2.18-SNAPSHOT.pom
[JENKINS] Archiving F:\jenkins\jenkins-slave\workspace\maven-plugins-windows\maven-checkstyle-plugin\target\maven-checkstyle-plugin-2.18-SNAPSHOT.jar
to org.apache.maven.plugins/maven-checkstyle-plugin/2.18-SNAPSHOT/maven-checkstyle-plugin-2.18-SNAPSHOT.jar
Sending e-mails to: notifications@maven.apache.org andham@apache.org
channel stopped
[WARNINGS] Skipping publisher since build result is FAILURE

Mime
View raw message