maven-notifications mailing list archives

Site index · List index
Message view « Date » · « Thread »
Top « Date » · « Thread »
From Apache Jenkins Server <jenk...@builds.apache.org>
Subject Build failed in Jenkins: core-it-maven-3-win #1368
Date Sun, 13 Nov 2016 23:44:01 GMT
See <https://builds.apache.org/job/core-it-maven-3-win/1368/changes>

Changes:

[hboutemy] MNG-3507 added support for multi-lines error message with color

[gboue] [MNG-6117] ${session.parallel} not correctly set

[hboutemy] forgot to remove the comment...

------------------------------------------
[...truncated 11398 lines...]
	at org.codehaus.plexus.classworlds.launcher.Launcher.mainWithExitCode(Launcher.java:415)
	at org.codehaus.plexus.classworlds.launcher.Launcher.main(Launcher.java:356)
[ERROR]   
[ERROR]   The project org.apache.maven.its.mng3599:test:1.0-SNAPSHOT (F:\ws\m3-its\core-integration-testing-trunk\core-it-suite\target\test-classes\mng-3599\pom.xml)
has 1 error
[ERROR]     Unresolveable build extension: Plugin org.apache.maven.wagon:wagon-webdav-jackrabbit:2.0
or one of its dependencies could not be resolved: Failed to read artifact descriptor for org.apache.maven.wagon:wagon-webdav-jackrabbit:jar:2.0:
Could not transfer artifact org.apache.maven.wagon:wagon-webdav-jackrabbit:pom:2.0 from/to
test-mirror (dav://www.example.com/): Cannot access dav://www.example.com/ with type default
using the available connector factories: BasicRepositoryConnectorFactory: Cannot access dav://www.example.com/
using the registered transporter factories: WagonTransporterFactory: java.util.NoSuchElementException
[ERROR]           role: org.apache.maven.wagon.Wagon
[ERROR]       roleHint: dav
[ERROR]     -> [Help 2]
org.apache.maven.plugin.PluginManagerException: Plugin org.apache.maven.wagon:wagon-webdav-jackrabbit:2.0
or one of its dependencies could not be resolved: Failed to read artifact descriptor for org.apache.maven.wagon:wagon-webdav-jackrabbit:jar:2.0
	at org.apache.maven.plugin.internal.DefaultMavenPluginManager.setupExtensionsRealm(DefaultMavenPluginManager.java:844)
	at org.apache.maven.project.DefaultProjectBuildingHelper.createProjectRealm(DefaultProjectBuildingHelper.java:196)
	at org.apache.maven.project.DefaultModelBuildingListener.buildExtensionsAssembled(DefaultModelBuildingListener.java:99)
	at org.apache.maven.model.building.ModelBuildingEventCatapult$1.fire(ModelBuildingEventCatapult.java:44)
	at org.apache.maven.model.building.DefaultModelBuilder.fireEvent(DefaultModelBuilder.java:1698)
	at org.apache.maven.model.building.DefaultModelBuilder.build(DefaultModelBuilder.java:515)
	at org.apache.maven.project.DefaultProjectBuilder.build(DefaultProjectBuilder.java:580)
	at org.apache.maven.project.DefaultProjectBuilder.build(DefaultProjectBuilder.java:371)
	at org.apache.maven.graph.DefaultGraphBuilder.collectProjects(DefaultGraphBuilder.java:419)
	at org.apache.maven.graph.DefaultGraphBuilder.getProjectsForMavenReactor(DefaultGraphBuilder.java:410)
	at org.apache.maven.graph.DefaultGraphBuilder.build(DefaultGraphBuilder.java:83)
	at org.apache.maven.DefaultMaven.buildGraph(DefaultMaven.java:516)
	at org.apache.maven.DefaultMaven.doExecute(DefaultMaven.java:214)
	at org.apache.maven.DefaultMaven.doExecute(DefaultMaven.java:194)
	at org.apache.maven.DefaultMaven.execute(DefaultMaven.java:107)
	at org.apache.maven.cli.MavenCli.execute(MavenCli.java:1018)
	at org.apache.maven.cli.MavenCli.doMain(MavenCli.java:316)
	at org.apache.maven.cli.MavenCli.main(MavenCli.java:219)
	at sun.reflect.NativeMethodAccessorImpl.invoke0(Native Method)
	at sun.reflect.NativeMethodAccessorImpl.invoke(NativeMethodAccessorImpl.java:57)
	at sun.reflect.DelegatingMethodAccessorImpl.invoke(DelegatingMethodAccessorImpl.java:43)
	at java.lang.reflect.Method.invoke(Method.java:606)
	at org.codehaus.plexus.classworlds.launcher.Launcher.launchEnhanced(Launcher.java:289)
	at org.codehaus.plexus.classworlds.launcher.Launcher.launch(Launcher.java:229)
	at org.codehaus.plexus.classworlds.launcher.Launcher.mainWithExitCode(Launcher.java:415)
	at org.codehaus.plexus.classworlds.launcher.Launcher.main(Launcher.java:356)
Caused by: org.apache.maven.plugin.PluginResolutionException: Plugin org.apache.maven.wagon:wagon-webdav-jackrabbit:2.0
or one of its dependencies could not be resolved: Failed to read artifact descriptor for org.apache.maven.wagon:wagon-webdav-jackrabbit:jar:2.0
	at org.apache.maven.plugin.internal.DefaultPluginDependenciesResolver.resolveInternal(DefaultPluginDependenciesResolver.java:214)
	at org.apache.maven.plugin.internal.DefaultPluginDependenciesResolver.resolve(DefaultPluginDependenciesResolver.java:149)
	at org.apache.maven.plugin.internal.DefaultMavenPluginManager.resolveExtensionArtifacts(DefaultMavenPluginManager.java:906)
	at org.apache.maven.plugin.internal.DefaultMavenPluginManager.setupExtensionsRealm(DefaultMavenPluginManager.java:837)
	... 25 more
Caused by: org.eclipse.aether.collection.DependencyCollectionException: Failed to read artifact
descriptor for org.apache.maven.wagon:wagon-webdav-jackrabbit:jar:2.0
	at org.eclipse.aether.internal.impl.DefaultDependencyCollector.collectDependencies(DefaultDependencyCollector.java:208)
	at org.eclipse.aether.internal.impl.DefaultRepositorySystem.collectDependencies(DefaultRepositorySystem.java:316)
	at org.apache.maven.plugin.internal.DefaultPluginDependenciesResolver.resolveInternal(DefaultPluginDependenciesResolver.java:202)
	... 28 more
Caused by: org.eclipse.aether.resolution.ArtifactDescriptorException: Failed to read artifact
descriptor for org.apache.maven.wagon:wagon-webdav-jackrabbit:jar:2.0
	at org.apache.maven.repository.internal.DefaultArtifactDescriptorReader.loadPom(DefaultArtifactDescriptorReader.java:282)
	at org.apache.maven.repository.internal.DefaultArtifactDescriptorReader.readArtifactDescriptor(DefaultArtifactDescriptorReader.java:198)
	at org.eclipse.aether.internal.impl.DefaultDependencyCollector.collectDependencies(DefaultDependencyCollector.java:202)
	... 30 more
Caused by: org.eclipse.aether.resolution.ArtifactResolutionException: Could not transfer artifact
org.apache.maven.wagon:wagon-webdav-jackrabbit:pom:2.0 from/to test-mirror (dav://www.example.com/):
Cannot access dav://www.example.com/ with type default using the available connector factories:
BasicRepositoryConnectorFactory
	at org.eclipse.aether.internal.impl.DefaultArtifactResolver.resolve(DefaultArtifactResolver.java:444)
	at org.eclipse.aether.internal.impl.DefaultArtifactResolver.resolveArtifacts(DefaultArtifactResolver.java:246)
	at org.eclipse.aether.internal.impl.DefaultArtifactResolver.resolveArtifact(DefaultArtifactResolver.java:223)
	at org.apache.maven.repository.internal.DefaultArtifactDescriptorReader.loadPom(DefaultArtifactDescriptorReader.java:267)
	... 32 more
Caused by: org.eclipse.aether.transfer.ArtifactTransferException: Could not transfer artifact
org.apache.maven.wagon:wagon-webdav-jackrabbit:pom:2.0 from/to test-mirror (dav://www.example.com/):
Cannot access dav://www.example.com/ with type default using the available connector factories:
BasicRepositoryConnectorFactory
	at org.eclipse.aether.internal.impl.DefaultArtifactResolver.performDownloads(DefaultArtifactResolver.java:531)
	at org.eclipse.aether.internal.impl.DefaultArtifactResolver.resolve(DefaultArtifactResolver.java:421)
	... 35 more
Caused by: org.eclipse.aether.transfer.NoRepositoryConnectorException: Cannot access dav://www.example.com/
with type default using the available connector factories: BasicRepositoryConnectorFactory
	at org.eclipse.aether.internal.impl.DefaultRepositoryConnectorProvider.newRepositoryConnector(DefaultRepositoryConnectorProvider.java:174)
	at org.eclipse.aether.internal.impl.DefaultArtifactResolver.performDownloads(DefaultArtifactResolver.java:516)
	... 36 more
Caused by: org.eclipse.aether.transfer.NoRepositoryConnectorException: Cannot access dav://www.example.com/
using the registered transporter factories: WagonTransporterFactory
	at org.eclipse.aether.connector.basic.BasicRepositoryConnector.<init>(BasicRepositoryConnector.java:119)
	at org.eclipse.aether.connector.basic.BasicRepositoryConnectorFactory.newInstance(BasicRepositoryConnectorFactory.java:180)
	at org.eclipse.aether.internal.impl.DefaultRepositoryConnectorProvider.newRepositoryConnector(DefaultRepositoryConnectorProvider.java:113)
	... 37 more
Caused by: org.eclipse.aether.transfer.NoTransporterException: Cannot access dav://www.example.com/
using the registered transporter factories: WagonTransporterFactory
	at org.eclipse.aether.internal.impl.DefaultTransporterProvider.newTransporter(DefaultTransporterProvider.java:151)
	at org.eclipse.aether.connector.basic.BasicRepositoryConnector.<init>(BasicRepositoryConnector.java:115)
	... 39 more
Caused by: org.eclipse.aether.transfer.NoTransporterException: java.util.NoSuchElementException
      role: org.apache.maven.wagon.Wagon
  roleHint: dav
	at org.eclipse.aether.transport.wagon.WagonTransporter.<init>(WagonTransporter.java:120)
	at org.eclipse.aether.transport.wagon.WagonTransporterFactory.newInstance(WagonTransporterFactory.java:127)
	at org.eclipse.aether.internal.impl.DefaultTransporterProvider.newTransporter(DefaultTransporterProvider.java:110)
	... 40 more
Caused by: org.codehaus.plexus.component.repository.exception.ComponentLookupException: java.util.NoSuchElementException
      role: org.apache.maven.wagon.Wagon
  roleHint: dav
	at org.codehaus.plexus.DefaultPlexusContainer.lookup(DefaultPlexusContainer.java:267)
	at org.codehaus.plexus.DefaultPlexusContainer.lookup(DefaultPlexusContainer.java:255)
	at org.eclipse.aether.internal.transport.wagon.PlexusWagonProvider.lookup(PlexusWagonProvider.java:58)
	at org.eclipse.aether.transport.wagon.WagonTransporter.lookupWagon(WagonTransporter.java:271)
	at org.eclipse.aether.transport.wagon.WagonTransporter.<init>(WagonTransporter.java:115)
	... 42 more
Caused by: java.util.NoSuchElementException
	at org.eclipse.sisu.plexus.RealmFilteredBeans$FilteredItr.next(RealmFilteredBeans.java:118)
	at org.eclipse.sisu.plexus.RealmFilteredBeans$FilteredItr.next(RealmFilteredBeans.java:1)
	at org.eclipse.sisu.plexus.DefaultPlexusBeans$Itr.next(DefaultPlexusBeans.java:76)
	at org.eclipse.sisu.plexus.DefaultPlexusBeans$Itr.next(DefaultPlexusBeans.java:1)
	at org.codehaus.plexus.DefaultPlexusContainer.lookup(DefaultPlexusContainer.java:263)
	... 46 more
[ERROR] 
[ERROR] 
[ERROR] For more information about the errors and possible solutions, please read the following
articles:
[ERROR] [Help 1] http://cwiki.apache.org/confluence/display/MAVEN/ProjectBuildingException
[ERROR] [Help 2] http://cwiki.apache.org/confluence/display/MAVEN/PluginManagerException

	at org.apache.maven.it.Verifier.executeGoals(Verifier.java:1374)
	at org.apache.maven.it.Verifier.executeGoal(Verifier.java:1259)
	at org.apache.maven.it.Verifier.executeGoal(Verifier.java:1253)
	at org.apache.maven.it.MavenITmng3599useHttpProxyForWebDAVTest.testitUseHttpProxyForWebDAV(MavenITmng3599useHttpProxyForWebDAVTest.java:208)


Results :

Tests in error: 
  MavenITmng3599useHttpProxyForWebDAVTest>AbstractMavenIntegrationTestCase.runTest:223->testitUseHttpProxyForWebDAV:208
ยป Verification

Tests run: 793, Failures: 0, Errors: 1, Skipped: 0

[INFO] ------------------------------------------------------------------------
[INFO] Reactor Summary:
[INFO] 
[INFO] Maven Core ITs ..................................... SUCCESS [ 22.240 s]
[INFO] Maven IT Support ................................... SUCCESS [  1.524 s]
[INFO] Maven IT :: Plugins ................................ SUCCESS [  1.375 s]
[INFO] Maven IT Plugin :: Active Collection ............... SUCCESS [  6.816 s]
[INFO] Maven IT Plugin :: Ant-Based ....................... SUCCESS [  4.938 s]
[INFO] Maven IT Plugin :: Artifact ........................ SUCCESS [  2.562 s]
[INFO] Maven IT Plugin :: Class Loader :: Dependency A .... SUCCESS [  1.254 s]
[INFO] Maven IT Plugin :: Class Loader :: Dependency B .... SUCCESS [  1.315 s]
[INFO] Maven IT Plugin :: Class Loader :: Dependency C .... SUCCESS [  1.252 s]
[INFO] Maven IT Plugin :: Class Loader .................... SUCCESS [  2.731 s]
[INFO] Maven IT Plugin :: Class Loader :: Aggregator ...... SUCCESS [  1.142 s]
[INFO] Maven IT Plugin :: Configuration ................... SUCCESS [  1.863 s]
[INFO] Maven IT Plugin :: Context Passing ................. SUCCESS [  1.340 s]
[INFO] Maven ITs :: Core Plugin Stubs ..................... SUCCESS [  1.137 s]
[INFO] Maven IT Clean Plugin Stub ......................... SUCCESS [  1.498 s]
[INFO] Maven IT Compiler Plugin Stub ...................... SUCCESS [  1.549 s]
[INFO] Maven IT Deploy Plugin Stub ........................ SUCCESS [  1.474 s]
[INFO] Maven IT EAR Plugin Stub ........................... SUCCESS [  1.522 s]
[INFO] Maven IT EJB Plugin Stub ........................... SUCCESS [  1.442 s]
[INFO] Maven IT Install Plugin Stub ....................... SUCCESS [  1.361 s]
[INFO] Maven IT JAR Plugin Stub ........................... SUCCESS [  1.409 s]
[INFO] Maven IT Javadoc Plugin Stub ....................... SUCCESS [  1.400 s]
[INFO] Maven IT Plugin Plugin Stub ........................ SUCCESS [  1.532 s]
[INFO] Maven IT RAR Plugin Stub ........................... SUCCESS [  1.408 s]
[INFO] Maven IT Resources Plugin Stub ..................... SUCCESS [  1.871 s]
[INFO] Maven IT Site Plugin Stub .......................... SUCCESS [  1.492 s]
[INFO] Maven IT Source Plugin Stub ........................ SUCCESS [  1.433 s]
[INFO] Maven IT Surefire Plugin Stub ...................... SUCCESS [  1.375 s]
[INFO] Maven IT WAR Plugin Stub ........................... SUCCESS [  1.336 s]
[INFO] Maven IT Plugin :: Dependency Collection ........... SUCCESS [  1.422 s]
[INFO] Maven IT Plugin :: Dependency Resolution ........... SUCCESS [  7.102 s]
[INFO] Maven IT Plugin :: Expression ...................... SUCCESS [  1.967 s]
[INFO] Maven IT Plugin :: Error Mojos ..................... SUCCESS [  2.423 s]
[INFO] Maven IT Component ................................. SUCCESS [  1.196 s]
[INFO] Maven IT Plugin :: Extension Consumer .............. SUCCESS [  1.248 s]
[INFO] Maven IT Plugin :: Extension Provider .............. SUCCESS [  1.228 s]
[INFO] Maven IT Plugin :: Fork ............................ SUCCESS [  1.552 s]
[INFO] Maven IT Plugin :: Invalid Descriptor .............. SUCCESS [  1.308 s]
[INFO] Maven IT Plugin :: Log File ........................ SUCCESS [  1.229 s]
[INFO] Maven IT Helper Library ............................ SUCCESS [  4.633 s]
[INFO] Maven IT Plugin :: Model Interpolation ............. SUCCESS [  1.709 s]
[INFO] Maven IT Plugin :: No Default Component ............ SUCCESS [  1.239 s]
[INFO] Maven IT Plugin :: No Project ...................... SUCCESS [  1.253 s]
[INFO] Maven IT Plugin :: Online .......................... SUCCESS [  1.258 s]
[INFO] Maven IT Plugin :: Optional Mojos .................. SUCCESS [  1.709 s]
[INFO] Maven IT Plugin :: Packaging ....................... SUCCESS [  1.290 s]
[INFO] Maven IT Plugin :: Parameter Implementation ........ SUCCESS [  1.244 s]
[INFO] Maven IT Plugin :: Plugin Dependency ............... SUCCESS [  1.307 s]
[INFO] Maven IT Plugin :: Project ......................... SUCCESS [  1.462 s]
[INFO] Maven IT Plugin :: Project Interpolation ........... SUCCESS [  1.509 s]
[INFO] Maven IT Plugin :: Setter .......................... SUCCESS [  1.278 s]
[INFO] Maven IT Plugin :: Singleton Component ............. SUCCESS [  1.323 s]
[INFO] Maven IT Plugin :: Site ............................ SUCCESS [  2.441 s]
[INFO] Maven IT Plugin :: Toolchain ....................... SUCCESS [  4.503 s]
[INFO] Maven IT Plugin :: Touch ........................... SUCCESS [  1.530 s]
[INFO] Maven IT Plugin :: Uses Properties Plugin .......... SUCCESS [  1.165 s]
[INFO] Maven IT Plugin :: Uses Wagon Plugin ............... SUCCESS [  2.470 s]
[INFO] Maven IT Plugin :: This plugin should contain the mojos needed by all tests. SUCCESS
[  1.257 s]
[INFO] Maven IT Plugin :: Plexus Utils 1.1 ................ SUCCESS [  1.359 s]
[INFO] Maven IT Plugin :: Plexus Utils New ................ SUCCESS [  1.288 s]
[INFO] Maven IT Plugin :: Plexus Component API ............ SUCCESS [  2.037 s]
[INFO] Maven IT Plugin :: Log4J Client .................... SUCCESS [  1.352 s]
[INFO] Maven IT Plugin :: Extension 1 ..................... SUCCESS [  1.217 s]
[INFO] Maven IT Plugin :: Extension 2 ..................... SUCCESS [  1.175 s]
[INFO] Maven IT Plugin :: Plexus Lifecycle ................ SUCCESS [  1.962 s]
[INFO] Maven IT Plugin :: Settings ........................ SUCCESS [  1.318 s]
[INFO] Maven IT Plugin :: mng-5805 extension .............. SUCCESS [  1.115 s]
[INFO] Maven IT Plugin :: mng-5805 plugin ................. SUCCESS [  1.325 s]
[INFO] Maven IT Plugin :: mng-5805 plugin-dep ............. SUCCESS [  1.144 s]
[INFO] Maven IT Plugin :: mng-5958 extension .............. SUCCESS [  3.613 s]
[INFO] Maven IT Toolchain ................................. SUCCESS [  1.663 s]
[INFO] Maven IT Wagon ..................................... SUCCESS [  1.659 s]
[INFO] Maven IT Support Artifacts ......................... SUCCESS [  3.075 s]
[INFO] Maven IT Extension ................................. SUCCESS [  1.139 s]
[INFO] Maven ITs .......................................... FAILURE [  01:10 h]
[INFO] ------------------------------------------------------------------------
[INFO] BUILD FAILURE
[INFO] ------------------------------------------------------------------------
[INFO] Total time: 01:12 h
[INFO] Finished at: 2016-11-13T15:43:10-08:00
[INFO] Final Memory: 60M/765M
[INFO] ------------------------------------------------------------------------
[ERROR] Failed to execute goal org.apache.maven.plugins:maven-surefire-plugin:2.18.1:test
(default-test) on project core-it-suite: There are test failures.
[ERROR] 
[ERROR] Please refer to F:\ws\m3-its\core-integration-testing-trunk\core-it-suite\target\surefire-reports
for the individual test results.
[ERROR] -> [Help 1]
org.apache.maven.lifecycle.LifecycleExecutionException: Failed to execute goal org.apache.maven.plugins:maven-surefire-plugin:2.18.1:test
(default-test) on project core-it-suite: There are test failures.

Please refer to F:\ws\m3-its\core-integration-testing-trunk\core-it-suite\target\surefire-reports
for the individual test results.
	at org.apache.maven.lifecycle.internal.MojoExecutor.execute(MojoExecutor.java:212)
	at org.apache.maven.lifecycle.internal.MojoExecutor.execute(MojoExecutor.java:153)
	at org.apache.maven.lifecycle.internal.MojoExecutor.execute(MojoExecutor.java:145)
	at org.apache.maven.lifecycle.internal.LifecycleModuleBuilder.buildProject(LifecycleModuleBuilder.java:116)
	at org.apache.maven.lifecycle.internal.LifecycleModuleBuilder.buildProject(LifecycleModuleBuilder.java:80)
	at org.apache.maven.lifecycle.internal.builder.singlethreaded.SingleThreadedBuilder.build(SingleThreadedBuilder.java:51)
	at org.apache.maven.lifecycle.internal.LifecycleStarter.execute(LifecycleStarter.java:128)
	at org.apache.maven.DefaultMaven.doExecute(DefaultMaven.java:307)
	at org.apache.maven.DefaultMaven.doExecute(DefaultMaven.java:193)
	at org.apache.maven.DefaultMaven.execute(DefaultMaven.java:106)
	at org.apache.maven.cli.MavenCli.execute(MavenCli.java:863)
	at org.apache.maven.cli.MavenCli.doMain(MavenCli.java:288)
	at org.apache.maven.cli.MavenCli.main(MavenCli.java:199)
	at sun.reflect.NativeMethodAccessorImpl.invoke0(Native Method)
	at sun.reflect.NativeMethodAccessorImpl.invoke(NativeMethodAccessorImpl.java:57)
	at sun.reflect.DelegatingMethodAccessorImpl.invoke(DelegatingMethodAccessorImpl.java:43)
	at java.lang.reflect.Method.invoke(Method.java:606)
	at org.codehaus.plexus.classworlds.launcher.Launcher.launchEnhanced(Launcher.java:289)
	at org.codehaus.plexus.classworlds.launcher.Launcher.launch(Launcher.java:229)
	at org.codehaus.plexus.classworlds.launcher.Launcher.mainWithExitCode(Launcher.java:415)
	at org.codehaus.plexus.classworlds.launcher.Launcher.main(Launcher.java:356)
Caused by: org.apache.maven.plugin.MojoFailureException: There are test failures.

Please refer to F:\ws\m3-its\core-integration-testing-trunk\core-it-suite\target\surefire-reports
for the individual test results.
	at org.apache.maven.plugin.surefire.SurefireHelper.reportExecution(SurefireHelper.java:82)
	at org.apache.maven.plugin.surefire.SurefirePlugin.handleSummary(SurefirePlugin.java:254)
	at org.apache.maven.plugin.surefire.AbstractSurefireMojo.executeAfterPreconditionsChecked(AbstractSurefireMojo.java:854)
	at org.apache.maven.plugin.surefire.AbstractSurefireMojo.execute(AbstractSurefireMojo.java:722)
	at org.apache.maven.plugin.DefaultBuildPluginManager.executeMojo(DefaultBuildPluginManager.java:134)
	at org.apache.maven.lifecycle.internal.MojoExecutor.execute(MojoExecutor.java:207)
	... 20 more
[ERROR] 
[ERROR] Re-run Maven using the -X switch to enable full debug logging.
[ERROR] 
[ERROR] For more information about the errors and possible solutions, please read the following
articles:
[ERROR] [Help 1] http://cwiki.apache.org/confluence/display/MAVEN/MojoFailureException
[ERROR] 
[ERROR] After correcting the problems, you can resume the build with the command
[ERROR]   mvn <goals> -rf :core-it-suite
Build step 'Invoke top-level Maven targets' marked build as failure
Recording test results

Mime
View raw message