maven-notifications mailing list archives

Site index · List index
Message view « Date » · « Thread »
Top « Date » · « Thread »
From Apache Jenkins Server <jenk...@builds.apache.org>
Subject Build failed in Jenkins: maven-plugins-windows » Apache Maven Assembly Plugin #1813
Date Mon, 07 Nov 2016 00:42:16 GMT
See <https://builds.apache.org/job/maven-plugins-windows/org.apache.maven.plugins$maven-assembly-plugin/1813/changes>

Changes:

[olamy] [MASSEMBLY-794] fix plugin home page documentation

[olamy] remove dead link

[olamy] back to plexus-interpolation 1.21

[olamy] back to 3.0.0-SNAPSHOT

------------------------------------------
[...truncated 94 lines...]
[ERROR] /F:/jenkins/jenkins-slave/workspace/maven-plugins-windows/maven-assembly-plugin/src/main/java/org/apache/maven/plugins/assembly/mojos/AbstractAssemblyMojo.java:[46,47]
package org.codehaus.plexus.interpolation.fixed does not exist
[ERROR] /F:/jenkins/jenkins-slave/workspace/maven-plugins-windows/maven-assembly-plugin/src/main/java/org/apache/maven/plugins/assembly/mojos/AbstractAssemblyMojo.java:[47,47]
package org.codehaus.plexus.interpolation.fixed does not exist
[ERROR] /F:/jenkins/jenkins-slave/workspace/maven-plugins-windows/maven-assembly-plugin/src/main/java/org/apache/maven/plugins/assembly/mojos/AbstractAssemblyMojo.java:[48,47]
package org.codehaus.plexus.interpolation.fixed does not exist
[ERROR] /F:/jenkins/jenkins-slave/workspace/maven-plugins-windows/maven-assembly-plugin/src/main/java/org/apache/maven/plugins/assembly/mojos/AbstractAssemblyMojo.java:[66,15]
cannot find symbol
  symbol:   class FixedStringSearchInterpolator
  location: class org.apache.maven.plugins.assembly.mojos.AbstractAssemblyMojo
[ERROR] /F:/jenkins/jenkins-slave/workspace/maven-plugins-windows/maven-assembly-plugin/src/main/java/org/apache/maven/plugins/assembly/mojos/AbstractAssemblyMojo.java:[68,15]
cannot find symbol
  symbol:   class FixedStringSearchInterpolator
  location: class org.apache.maven.plugins.assembly.mojos.AbstractAssemblyMojo
[ERROR] /F:/jenkins/jenkins-slave/workspace/maven-plugins-windows/maven-assembly-plugin/src/main/java/org/apache/maven/plugins/assembly/mojos/AbstractAssemblyMojo.java:[70,15]
cannot find symbol
  symbol:   class FixedStringSearchInterpolator
  location: class org.apache.maven.plugins.assembly.mojos.AbstractAssemblyMojo
[ERROR] /F:/jenkins/jenkins-slave/workspace/maven-plugins-windows/maven-assembly-plugin/src/main/java/org/apache/maven/plugins/assembly/mojos/AbstractAssemblyMojo.java:[72,15]
cannot find symbol
  symbol:   class FixedStringSearchInterpolator
  location: class org.apache.maven.plugins.assembly.mojos.AbstractAssemblyMojo
[ERROR] /F:/jenkins/jenkins-slave/workspace/maven-plugins-windows/maven-assembly-plugin/src/main/java/org/apache/maven/plugins/assembly/mojos/AbstractAssemblyMojo.java:[396,19]
cannot find symbol
  symbol:   class FixedStringSearchInterpolator
  location: class org.apache.maven.plugins.assembly.mojos.AbstractAssemblyMojo
[ERROR] /F:/jenkins/jenkins-slave/workspace/maven-plugins-windows/maven-assembly-plugin/src/main/java/org/apache/maven/plugins/assembly/mojos/AbstractAssemblyMojo.java:[545,13]
cannot find symbol
  symbol:   class FixedStringSearchInterpolator
  location: class org.apache.maven.plugins.assembly.mojos.AbstractAssemblyMojo
[ERROR] /F:/jenkins/jenkins-slave/workspace/maven-plugins-windows/maven-assembly-plugin/src/main/java/org/apache/maven/plugins/assembly/mojos/AbstractAssemblyMojo.java:[565,13]
cannot find symbol
  symbol:   class FixedStringSearchInterpolator
  location: class org.apache.maven.plugins.assembly.mojos.AbstractAssemblyMojo
[ERROR] /F:/jenkins/jenkins-slave/workspace/maven-plugins-windows/maven-assembly-plugin/src/main/java/org/apache/maven/plugins/assembly/mojos/AbstractAssemblyMojo.java:[582,13]
cannot find symbol
  symbol:   class FixedStringSearchInterpolator
  location: class org.apache.maven.plugins.assembly.mojos.AbstractAssemblyMojo
[ERROR] /F:/jenkins/jenkins-slave/workspace/maven-plugins-windows/maven-assembly-plugin/src/main/java/org/apache/maven/plugins/assembly/mojos/AbstractAssemblyMojo.java:[891,12]
cannot find symbol
  symbol:   class FixedStringSearchInterpolator
  location: class org.apache.maven.plugins.assembly.mojos.AbstractAssemblyMojo
[ERROR] /F:/jenkins/jenkins-slave/workspace/maven-plugins-windows/maven-assembly-plugin/src/main/java/org/apache/maven/plugins/assembly/mojos/AbstractAssemblyMojo.java:[902,12]
cannot find symbol
  symbol:   class FixedStringSearchInterpolator
  location: class org.apache.maven.plugins.assembly.mojos.AbstractAssemblyMojo
[ERROR] /F:/jenkins/jenkins-slave/workspace/maven-plugins-windows/maven-assembly-plugin/src/main/java/org/apache/maven/plugins/assembly/mojos/AbstractAssemblyMojo.java:[913,12]
cannot find symbol
  symbol:   class FixedStringSearchInterpolator
  location: class org.apache.maven.plugins.assembly.mojos.AbstractAssemblyMojo
[ERROR] /F:/jenkins/jenkins-slave/workspace/maven-plugins-windows/maven-assembly-plugin/src/main/java/org/apache/maven/plugins/assembly/mojos/AbstractAssemblyMojo.java:[924,12]
cannot find symbol
  symbol:   class FixedStringSearchInterpolator
  location: class org.apache.maven.plugins.assembly.mojos.AbstractAssemblyMojo
[ERROR] /F:/jenkins/jenkins-slave/workspace/maven-plugins-windows/maven-assembly-plugin/src/main/java/org/apache/maven/plugins/assembly/interpolation/AssemblyExpressionEvaluator.java:[29,47]
package org.codehaus.plexus.interpolation.fixed does not exist
[ERROR] /F:/jenkins/jenkins-slave/workspace/maven-plugins-windows/maven-assembly-plugin/src/main/java/org/apache/maven/plugins/assembly/interpolation/AssemblyExpressionEvaluator.java:[30,47]
package org.codehaus.plexus.interpolation.fixed does not exist
[ERROR] /F:/jenkins/jenkins-slave/workspace/maven-plugins-windows/maven-assembly-plugin/src/main/java/org/apache/maven/plugins/assembly/interpolation/AssemblyExpressionEvaluator.java:[43,19]
cannot find symbol
  symbol:   class FixedStringSearchInterpolator
  location: class org.apache.maven.plugins.assembly.interpolation.AssemblyExpressionEvaluator
[ERROR] /F:/jenkins/jenkins-slave/workspace/maven-plugins-windows/maven-assembly-plugin/src/main/java/org/apache/maven/plugins/assembly/io/DefaultAssemblyReader.java:[49,47]
package org.codehaus.plexus.interpolation.fixed does not exist
[ERROR] /F:/jenkins/jenkins-slave/workspace/maven-plugins-windows/maven-assembly-plugin/src/main/java/org/apache/maven/plugins/assembly/io/DefaultAssemblyReader.java:[50,47]
package org.codehaus.plexus.interpolation.fixed does not exist
[ERROR] /F:/jenkins/jenkins-slave/workspace/maven-plugins-windows/maven-assembly-plugin/src/main/java/org/apache/maven/plugins/assembly/io/DefaultAssemblyReader.java:[51,47]
package org.codehaus.plexus.interpolation.fixed does not exist
[ERROR] /F:/jenkins/jenkins-slave/workspace/maven-plugins-windows/maven-assembly-plugin/src/main/java/org/apache/maven/plugins/assembly/io/DefaultAssemblyReader.java:[52,47]
package org.codehaus.plexus.interpolation.fixed does not exist
[ERROR] /F:/jenkins/jenkins-slave/workspace/maven-plugins-windows/maven-assembly-plugin/src/main/java/org/apache/maven/plugins/assembly/io/DefaultAssemblyReader.java:[81,19]
cannot find symbol
  symbol:   class FixedStringSearchInterpolator
  location: class org.apache.maven.plugins.assembly.io.DefaultAssemblyReader
[ERROR] /F:/jenkins/jenkins-slave/workspace/maven-plugins-windows/maven-assembly-plugin/src/main/java/org/apache/maven/plugins/assembly/utils/AssemblyFormatUtils.java:[29,47]
package org.codehaus.plexus.interpolation.fixed does not exist
[ERROR] /F:/jenkins/jenkins-slave/workspace/maven-plugins-windows/maven-assembly-plugin/src/main/java/org/apache/maven/plugins/assembly/utils/AssemblyFormatUtils.java:[30,47]
package org.codehaus.plexus.interpolation.fixed does not exist
[ERROR] /F:/jenkins/jenkins-slave/workspace/maven-plugins-windows/maven-assembly-plugin/src/main/java/org/apache/maven/plugins/assembly/utils/AssemblyFormatUtils.java:[31,47]
package org.codehaus.plexus.interpolation.fixed does not exist
[ERROR] /F:/jenkins/jenkins-slave/workspace/maven-plugins-windows/maven-assembly-plugin/src/main/java/org/apache/maven/plugins/assembly/utils/AssemblyFormatUtils.java:[32,47]
package org.codehaus.plexus.interpolation.fixed does not exist
[ERROR] /F:/jenkins/jenkins-slave/workspace/maven-plugins-windows/maven-assembly-plugin/src/main/java/org/apache/maven/plugins/assembly/utils/AssemblyFormatUtils.java:[76,19]
cannot find symbol
  symbol:   class FixedStringSearchInterpolator
  location: class org.apache.maven.plugins.assembly.utils.AssemblyFormatUtils
[ERROR] /F:/jenkins/jenkins-slave/workspace/maven-plugins-windows/maven-assembly-plugin/src/main/java/org/apache/maven/plugins/assembly/utils/AssemblyFormatUtils.java:[94,19]
cannot find symbol
  symbol:   class FixedStringSearchInterpolator
  location: class org.apache.maven.plugins.assembly.utils.AssemblyFormatUtils
[ERROR] /F:/jenkins/jenkins-slave/workspace/maven-plugins-windows/maven-assembly-plugin/src/main/java/org/apache/maven/plugins/assembly/utils/AssemblyFormatUtils.java:[112,19]
cannot find symbol
  symbol:   class FixedStringSearchInterpolator
  location: class org.apache.maven.plugins.assembly.utils.AssemblyFormatUtils
[ERROR] /F:/jenkins/jenkins-slave/workspace/maven-plugins-windows/maven-assembly-plugin/src/main/java/org/apache/maven/plugins/assembly/utils/AssemblyFormatUtils.java:[134,19]
cannot find symbol
  symbol:   class FixedStringSearchInterpolator
  location: class org.apache.maven.plugins.assembly.utils.AssemblyFormatUtils
[ERROR] /F:/jenkins/jenkins-slave/workspace/maven-plugins-windows/maven-assembly-plugin/src/main/java/org/apache/maven/plugins/assembly/utils/AssemblyFormatUtils.java:[159,19]
cannot find symbol
  symbol:   class FixedStringSearchInterpolator
  location: class org.apache.maven.plugins.assembly.utils.AssemblyFormatUtils
[ERROR] /F:/jenkins/jenkins-slave/workspace/maven-plugins-windows/maven-assembly-plugin/src/main/java/org/apache/maven/plugins/assembly/utils/AssemblyFormatUtils.java:[170,19]
cannot find symbol
  symbol:   class FixedStringSearchInterpolator
  location: class org.apache.maven.plugins.assembly.utils.AssemblyFormatUtils
[ERROR] /F:/jenkins/jenkins-slave/workspace/maven-plugins-windows/maven-assembly-plugin/src/main/java/org/apache/maven/plugins/assembly/utils/AssemblyFormatUtils.java:[225,20]
cannot find symbol
  symbol:   class FixedStringSearchInterpolator
  location: class org.apache.maven.plugins.assembly.utils.AssemblyFormatUtils
[ERROR] /F:/jenkins/jenkins-slave/workspace/maven-plugins-windows/maven-assembly-plugin/src/main/java/org/apache/maven/plugins/assembly/utils/AssemblyFormatUtils.java:[247,20]
cannot find symbol
  symbol:   class FixedStringSearchInterpolator
  location: class org.apache.maven.plugins.assembly.utils.AssemblyFormatUtils
[ERROR] /F:/jenkins/jenkins-slave/workspace/maven-plugins-windows/maven-assembly-plugin/src/main/java/org/apache/maven/plugins/assembly/utils/AssemblyFormatUtils.java:[388,51]
cannot find symbol
  symbol:   class FixedStringSearchInterpolator
  location: class org.apache.maven.plugins.assembly.utils.AssemblyFormatUtils
[ERROR] /F:/jenkins/jenkins-slave/workspace/maven-plugins-windows/maven-assembly-plugin/src/main/java/org/apache/maven/plugins/assembly/utils/AssemblyFormatUtils.java:[389,51]
cannot find symbol
  symbol:   class FixedStringSearchInterpolator
  location: class org.apache.maven.plugins.assembly.utils.AssemblyFormatUtils
[ERROR] /F:/jenkins/jenkins-slave/workspace/maven-plugins-windows/maven-assembly-plugin/src/main/java/org/apache/maven/plugins/assembly/utils/AssemblyFormatUtils.java:[442,46]
cannot find symbol
  symbol:   class FixedStringSearchInterpolator
  location: class org.apache.maven.plugins.assembly.utils.AssemblyFormatUtils
[ERROR] /F:/jenkins/jenkins-slave/workspace/maven-plugins-windows/maven-assembly-plugin/src/main/java/org/apache/maven/plugins/assembly/utils/AssemblyFormatUtils.java:[443,46]
cannot find symbol
  symbol:   class FixedStringSearchInterpolator
  location: class org.apache.maven.plugins.assembly.utils.AssemblyFormatUtils
[ERROR] /F:/jenkins/jenkins-slave/workspace/maven-plugins-windows/maven-assembly-plugin/src/main/java/org/apache/maven/plugins/assembly/interpolation/AssemblyInterpolator.java:[29,47]
package org.codehaus.plexus.interpolation.fixed does not exist
[ERROR] /F:/jenkins/jenkins-slave/workspace/maven-plugins-windows/maven-assembly-plugin/src/main/java/org/apache/maven/plugins/assembly/interpolation/AssemblyInterpolator.java:[30,47]
package org.codehaus.plexus.interpolation.fixed does not exist
[ERROR] /F:/jenkins/jenkins-slave/workspace/maven-plugins-windows/maven-assembly-plugin/src/main/java/org/apache/maven/plugins/assembly/interpolation/AssemblyInterpolator.java:[65,15]
cannot find symbol
  symbol:   class FixedStringSearchInterpolator
  location: class org.apache.maven.plugins.assembly.interpolation.AssemblyInterpolator
[ERROR] /F:/jenkins/jenkins-slave/workspace/maven-plugins-windows/maven-assembly-plugin/src/main/java/org/apache/maven/plugins/assembly/interpolation/AssemblyInterpolator.java:[65,65]
cannot find symbol
  symbol:   class InterpolationState
  location: class org.apache.maven.plugins.assembly.interpolation.AssemblyInterpolator
[ERROR] /F:/jenkins/jenkins-slave/workspace/maven-plugins-windows/maven-assembly-plugin/src/main/java/org/apache/maven/plugins/assembly/interpolation/AssemblyInterpolator.java:[93,15]
cannot find symbol
  symbol:   class FixedStringSearchInterpolator
  location: class org.apache.maven.plugins.assembly.interpolation.AssemblyInterpolator
[ERROR] /F:/jenkins/jenkins-slave/workspace/maven-plugins-windows/maven-assembly-plugin/src/main/java/org/apache/maven/plugins/assembly/interpolation/AssemblyInterpolator.java:[93,65]
cannot find symbol
  symbol:   class InterpolationState
  location: class org.apache.maven.plugins.assembly.interpolation.AssemblyInterpolator
[ERROR] /F:/jenkins/jenkins-slave/workspace/maven-plugins-windows/maven-assembly-plugin/src/main/java/org/apache/maven/plugins/assembly/interpolation/AssemblyInterpolator.java:[121,60]
cannot find symbol
  symbol:   class InterpolationState
  location: class org.apache.maven.plugins.assembly.interpolation.AssemblyInterpolator
[ERROR] /F:/jenkins/jenkins-slave/workspace/maven-plugins-windows/maven-assembly-plugin/src/main/java/org/apache/maven/plugins/assembly/interpolation/AssemblyInterpolator.java:[143,76]
cannot find symbol
  symbol:   class FixedStringSearchInterpolator
  location: class org.apache.maven.plugins.assembly.interpolation.AssemblyInterpolator
[ERROR] /F:/jenkins/jenkins-slave/workspace/maven-plugins-windows/maven-assembly-plugin/src/main/java/org/apache/maven/plugins/assembly/interpolation/AssemblyInterpolator.java:[142,19]
cannot find symbol
  symbol:   class FixedStringSearchInterpolator
  location: class org.apache.maven.plugins.assembly.interpolation.AssemblyInterpolator
[ERROR] /F:/jenkins/jenkins-slave/workspace/maven-plugins-windows/maven-assembly-plugin/src/main/java/org/apache/maven/plugins/assembly/archive/task/AddDependencySetsTask.java:[54,47]
package org.codehaus.plexus.interpolation.fixed does not exist
[ERROR] /F:/jenkins/jenkins-slave/workspace/maven-plugins-windows/maven-assembly-plugin/src/main/java/org/apache/maven/plugins/assembly/archive/phase/ModuleSetAssemblyPhase.java:[51,47]
package org.codehaus.plexus.interpolation.fixed does not exist
[ERROR] /F:/jenkins/jenkins-slave/workspace/maven-plugins-windows/maven-assembly-plugin/src/main/java/org/apache/maven/plugins/assembly/mojos/AbstractAssemblyMojo.java:[402,60]
package org.codehaus.plexus.interpolation.fixed does not exist
[ERROR] /F:/jenkins/jenkins-slave/workspace/maven-plugins-windows/maven-assembly-plugin/src/main/java/org/apache/maven/plugins/assembly/mojos/AbstractAssemblyMojo.java:[406,60]
package org.codehaus.plexus.interpolation.fixed does not exist
[ERROR] /F:/jenkins/jenkins-slave/workspace/maven-plugins-windows/maven-assembly-plugin/src/main/java/org/apache/maven/plugins/assembly/mojos/AbstractAssemblyMojo.java:[401,20]
cannot find symbol
  symbol:   variable FixedStringSearchInterpolator
  location: class org.apache.maven.plugins.assembly.mojos.AbstractAssemblyMojo
[ERROR] /F:/jenkins/jenkins-slave/workspace/maven-plugins-windows/maven-assembly-plugin/src/main/java/org/apache/maven/plugins/assembly/mojos/AbstractAssemblyMojo.java:[411,20]
cannot find symbol
  symbol:   variable FixedStringSearchInterpolator
  location: class org.apache.maven.plugins.assembly.mojos.AbstractAssemblyMojo
[ERROR] /F:/jenkins/jenkins-slave/workspace/maven-plugins-windows/maven-assembly-plugin/src/main/java/org/apache/maven/plugins/assembly/mojos/AbstractAssemblyMojo.java:[561,58]
cannot find symbol
  symbol:   class PropertiesBasedValueSource
  location: class org.apache.maven.plugins.assembly.mojos.AbstractAssemblyMojo
[ERROR] /F:/jenkins/jenkins-slave/workspace/maven-plugins-windows/maven-assembly-plugin/src/main/java/org/apache/maven/plugins/assembly/mojos/AbstractAssemblyMojo.java:[561,16]
cannot find symbol
  symbol:   variable FixedStringSearchInterpolator
  location: class org.apache.maven.plugins.assembly.mojos.AbstractAssemblyMojo
[ERROR] /F:/jenkins/jenkins-slave/workspace/maven-plugins-windows/maven-assembly-plugin/src/main/java/org/apache/maven/plugins/assembly/mojos/AbstractAssemblyMojo.java:[577,9]
cannot find symbol
  symbol:   class PropertiesBasedValueSource
  location: class org.apache.maven.plugins.assembly.mojos.AbstractAssemblyMojo
[ERROR] /F:/jenkins/jenkins-slave/workspace/maven-plugins-windows/maven-assembly-plugin/src/main/java/org/apache/maven/plugins/assembly/mojos/AbstractAssemblyMojo.java:[577,51]
cannot find symbol
  symbol:   class PropertiesBasedValueSource
  location: class org.apache.maven.plugins.assembly.mojos.AbstractAssemblyMojo
[ERROR] /F:/jenkins/jenkins-slave/workspace/maven-plugins-windows/maven-assembly-plugin/src/main/java/org/apache/maven/plugins/assembly/mojos/AbstractAssemblyMojo.java:[578,16]
cannot find symbol
  symbol:   variable FixedStringSearchInterpolator
  location: class org.apache.maven.plugins.assembly.mojos.AbstractAssemblyMojo
[ERROR] /F:/jenkins/jenkins-slave/workspace/maven-plugins-windows/maven-assembly-plugin/src/main/java/org/apache/maven/plugins/assembly/mojos/AbstractAssemblyMojo.java:[584,9]
cannot find symbol
  symbol:   class PrefixedPropertiesValueSource
  location: class org.apache.maven.plugins.assembly.mojos.AbstractAssemblyMojo
[ERROR] /F:/jenkins/jenkins-slave/workspace/maven-plugins-windows/maven-assembly-plugin/src/main/java/org/apache/maven/plugins/assembly/mojos/AbstractAssemblyMojo.java:[584,54]
cannot find symbol
  symbol:   class PrefixedPropertiesValueSource
  location: class org.apache.maven.plugins.assembly.mojos.AbstractAssemblyMojo
[ERROR] /F:/jenkins/jenkins-slave/workspace/maven-plugins-windows/maven-assembly-plugin/src/main/java/org/apache/maven/plugins/assembly/mojos/AbstractAssemblyMojo.java:[587,16]
cannot find symbol
  symbol:   variable FixedStringSearchInterpolator
  location: class org.apache.maven.plugins.assembly.mojos.AbstractAssemblyMojo
[ERROR] /F:/jenkins/jenkins-slave/workspace/maven-plugins-windows/maven-assembly-plugin/src/main/java/org/apache/maven/plugins/assembly/interpolation/AssemblyExpressionEvaluator.java:[52,15]
cannot find symbol
  symbol:   class FixedStringSearchInterpolator
  location: class org.apache.maven.plugins.assembly.interpolation.AssemblyExpressionEvaluator
[ERROR] /F:/jenkins/jenkins-slave/workspace/maven-plugins-windows/maven-assembly-plugin/src/main/java/org/apache/maven/plugins/assembly/interpolation/AssemblyExpressionEvaluator.java:[78,9]
cannot find symbol
  symbol:   class InterpolationState
  location: class org.apache.maven.plugins.assembly.interpolation.AssemblyExpressionEvaluator
[ERROR] /F:/jenkins/jenkins-slave/workspace/maven-plugins-windows/maven-assembly-plugin/src/main/java/org/apache/maven/plugins/assembly/interpolation/AssemblyExpressionEvaluator.java:[78,37]
cannot find symbol
  symbol:   class InterpolationState
  location: class org.apache.maven.plugins.assembly.interpolation.AssemblyExpressionEvaluator
[ERROR] /F:/jenkins/jenkins-slave/workspace/maven-plugins-windows/maven-assembly-plugin/src/main/java/org/apache/maven/plugins/assembly/io/DefaultAssemblyReader.java:[84,58]
cannot find symbol
  symbol:   class PrefixedPropertiesValueSource
  location: class org.apache.maven.plugins.assembly.io.DefaultAssemblyReader
[ERROR] /F:/jenkins/jenkins-slave/workspace/maven-plugins-windows/maven-assembly-plugin/src/main/java/org/apache/maven/plugins/assembly/io/DefaultAssemblyReader.java:[86,58]
cannot find symbol
  symbol:   class PrefixedObjectValueSource
  location: class org.apache.maven.plugins.assembly.io.DefaultAssemblyReader
[ERROR] /F:/jenkins/jenkins-slave/workspace/maven-plugins-windows/maven-assembly-plugin/src/main/java/org/apache/maven/plugins/assembly/io/DefaultAssemblyReader.java:[84,16]
cannot find symbol
  symbol:   variable FixedStringSearchInterpolator
  location: class org.apache.maven.plugins.assembly.io.DefaultAssemblyReader
[ERROR] /F:/jenkins/jenkins-slave/workspace/maven-plugins-windows/maven-assembly-plugin/src/main/java/org/apache/maven/plugins/assembly/io/DefaultAssemblyReader.java:[341,13]
cannot find symbol
  symbol:   class InterpolationState
  location: class org.apache.maven.plugins.assembly.io.DefaultAssemblyReader
[ERROR] /F:/jenkins/jenkins-slave/workspace/maven-plugins-windows/maven-assembly-plugin/src/main/java/org/apache/maven/plugins/assembly/io/DefaultAssemblyReader.java:[341,41]
cannot find symbol
  symbol:   class InterpolationState
  location: class org.apache.maven.plugins.assembly.io.DefaultAssemblyReader
[ERROR] /F:/jenkins/jenkins-slave/workspace/maven-plugins-windows/maven-assembly-plugin/src/main/java/org/apache/maven/plugins/assembly/io/DefaultAssemblyReader.java:[346,13]
cannot find symbol
  symbol:   class FixedStringSearchInterpolator
  location: class org.apache.maven.plugins.assembly.io.DefaultAssemblyReader
[ERROR] /F:/jenkins/jenkins-slave/workspace/maven-plugins-windows/maven-assembly-plugin/src/main/java/org/apache/maven/plugins/assembly/utils/AssemblyFormatUtils.java:[87,20]
cannot find symbol
  symbol:   variable FixedStringSearchInterpolator
  location: class org.apache.maven.plugins.assembly.utils.AssemblyFormatUtils
[ERROR] /F:/jenkins/jenkins-slave/workspace/maven-plugins-windows/maven-assembly-plugin/src/main/java/org/apache/maven/plugins/assembly/utils/AssemblyFormatUtils.java:[90,58]
cannot find symbol
  symbol:   class PropertiesBasedValueSource
  location: class org.apache.maven.plugins.assembly.utils.AssemblyFormatUtils
[ERROR] /F:/jenkins/jenkins-slave/workspace/maven-plugins-windows/maven-assembly-plugin/src/main/java/org/apache/maven/plugins/assembly/utils/AssemblyFormatUtils.java:[90,16]
cannot find symbol
  symbol:   variable FixedStringSearchInterpolator
  location: class org.apache.maven.plugins.assembly.utils.AssemblyFormatUtils
[ERROR] /F:/jenkins/jenkins-slave/workspace/maven-plugins-windows/maven-assembly-plugin/src/main/java/org/apache/maven/plugins/assembly/utils/AssemblyFormatUtils.java:[99,21]
cannot find symbol
  symbol:   class PrefixedObjectValueSource
  location: class org.apache.maven.plugins.assembly.utils.AssemblyFormatUtils
[ERROR] /F:/jenkins/jenkins-slave/workspace/maven-plugins-windows/maven-assembly-plugin/src/main/java/org/apache/maven/plugins/assembly/utils/AssemblyFormatUtils.java:[100,21]
cannot find symbol
  symbol:   class PrefixedPropertiesValueSource
  location: class org.apache.maven.plugins.assembly.utils.AssemblyFormatUtils
[ERROR] /F:/jenkins/jenkins-slave/workspace/maven-plugins-windows/maven-assembly-plugin/src/main/java/org/apache/maven/plugins/assembly/utils/AssemblyFormatUtils.java:[102,27]
cannot find symbol
  symbol:   class PrefixedObjectValueSource
  location: class org.apache.maven.plugins.assembly.utils.AssemblyFormatUtils
[ERROR] /F:/jenkins/jenkins-slave/workspace/maven-plugins-windows/maven-assembly-plugin/src/main/java/org/apache/maven/plugins/assembly/utils/AssemblyFormatUtils.java:[98,20]
cannot find symbol
  symbol:   variable FixedStringSearchInterpolator
  location: class org.apache.maven.plugins.assembly.utils.AssemblyFormatUtils
[ERROR] /F:/jenkins/jenkins-slave/workspace/maven-plugins-windows/maven-assembly-plugin/src/main/java/org/apache/maven/plugins/assembly/utils/AssemblyFormatUtils.java:[107,20]
cannot find symbol
  symbol:   variable FixedStringSearchInterpolator
  location: class org.apache.maven.plugins.assembly.utils.AssemblyFormatUtils
[ERROR] /F:/jenkins/jenkins-slave/workspace/maven-plugins-windows/maven-assembly-plugin/src/main/java/org/apache/maven/plugins/assembly/utils/AssemblyFormatUtils.java:[117,62]
cannot find symbol
  symbol:   class PrefixedObjectValueSource
  location: class org.apache.maven.plugins.assembly.utils.AssemblyFormatUtils
[ERROR] /F:/jenkins/jenkins-slave/workspace/maven-plugins-windows/maven-assembly-plugin/src/main/java/org/apache/maven/plugins/assembly/utils/AssemblyFormatUtils.java:[118,62]
cannot find symbol
  symbol:   class PrefixedObjectValueSource
  location: class org.apache.maven.plugins.assembly.utils.AssemblyFormatUtils
[ERROR] /F:/jenkins/jenkins-slave/workspace/maven-plugins-windows/maven-assembly-plugin/src/main/java/org/apache/maven/plugins/assembly/utils/AssemblyFormatUtils.java:[121,62]
cannot find symbol
  symbol:   class PrefixedObjectValueSource
  location: class org.apache.maven.plugins.assembly.utils.AssemblyFormatUtils
[ERROR] /F:/jenkins/jenkins-slave/workspace/maven-plugins-windows/maven-assembly-plugin/src/main/java/org/apache/maven/plugins/assembly/utils/AssemblyFormatUtils.java:[117,20]
cannot find symbol
  symbol:   variable FixedStringSearchInterpolator
  location: class org.apache.maven.plugins.assembly.utils.AssemblyFormatUtils
[ERROR] /F:/jenkins/jenkins-slave/workspace/maven-plugins-windows/maven-assembly-plugin/src/main/java/org/apache/maven/plugins/assembly/utils/AssemblyFormatUtils.java:[128,20]
cannot find symbol
  symbol:   variable FixedStringSearchInterpolator
  location: class org.apache.maven.plugins.assembly.utils.AssemblyFormatUtils
[ERROR] /F:/jenkins/jenkins-slave/workspace/maven-plugins-windows/maven-assembly-plugin/src/main/java/org/apache/maven/plugins/assembly/utils/AssemblyFormatUtils.java:[138,13]
cannot find symbol
  symbol:   class PrefixedObjectValueSource
  location: class org.apache.maven.plugins.assembly.utils.AssemblyFormatUtils
[ERROR] /F:/jenkins/jenkins-slave/workspace/maven-plugins-windows/maven-assembly-plugin/src/main/java/org/apache/maven/plugins/assembly/utils/AssemblyFormatUtils.java:[141,26]
cannot find symbol
  symbol:   class PrefixedObjectValueSource
  location: class org.apache.maven.plugins.assembly.utils.AssemblyFormatUtils
[ERROR] /F:/jenkins/jenkins-slave/workspace/maven-plugins-windows/maven-assembly-plugin/src/main/java/org/apache/maven/plugins/assembly/utils/AssemblyFormatUtils.java:[145,21]
cannot find symbol
  symbol:   class PrefixedObjectValueSource
  location: class org.apache.maven.plugins.assembly.utils.AssemblyFormatUtils
[ERROR] /F:/jenkins/jenkins-slave/workspace/maven-plugins-windows/maven-assembly-plugin/src/main/java/org/apache/maven/plugins/assembly/utils/AssemblyFormatUtils.java:[146,21]
cannot find symbol
  symbol:   class PrefixedPropertiesValueSource
  location: class org.apache.maven.plugins.assembly.utils.AssemblyFormatUtils
[ERROR] /F:/jenkins/jenkins-slave/workspace/maven-plugins-windows/maven-assembly-plugin/src/main/java/org/apache/maven/plugins/assembly/utils/AssemblyFormatUtils.java:[144,20]
cannot find symbol
  symbol:   variable FixedStringSearchInterpolator
  location: class org.apache.maven.plugins.assembly.utils.AssemblyFormatUtils
[ERROR] /F:/jenkins/jenkins-slave/workspace/maven-plugins-windows/maven-assembly-plugin/src/main/java/org/apache/maven/plugins/assembly/utils/AssemblyFormatUtils.java:[152,20]
cannot find symbol
  symbol:   variable FixedStringSearchInterpolator
  location: class org.apache.maven.plugins.assembly.utils.AssemblyFormatUtils
[ERROR] /F:/jenkins/jenkins-slave/workspace/maven-plugins-windows/maven-assembly-plugin/src/main/java/org/apache/maven/plugins/assembly/utils/AssemblyFormatUtils.java:[161,58]
cannot find symbol
  symbol:   class PrefixedObjectValueSource
  location: class org.apache.maven.plugins.assembly.utils.AssemblyFormatUtils
[ERROR] /F:/jenkins/jenkins-slave/workspace/maven-plugins-windows/maven-assembly-plugin/src/main/java/org/apache/maven/plugins/assembly/utils/AssemblyFormatUtils.java:[162,58]
cannot find symbol
  symbol:   class PrefixedObjectValueSource
  location: class org.apache.maven.plugins.assembly.utils.AssemblyFormatUtils
[ERROR] /F:/jenkins/jenkins-slave/workspace/maven-plugins-windows/maven-assembly-plugin/src/main/java/org/apache/maven/plugins/assembly/utils/AssemblyFormatUtils.java:[164,58]
cannot find symbol
  symbol:   class PrefixedObjectValueSource
  location: class org.apache.maven.plugins.assembly.utils.AssemblyFormatUtils
[ERROR] /F:/jenkins/jenkins-slave/workspace/maven-plugins-windows/maven-assembly-plugin/src/main/java/org/apache/maven/plugins/assembly/utils/AssemblyFormatUtils.java:[161,16]
cannot find symbol
  symbol:   variable FixedStringSearchInterpolator
  location: class org.apache.maven.plugins.assembly.utils.AssemblyFormatUtils
[ERROR] /F:/jenkins/jenkins-slave/workspace/maven-plugins-windows/maven-assembly-plugin/src/main/java/org/apache/maven/plugins/assembly/utils/AssemblyFormatUtils.java:[186,58]
cannot find symbol
  symbol:   class PropertiesBasedValueSource
  location: class org.apache.maven.plugins.assembly.utils.AssemblyFormatUtils
[INFO] 100 errors 
[INFO] -------------------------------------------------------------

Mime
View raw message