maven-notifications mailing list archives

Site index · List index
Message view « Date » · « Thread »
Top « Date » · « Thread »
From Apache Jenkins Server <jenk...@builds.apache.org>
Subject Build failed in Jenkins: core-it-maven-3-win #1369
Date Mon, 14 Nov 2016 01:43:22 GMT
See <https://builds.apache.org/job/core-it-maven-3-win/1369/changes>

Changes:

[hboutemy] MNG-5889 added IT

[hboutemy] MNG-5889 moved IT to its own test suite to run it only with 3.4.0

[hboutemy] added missing license headers

------------------------------------------
[...truncated 11179 lines...]
0143TransitiveDependencyScopes(itTestScope).......... OK (4.5 s)
0143TransitiveDependencyScopes(itCompileScope)....... OK (4.6 s)
0143TransitiveDependencyScopes(itRuntimeScope)....... OK (4.6 s)
0142DirectDependencyScopes(it0142)................... OK (5.1 s)
0140InterpolationWithPomPrefix(it0140)............... OK (4.2 s)
0139InterpolationWithProjectPrefix(it0139)........... OK (4.2 s)
0138PluginLifecycle(it0138).......................... OK (4.8 s)
0137EarLifecycle(it0137)............................. OK (4.8 s)
0136RarLifecycle(it0136)............................. OK (4.8 s)
0135EjbLifecycle(it0135)............................. OK (4.9 s)
0134WarLifecycle(it0134)............................. OK (4.9 s)
0133JarLifecycle(it0133)............................. OK (4.9 s)
0132PomLifecycle(it0132)............................. OK (4.2 s)
0131SiteLifecycle(it0131)............................ OK (4.4 s)
0130CleanLifecycle(it0130)........................... OK (4.5 s)
0113ServerAuthzAvailableToWagonMgrInPlugin(it0113)... OK (5.0 s)
0090EnvVarInterpolation(it0090)...................... OK (4.4 s)
0087PluginRealmWithProjectLevelDeps(it0087).......... OK (4.6 s)
0086PluginRealm(it0086).............................. OK (4.4 s)
0085TransitiveSystemScope(it0085).................... OK (4.6 s)
0072InterpolationWithDottedProperty(it0072).......... OK (4.0 s)
0071PluginConfigWithDottedProperty(it0071)........... OK (4.4 s)
0064MojoConfigViaSetters(it0064)..................... OK (4.1 s)
0063SystemScopeDependency(it0063).................... OK (4.4 s)
0056MultipleGoalExecutions(it0056)................... OK (4.3 s)
0052ReleaseProfile(it0052)........................... OK (4.4 s)
0051ReleaseProfile(it0051)........................... OK (4.6 s)
0041ArtifactTypeFromPluginExtension(it0041).......... OK (5.5 s)
0040PackagingFromPluginExtension(it0040)............. OK (4.3 s)
0039ReleasePomInReactor(it0039)...................... SKIPPED - Maven version 3.4.0-SNAPSHOT
not in range [2.0,3.0-alpha-1)
0038AlternatePomFileDifferentDir(it0038)............. OK (4.2 s)
0037AlternatePomFileSameDir(it0037).................. OK (4.2 s)
0036ReleasePom(it0036)............................... SKIPPED - Maven version 3.4.0-SNAPSHOT
not in range (2.0,3.0-alpha-1)
0032MavenPrerequisite(it0032)........................ OK (3.9 s)
0030DepPomDepMngtInheritance(it0030)................. OK (8.3 s)
0025MultipleExecutionLevelConfigs(it0025)............ OK (4.3 s)
0024MultipleGoalExecutions(it0024)................... OK (4.1 s)
0023SettingsProfile(it0023).......................... OK (4.8 s)
0021PomProfile(it0021)............................... OK (4.6 s)
0019PluginVersionMngtBySuperPom(it0019).............. OK (4.9 s)
0018DependencyManagement(it0018)..................... OK (4.7 s)
0012PomInterpolation(it0012)......................... OK (4.5 s)
0011DefaultVersionByDependencyManagement(it0011)..... OK (4.6 s)
0010DependencyClosureResolution(it0010).............. OK (4.5 s)
0009GoalConfiguration(it0009)........................ OK (4.3 s)
0008SimplePlugin(it0008)............................. OK (4.5 s)
Tests run: 794, Failures: 0, Errors: 1, Skipped: 0, Time elapsed: 4,164.303 sec <<<
FAILURE! - in org.apache.maven.it.IntegrationTestSuite
testCoreExtensionFile(org.apache.maven.it.MavenITmng5889CoreExtensionsTest)  Time elapsed:
4.077 sec  <<< ERROR!
org.apache.maven.it.VerificationException: Exit code was non-zero: 1; command line and log
= 
<https://builds.apache.org/job/core-it-maven-3-win/ws/apache-maven-3-SNAPSHOT\bin\mvn>
--global-settings F:\ws\m3-its\core-integration-testing-trunk\core-it-suite\target\test-classes\settings.xml
-s F:\ws\m3-its\core-integration-testing-trunk\core-it-suite\target\test-classes\mng-5771-core-extensions\settings.xml
-f F:\ws\m3-its\core-integration-testing-trunk\core-it-suite\target\test-classes\mng-5771-core-extensions\client\pom.xml
-e --batch-mode -Dmaven.repo.local=<https://builds.apache.org/job/core-it-maven-3-win/ws/it-local-repo>
validate
[INFO] Error stacktraces are turned on.
[INFO] Scanning for projects...
[INFO] 
[INFO] ------------------------------------------------------------------------
[INFO] Building Maven Integration Test :: it-core-extensions 0.1
[INFO] ------------------------------------------------------------------------
[INFO] Downloading: file:///F:/ws/m3-its/core-integration-testing-trunk/core-it-suite/target/test-classes/mng-5771-core-extensions/repo/org/apache/maven/its/it-core-extensions/maven-it-plugin-core-extensions-client/0.1/maven-it-plugin-core-extensions-client-0.1.pom
[INFO] Downloaded: file:///F:/ws/m3-its/core-integration-testing-trunk/core-it-suite/target/test-classes/mng-5771-core-extensions/repo/org/apache/maven/its/it-core-extensions/maven-it-plugin-core-extensions-client/0.1/maven-it-plugin-core-extensions-client-0.1.pom
(2.2 kB at 47 kB/s)
[INFO] Downloading: file:///F:/ws/m3-its/core-integration-testing-trunk/core-it-suite/target/test-classes/mng-5771-core-extensions/repo/org/apache/maven/its/it-core-extensions/maven-it-plugin-core-extensions-client/0.1/maven-it-plugin-core-extensions-client-0.1.jar
[INFO] Downloaded: file:///F:/ws/m3-its/core-integration-testing-trunk/core-it-suite/target/test-classes/mng-5771-core-extensions/repo/org/apache/maven/its/it-core-extensions/maven-it-plugin-core-extensions-client/0.1/maven-it-plugin-core-extensions-client-0.1.jar
(6.4 kB at 3.2 MB/s)
[INFO] 
[INFO] --- maven-it-plugin-core-extensions-client:0.1:validate-component (validate-extensions)
@ test ---
[INFO] ------------------------------------------------------------------------
[INFO] BUILD FAILURE
[INFO] ------------------------------------------------------------------------
[INFO] Total time: 0.613 s
[INFO] Finished at: 2016-11-13T16:33:32-08:00
[INFO] Final Memory: 16M/736M
[INFO] ------------------------------------------------------------------------
[ERROR] Failed to execute goal org.apache.maven.its.it-core-extensions:maven-it-plugin-core-extensions-client:0.1:validate-component
(validate-extensions) on project test: Expected core extension component is not available
-> [Help 1]
org.apache.maven.lifecycle.LifecycleExecutionException: Failed to execute goal org.apache.maven.its.it-core-extensions:maven-it-plugin-core-extensions-client:0.1:validate-component
(validate-extensions) on project test: Expected core extension component is not available
	at org.apache.maven.lifecycle.internal.MojoExecutor.execute(MojoExecutor.java:214)
	at org.apache.maven.lifecycle.internal.MojoExecutor.execute(MojoExecutor.java:155)
	at org.apache.maven.lifecycle.internal.MojoExecutor.execute(MojoExecutor.java:147)
	at org.apache.maven.lifecycle.internal.LifecycleModuleBuilder.buildProject(LifecycleModuleBuilder.java:116)
	at org.apache.maven.lifecycle.internal.LifecycleModuleBuilder.buildProject(LifecycleModuleBuilder.java:80)
	at org.apache.maven.lifecycle.internal.builder.singlethreaded.SingleThreadedBuilder.build(SingleThreadedBuilder.java:51)
	at org.apache.maven.lifecycle.internal.LifecycleStarter.execute(LifecycleStarter.java:128)
	at org.apache.maven.DefaultMaven.doExecute(DefaultMaven.java:285)
	at org.apache.maven.DefaultMaven.doExecute(DefaultMaven.java:194)
	at org.apache.maven.DefaultMaven.execute(DefaultMaven.java:107)
	at org.apache.maven.cli.MavenCli.execute(MavenCli.java:1018)
	at org.apache.maven.cli.MavenCli.doMain(MavenCli.java:316)
	at org.apache.maven.cli.MavenCli.main(MavenCli.java:219)
	at sun.reflect.NativeMethodAccessorImpl.invoke0(Native Method)
	at sun.reflect.NativeMethodAccessorImpl.invoke(NativeMethodAccessorImpl.java:57)
	at sun.reflect.DelegatingMethodAccessorImpl.invoke(DelegatingMethodAccessorImpl.java:43)
	at java.lang.reflect.Method.invoke(Method.java:606)
	at org.codehaus.plexus.classworlds.launcher.Launcher.launchEnhanced(Launcher.java:289)
	at org.codehaus.plexus.classworlds.launcher.Launcher.launch(Launcher.java:229)
	at org.codehaus.plexus.classworlds.launcher.Launcher.mainWithExitCode(Launcher.java:415)
	at org.codehaus.plexus.classworlds.launcher.Launcher.main(Launcher.java:356)
Caused by: org.apache.maven.plugin.MojoExecutionException: Expected core extension component
is not available
	at org.apache.maven.its.it_core_extensions.plugin.ValidateComponentMojo.execute(ValidateComponentMojo.java:25)
	at org.apache.maven.plugin.DefaultBuildPluginManager.executeMojo(DefaultBuildPluginManager.java:134)
	at org.apache.maven.lifecycle.internal.MojoExecutor.execute(MojoExecutor.java:209)
	... 20 more
[ERROR] 
[ERROR] Re-run Maven using the -X switch to enable full debug logging.
[ERROR] 
[ERROR] For more information about the errors and possible solutions, please read the following
articles:
[ERROR] [Help 1] http://cwiki.apache.org/confluence/display/MAVEN/MojoExecutionException

	at org.apache.maven.it.Verifier.executeGoals(Verifier.java:1374)
	at org.apache.maven.it.Verifier.executeGoal(Verifier.java:1259)
	at org.apache.maven.it.Verifier.executeGoal(Verifier.java:1253)
	at org.apache.maven.it.MavenITmng5889CoreExtensionsTest.testCoreExtensionFile(MavenITmng5889CoreExtensionsTest.java:59)


Results :

Tests in error: 
  MavenITmng5889CoreExtensionsTest>AbstractMavenIntegrationTestCase.runTest:223->testCoreExtensionFile:59
ยป Verification

Tests run: 794, Failures: 0, Errors: 1, Skipped: 0

[INFO] ------------------------------------------------------------------------
[INFO] Reactor Summary:
[INFO] 
[INFO] Maven Core ITs ..................................... SUCCESS [ 21.985 s]
[INFO] Maven IT Support ................................... SUCCESS [  1.529 s]
[INFO] Maven IT :: Plugins ................................ SUCCESS [  1.315 s]
[INFO] Maven IT Plugin :: Active Collection ............... SUCCESS [  6.940 s]
[INFO] Maven IT Plugin :: Ant-Based ....................... SUCCESS [  3.451 s]
[INFO] Maven IT Plugin :: Artifact ........................ SUCCESS [  2.456 s]
[INFO] Maven IT Plugin :: Class Loader :: Dependency A .... SUCCESS [  1.170 s]
[INFO] Maven IT Plugin :: Class Loader :: Dependency B .... SUCCESS [  1.235 s]
[INFO] Maven IT Plugin :: Class Loader :: Dependency C .... SUCCESS [  1.129 s]
[INFO] Maven IT Plugin :: Class Loader .................... SUCCESS [  2.595 s]
[INFO] Maven IT Plugin :: Class Loader :: Aggregator ...... SUCCESS [  1.100 s]
[INFO] Maven IT Plugin :: Configuration ................... SUCCESS [  1.754 s]
[INFO] Maven IT Plugin :: Context Passing ................. SUCCESS [  1.285 s]
[INFO] Maven ITs :: Core Plugin Stubs ..................... SUCCESS [  1.181 s]
[INFO] Maven IT Clean Plugin Stub ......................... SUCCESS [  1.543 s]
[INFO] Maven IT Compiler Plugin Stub ...................... SUCCESS [  1.585 s]
[INFO] Maven IT Deploy Plugin Stub ........................ SUCCESS [  1.443 s]
[INFO] Maven IT EAR Plugin Stub ........................... SUCCESS [  1.462 s]
[INFO] Maven IT EJB Plugin Stub ........................... SUCCESS [  1.378 s]
[INFO] Maven IT Install Plugin Stub ....................... SUCCESS [  1.413 s]
[INFO] Maven IT JAR Plugin Stub ........................... SUCCESS [  1.389 s]
[INFO] Maven IT Javadoc Plugin Stub ....................... SUCCESS [  1.321 s]
[INFO] Maven IT Plugin Plugin Stub ........................ SUCCESS [  1.364 s]
[INFO] Maven IT RAR Plugin Stub ........................... SUCCESS [  1.989 s]
[INFO] Maven IT Resources Plugin Stub ..................... SUCCESS [  1.400 s]
[INFO] Maven IT Site Plugin Stub .......................... SUCCESS [  1.432 s]
[INFO] Maven IT Source Plugin Stub ........................ SUCCESS [  1.332 s]
[INFO] Maven IT Surefire Plugin Stub ...................... SUCCESS [  1.394 s]
[INFO] Maven IT WAR Plugin Stub ........................... SUCCESS [  1.406 s]
[INFO] Maven IT Plugin :: Dependency Collection ........... SUCCESS [  1.487 s]
[INFO] Maven IT Plugin :: Dependency Resolution ........... SUCCESS [  4.496 s]
[INFO] Maven IT Plugin :: Expression ...................... SUCCESS [  1.928 s]
[INFO] Maven IT Plugin :: Error Mojos ..................... SUCCESS [  2.188 s]
[INFO] Maven IT Component ................................. SUCCESS [  1.175 s]
[INFO] Maven IT Plugin :: Extension Consumer .............. SUCCESS [  1.244 s]
[INFO] Maven IT Plugin :: Extension Provider .............. SUCCESS [  1.277 s]
[INFO] Maven IT Plugin :: Fork ............................ SUCCESS [  1.482 s]
[INFO] Maven IT Plugin :: Invalid Descriptor .............. SUCCESS [  1.263 s]
[INFO] Maven IT Plugin :: Log File ........................ SUCCESS [  1.220 s]
[INFO] Maven IT Helper Library ............................ SUCCESS [  4.251 s]
[INFO] Maven IT Plugin :: Model Interpolation ............. SUCCESS [  1.592 s]
[INFO] Maven IT Plugin :: No Default Component ............ SUCCESS [  1.198 s]
[INFO] Maven IT Plugin :: No Project ...................... SUCCESS [  1.222 s]
[INFO] Maven IT Plugin :: Online .......................... SUCCESS [  1.197 s]
[INFO] Maven IT Plugin :: Optional Mojos .................. SUCCESS [  1.278 s]
[INFO] Maven IT Plugin :: Packaging ....................... SUCCESS [  1.323 s]
[INFO] Maven IT Plugin :: Parameter Implementation ........ SUCCESS [  1.243 s]
[INFO] Maven IT Plugin :: Plugin Dependency ............... SUCCESS [  1.287 s]
[INFO] Maven IT Plugin :: Project ......................... SUCCESS [  1.498 s]
[INFO] Maven IT Plugin :: Project Interpolation ........... SUCCESS [  1.493 s]
[INFO] Maven IT Plugin :: Setter .......................... SUCCESS [  1.284 s]
[INFO] Maven IT Plugin :: Singleton Component ............. SUCCESS [  1.284 s]
[INFO] Maven IT Plugin :: Site ............................ SUCCESS [  2.493 s]
[INFO] Maven IT Plugin :: Toolchain ....................... SUCCESS [  3.861 s]
[INFO] Maven IT Plugin :: Touch ........................... SUCCESS [  1.560 s]
[INFO] Maven IT Plugin :: Uses Properties Plugin .......... SUCCESS [  1.266 s]
[INFO] Maven IT Plugin :: Uses Wagon Plugin ............... SUCCESS [  2.422 s]
[INFO] Maven IT Plugin :: This plugin should contain the mojos needed by all tests. SUCCESS
[  1.207 s]
[INFO] Maven IT Plugin :: Plexus Utils 1.1 ................ SUCCESS [  1.362 s]
[INFO] Maven IT Plugin :: Plexus Utils New ................ SUCCESS [  1.360 s]
[INFO] Maven IT Plugin :: Plexus Component API ............ SUCCESS [  1.652 s]
[INFO] Maven IT Plugin :: Log4J Client .................... SUCCESS [  1.366 s]
[INFO] Maven IT Plugin :: Extension 1 ..................... SUCCESS [  1.288 s]
[INFO] Maven IT Plugin :: Extension 2 ..................... SUCCESS [  1.248 s]
[INFO] Maven IT Plugin :: Plexus Lifecycle ................ SUCCESS [  1.911 s]
[INFO] Maven IT Plugin :: Settings ........................ SUCCESS [  1.323 s]
[INFO] Maven IT Plugin :: mng-5805 extension .............. SUCCESS [  1.149 s]
[INFO] Maven IT Plugin :: mng-5805 plugin ................. SUCCESS [  1.307 s]
[INFO] Maven IT Plugin :: mng-5805 plugin-dep ............. SUCCESS [  1.171 s]
[INFO] Maven IT Plugin :: mng-5958 extension .............. SUCCESS [  3.562 s]
[INFO] Maven IT Toolchain ................................. SUCCESS [  1.701 s]
[INFO] Maven IT Wagon ..................................... SUCCESS [  1.361 s]
[INFO] Maven IT Support Artifacts ......................... SUCCESS [  1.977 s]
[INFO] Maven IT Extension ................................. SUCCESS [  1.107 s]
[INFO] Maven ITs .......................................... FAILURE [  01:09 h]
[INFO] ------------------------------------------------------------------------
[INFO] BUILD FAILURE
[INFO] ------------------------------------------------------------------------
[INFO] Total time: 01:12 h
[INFO] Finished at: 2016-11-13T17:42:32-08:00
[INFO] Final Memory: 60M/765M
[INFO] ------------------------------------------------------------------------
[ERROR] Failed to execute goal org.apache.maven.plugins:maven-surefire-plugin:2.18.1:test
(default-test) on project core-it-suite: There are test failures.
[ERROR] 
[ERROR] Please refer to F:\ws\m3-its\core-integration-testing-trunk\core-it-suite\target\surefire-reports
for the individual test results.
[ERROR] -> [Help 1]
org.apache.maven.lifecycle.LifecycleExecutionException: Failed to execute goal org.apache.maven.plugins:maven-surefire-plugin:2.18.1:test
(default-test) on project core-it-suite: There are test failures.

Please refer to F:\ws\m3-its\core-integration-testing-trunk\core-it-suite\target\surefire-reports
for the individual test results.
	at org.apache.maven.lifecycle.internal.MojoExecutor.execute(MojoExecutor.java:212)
	at org.apache.maven.lifecycle.internal.MojoExecutor.execute(MojoExecutor.java:153)
	at org.apache.maven.lifecycle.internal.MojoExecutor.execute(MojoExecutor.java:145)
	at org.apache.maven.lifecycle.internal.LifecycleModuleBuilder.buildProject(LifecycleModuleBuilder.java:116)
	at org.apache.maven.lifecycle.internal.LifecycleModuleBuilder.buildProject(LifecycleModuleBuilder.java:80)
	at org.apache.maven.lifecycle.internal.builder.singlethreaded.SingleThreadedBuilder.build(SingleThreadedBuilder.java:51)
	at org.apache.maven.lifecycle.internal.LifecycleStarter.execute(LifecycleStarter.java:128)
	at org.apache.maven.DefaultMaven.doExecute(DefaultMaven.java:307)
	at org.apache.maven.DefaultMaven.doExecute(DefaultMaven.java:193)
	at org.apache.maven.DefaultMaven.execute(DefaultMaven.java:106)
	at org.apache.maven.cli.MavenCli.execute(MavenCli.java:863)
	at org.apache.maven.cli.MavenCli.doMain(MavenCli.java:288)
	at org.apache.maven.cli.MavenCli.main(MavenCli.java:199)
	at sun.reflect.NativeMethodAccessorImpl.invoke0(Native Method)
	at sun.reflect.NativeMethodAccessorImpl.invoke(NativeMethodAccessorImpl.java:57)
	at sun.reflect.DelegatingMethodAccessorImpl.invoke(DelegatingMethodAccessorImpl.java:43)
	at java.lang.reflect.Method.invoke(Method.java:606)
	at org.codehaus.plexus.classworlds.launcher.Launcher.launchEnhanced(Launcher.java:289)
	at org.codehaus.plexus.classworlds.launcher.Launcher.launch(Launcher.java:229)
	at org.codehaus.plexus.classworlds.launcher.Launcher.mainWithExitCode(Launcher.java:415)
	at org.codehaus.plexus.classworlds.launcher.Launcher.main(Launcher.java:356)
Caused by: org.apache.maven.plugin.MojoFailureException: There are test failures.

Please refer to F:\ws\m3-its\core-integration-testing-trunk\core-it-suite\target\surefire-reports
for the individual test results.
	at org.apache.maven.plugin.surefire.SurefireHelper.reportExecution(SurefireHelper.java:82)
	at org.apache.maven.plugin.surefire.SurefirePlugin.handleSummary(SurefirePlugin.java:254)
	at org.apache.maven.plugin.surefire.AbstractSurefireMojo.executeAfterPreconditionsChecked(AbstractSurefireMojo.java:854)
	at org.apache.maven.plugin.surefire.AbstractSurefireMojo.execute(AbstractSurefireMojo.java:722)
	at org.apache.maven.plugin.DefaultBuildPluginManager.executeMojo(DefaultBuildPluginManager.java:134)
	at org.apache.maven.lifecycle.internal.MojoExecutor.execute(MojoExecutor.java:207)
	... 20 more
[ERROR] 
[ERROR] Re-run Maven using the -X switch to enable full debug logging.
[ERROR] 
[ERROR] For more information about the errors and possible solutions, please read the following
articles:
[ERROR] [Help 1] http://cwiki.apache.org/confluence/display/MAVEN/MojoFailureException
[ERROR] 
[ERROR] After correcting the problems, you can resume the build with the command
[ERROR]   mvn <goals> -rf :core-it-suite
Build step 'Invoke top-level Maven targets' marked build as failure
Recording test results

Mime
View raw message