maven-notifications mailing list archives

Site index · List index
Message view « Date » · « Thread »
Top « Date » · « Thread »
From Apache Jenkins Server <jenk...@builds.apache.org>
Subject Build failed in Jenkins: maven-plugin-tools Jigsaw #2
Date Sun, 13 Nov 2016 23:03:19 GMT
See <https://builds.apache.org/job/maven-plugin-tools%20Jigsaw/2/>

------------------------------------------
[...truncated 766 lines...]
[INFO] 5 resources included (use -debug for more details)
[INFO] Rat check: Summary of files. Unapproved: 0 unknown: 0 generated: 0 approved: 5 licence.
[INFO] 
[INFO] --- maven-remote-resources-plugin:1.5:process (process-resource-bundles) @ maven-plugin-tools-beanshell
---
[INFO] 
[INFO] --- maven-resources-plugin:2.7:resources (default-resources) @ maven-plugin-tools-beanshell
---
[INFO] Using 'UTF-8' encoding to copy filtered resources.
[INFO] Copying 1 resource
[INFO] Copying 3 resources
[INFO] 
[INFO] --- maven-compiler-plugin:3.5.1:compile (default-compile) @ maven-plugin-tools-beanshell
---
[INFO] Changes detected - recompiling the module!
[INFO] Compiling 1 source file to <https://builds.apache.org/job/maven-plugin-tools%20Jigsaw/ws/maven-script/maven-plugin-tools-beanshell/target/classes>
[INFO] 
[INFO] --- plexus-component-metadata:1.7:generate-metadata (default) @ maven-plugin-tools-beanshell
---
[INFO] Discovered 1 component descriptors(s)
[INFO] 
[INFO] --- maven-resources-plugin:2.7:testResources (default-testResources) @ maven-plugin-tools-beanshell
---
[INFO] Using 'UTF-8' encoding to copy filtered resources.
[INFO] skip non existing resourceDirectory <https://builds.apache.org/job/maven-plugin-tools%20Jigsaw/ws/maven-script/maven-plugin-tools-beanshell/src/test/resources>
[INFO] Copying 3 resources
[INFO] 
[INFO] --- maven-compiler-plugin:3.5.1:testCompile (default-testCompile) @ maven-plugin-tools-beanshell
---
[INFO] No sources to compile
[INFO] 
[INFO] --- plexus-component-metadata:1.7:generate-test-metadata (default) @ maven-plugin-tools-beanshell
---
[INFO] 
[INFO] --- maven-surefire-plugin:2.19.1:test (default-test) @ maven-plugin-tools-beanshell
---
[JENKINS] Recording test results
[INFO] 
[INFO] --- maven-jar-plugin:3.0.0:jar (default-jar) @ maven-plugin-tools-beanshell ---
[INFO] Building jar: <https://builds.apache.org/job/maven-plugin-tools%20Jigsaw/ws/maven-script/maven-plugin-tools-beanshell/target/maven-plugin-tools-beanshell-3.6-SNAPSHOT.jar>
[INFO] 
[INFO] --- maven-site-plugin:3.5.1:attach-descriptor (attach-descriptor) @ maven-plugin-tools-beanshell
---
[INFO] 
[INFO] --- maven-checkstyle-plugin:2.15:check (checkstyle-check) @ maven-plugin-tools-beanshell
---
[INFO] 
[INFO] --- maven-install-plugin:2.5.2:install (default-install) @ maven-plugin-tools-beanshell
---
[INFO] Installing <https://builds.apache.org/job/maven-plugin-tools%20Jigsaw/ws/maven-script/maven-plugin-tools-beanshell/target/maven-plugin-tools-beanshell-3.6-SNAPSHOT.jar>
to /home/jenkins/jenkins-slave/maven-repositories/0/org/apache/maven/plugin-tools/maven-plugin-tools-beanshell/3.6-SNAPSHOT/maven-plugin-tools-beanshell-3.6-SNAPSHOT.jar
[INFO] Installing <https://builds.apache.org/job/maven-plugin-tools%20Jigsaw/ws/maven-script/maven-plugin-tools-beanshell/pom.xml>
to /home/jenkins/jenkins-slave/maven-repositories/0/org/apache/maven/plugin-tools/maven-plugin-tools-beanshell/3.6-SNAPSHOT/maven-plugin-tools-beanshell-3.6-SNAPSHOT.pom
[INFO]                                                                         
[INFO] ------------------------------------------------------------------------
[INFO] Building Maven Beanshell Mojo Support 3.6-SNAPSHOT
[INFO] ------------------------------------------------------------------------
Downloading: http://repo.maven.apache.org/maven2/org/codehaus/plexus/plexus-bsh-factory/1.0-alpha-7/plexus-bsh-factory-1.0-alpha-7.pom
Downloaded: http://repo.maven.apache.org/maven2/org/codehaus/plexus/plexus-bsh-factory/1.0-alpha-7/plexus-bsh-factory-1.0-alpha-7.pom
(8 KB at 36.9 KB/sec)
Downloading: http://repo.maven.apache.org/maven2/bsh/bsh/1.3.0/bsh-1.3.0.pom
Downloaded: http://repo.maven.apache.org/maven2/bsh/bsh/1.3.0/bsh-1.3.0.pom (210 B at 6.8
KB/sec)
Downloading: http://repo.maven.apache.org/maven2/org/codehaus/plexus/plexus-bsh-factory/1.0-alpha-7/plexus-bsh-factory-1.0-alpha-7.jar
Downloading: http://repo.maven.apache.org/maven2/bsh/bsh/1.3.0/bsh-1.3.0.jar
Downloaded: http://repo.maven.apache.org/maven2/bsh/bsh/1.3.0/bsh-1.3.0.jar (237 KB at 4222.8
KB/sec)
Downloaded: http://repo.maven.apache.org/maven2/org/codehaus/plexus/plexus-bsh-factory/1.0-alpha-7/plexus-bsh-factory-1.0-alpha-7.jar
(9 KB at 29.5 KB/sec)
[INFO] 
[INFO] --- maven-clean-plugin:3.0.0:clean (default-clean) @ maven-script-beanshell ---
[INFO] 
[INFO] --- maven-enforcer-plugin:1.4.1:enforce (enforce-bytecode-version) @ maven-script-beanshell
---
[INFO] 
[INFO] --- maven-enforcer-plugin:1.4.1:enforce (ban-known-bad-maven-versions) @ maven-script-beanshell
---
[INFO] 
[INFO] --- apache-rat-plugin:0.11:check (rat-check) @ maven-script-beanshell ---
[INFO] 51 implicit excludes (use -debug for more details).
[INFO] Exclude: DEPENDENCIES
[INFO] 3 resources included (use -debug for more details)
[INFO] Rat check: Summary of files. Unapproved: 0 unknown: 0 generated: 0 approved: 3 licence.
[INFO] 
[INFO] --- maven-remote-resources-plugin:1.5:process (process-resource-bundles) @ maven-script-beanshell
---
[INFO] 
[INFO] --- maven-resources-plugin:2.7:resources (default-resources) @ maven-script-beanshell
---
[INFO] Using 'UTF-8' encoding to copy filtered resources.
[INFO] skip non existing resourceDirectory <https://builds.apache.org/job/maven-plugin-tools%20Jigsaw/ws/maven-script/maven-script-beanshell/src/main/resources>
[INFO] Copying 3 resources
[INFO] 
[INFO] --- maven-compiler-plugin:3.5.1:compile (default-compile) @ maven-script-beanshell
---
[INFO] Changes detected - recompiling the module!
[INFO] Compiling 1 source file to <https://builds.apache.org/job/maven-plugin-tools%20Jigsaw/ws/maven-script/maven-script-beanshell/target/classes>
[INFO] 
[INFO] --- maven-resources-plugin:2.7:testResources (default-testResources) @ maven-script-beanshell
---
[INFO] Using 'UTF-8' encoding to copy filtered resources.
[INFO] skip non existing resourceDirectory <https://builds.apache.org/job/maven-plugin-tools%20Jigsaw/ws/maven-script/maven-script-beanshell/src/test/resources>
[INFO] Copying 3 resources
[INFO] 
[INFO] --- maven-compiler-plugin:3.5.1:testCompile (default-testCompile) @ maven-script-beanshell
---
[INFO] No sources to compile
[INFO] 
[INFO] --- maven-surefire-plugin:2.19.1:test (default-test) @ maven-script-beanshell ---
[JENKINS] Recording test results
[INFO] 
[INFO] --- maven-jar-plugin:3.0.0:jar (default-jar) @ maven-script-beanshell ---
[INFO] Building jar: <https://builds.apache.org/job/maven-plugin-tools%20Jigsaw/ws/maven-script/maven-script-beanshell/target/maven-script-beanshell-3.6-SNAPSHOT.jar>
[INFO] 
[INFO] --- maven-site-plugin:3.5.1:attach-descriptor (attach-descriptor) @ maven-script-beanshell
---
[INFO] 
[INFO] --- maven-checkstyle-plugin:2.15:check (checkstyle-check) @ maven-script-beanshell
---
[INFO] 
[INFO] --- maven-install-plugin:2.5.2:install (default-install) @ maven-script-beanshell ---
[INFO] Installing <https://builds.apache.org/job/maven-plugin-tools%20Jigsaw/ws/maven-script/maven-script-beanshell/target/maven-script-beanshell-3.6-SNAPSHOT.jar>
to /home/jenkins/jenkins-slave/maven-repositories/0/org/apache/maven/plugin-tools/maven-script-beanshell/3.6-SNAPSHOT/maven-script-beanshell-3.6-SNAPSHOT.jar
[INFO] Installing <https://builds.apache.org/job/maven-plugin-tools%20Jigsaw/ws/maven-script/maven-script-beanshell/pom.xml>
to /home/jenkins/jenkins-slave/maven-repositories/0/org/apache/maven/plugin-tools/maven-script-beanshell/3.6-SNAPSHOT/maven-script-beanshell-3.6-SNAPSHOT.pom
[INFO]                                                                         
[INFO] ------------------------------------------------------------------------
[INFO] Skipping Maven Plugin Plugin
[INFO] This project has been banned from the build due to previous failures.
[INFO] ------------------------------------------------------------------------
[INFO] ------------------------------------------------------------------------
[INFO] Reactor Summary:
[INFO] 
[INFO] Maven Plugin Tools ................................ SUCCESS [19.680s]
[INFO] Maven Plugin Tools Extractor API .................. SUCCESS [2:02.573s]
[INFO] Maven Plugin Tools Generators ..................... FAILURE [2.448s]
[INFO] Maven Plugin Tool for Java with Javadoc Tags ...... SKIPPED
[INFO] Maven Plugin Tools Java 5 Annotations ............. SUCCESS [8.775s]
[INFO] Maven Plugin Tool for Java with Annotations ....... FAILURE [1.884s]
[INFO] Maven Plugin Tools Javadoc Taglets ................ SKIPPED
[INFO] Maven Script Mojo Support ......................... SUCCESS [5.855s]
[INFO] Maven Plugin Metadata Model ....................... SUCCESS [16.419s]
[INFO] Maven Plugin Tool for Ant ......................... SUCCESS [12.652s]
[INFO] Maven Ant Mojo Support ............................ SUCCESS [12.100s]
[INFO] Maven Plugin Tool for Beanshell ................... SUCCESS [9.384s]
[INFO] Maven Beanshell Mojo Support ...................... SUCCESS [10.493s]
[INFO] Maven Plugin Plugin ............................... SKIPPED
[INFO] ------------------------------------------------------------------------
[INFO] BUILD FAILURE
[INFO] ------------------------------------------------------------------------
[INFO] Total time: 5:02.161s
[INFO] Finished at: Sun Nov 13 23:00:46 UTC 2016
[INFO] Final Memory: 40M/256M
[INFO] ------------------------------------------------------------------------
Waiting for Jenkins to finish collecting data
[ERROR] Failed to execute goal org.apache.maven.plugins:maven-enforcer-plugin:1.4.1:enforce
(enforce-bytecode-version) on project maven-plugin-tools-generators: Some Enforcer rules have
failed. Look above for specific messages explaining why the rule failed. -> [Help 1]
org.apache.maven.lifecycle.LifecycleExecutionException: Failed to execute goal org.apache.maven.plugins:maven-enforcer-plugin:1.4.1:enforce
(enforce-bytecode-version) on project maven-plugin-tools-generators: Some Enforcer rules have
failed. Look above for specific messages explaining why the rule failed.
	at org.apache.maven.lifecycle.internal.MojoExecutor.execute(MojoExecutor.java:217)
	at org.apache.maven.lifecycle.internal.MojoExecutor.execute(MojoExecutor.java:153)
	at org.apache.maven.lifecycle.internal.MojoExecutor.execute(MojoExecutor.java:145)
	at org.apache.maven.lifecycle.internal.LifecycleModuleBuilder.buildProject(LifecycleModuleBuilder.java:84)
	at org.apache.maven.lifecycle.internal.LifecycleModuleBuilder.buildProject(LifecycleModuleBuilder.java:59)
	at org.apache.maven.lifecycle.internal.LifecycleStarter.singleThreadedBuild(LifecycleStarter.java:183)
	at org.apache.maven.lifecycle.internal.LifecycleStarter.execute(LifecycleStarter.java:161)
	at org.apache.maven.DefaultMaven.doExecute(DefaultMaven.java:320)
	at org.apache.maven.DefaultMaven.execute(DefaultMaven.java:156)
	at org.jvnet.hudson.maven3.launcher.Maven3Launcher.main(Maven3Launcher.java:117)
	at jdk.internal.reflect.NativeMethodAccessorImpl.invoke0(java.base@9-ea/Native Method)
	at jdk.internal.reflect.NativeMethodAccessorImpl.invoke(java.base@9-ea/NativeMethodAccessorImpl.java:62)
	at jdk.internal.reflect.DelegatingMethodAccessorImpl.invoke(java.base@9-ea/DelegatingMethodAccessorImpl.java:43)
	at java.lang.reflect.Method.invoke(java.base@9-ea/Method.java:535)
	at org.codehaus.plexus.classworlds.launcher.Launcher.launchStandard(Launcher.java:329)
	at org.codehaus.plexus.classworlds.launcher.Launcher.launch(Launcher.java:239)
	at org.jvnet.hudson.maven3.agent.Maven3Main.launch(Maven3Main.java:181)
	at jdk.internal.reflect.NativeMethodAccessorImpl.invoke0(java.base@9-ea/Native Method)
	at jdk.internal.reflect.NativeMethodAccessorImpl.invoke(java.base@9-ea/NativeMethodAccessorImpl.java:62)
	at jdk.internal.reflect.DelegatingMethodAccessorImpl.invoke(java.base@9-ea/DelegatingMethodAccessorImpl.java:43)
	at java.lang.reflect.Method.invoke(java.base@9-ea/Method.java:535)
	at hudson.maven.Maven3Builder.call(Maven3Builder.java:136)
	at hudson.maven.Maven3Builder.call(Maven3Builder.java:71)
	at hudson.remoting.UserRequest.perform(UserRequest.java:153)
	at hudson.remoting.UserRequest.perform(UserRequest.java:50)
	at hudson.remoting.Request$2.run(Request.java:332)
	at hudson.remoting.InterceptingExecutorService$1.call(InterceptingExecutorService.java:68)
	at java.util.concurrent.FutureTask.run(java.base@9-ea/FutureTask.java:264)
	at java.util.concurrent.ThreadPoolExecutor.runWorker(java.base@9-ea/ThreadPoolExecutor.java:1161)
	at java.util.concurrent.ThreadPoolExecutor$Worker.run(java.base@9-ea/ThreadPoolExecutor.java:635)
	at java.lang.Thread.run(java.base@9-ea/Thread.java:843)
Caused by: org.apache.maven.plugin.MojoExecutionException: Some Enforcer rules have failed.
Look above for specific messages explaining why the rule failed.
	at org.apache.maven.plugins.enforcer.EnforceMojo.execute(EnforceMojo.java:237)
	at org.apache.maven.plugin.DefaultBuildPluginManager.executeMojo(DefaultBuildPluginManager.java:101)
	at org.apache.maven.lifecycle.internal.MojoExecutor.execute(MojoExecutor.java:209)
	... 30 more
[ERROR] Failed to execute goal org.apache.maven.plugins:maven-enforcer-plugin:1.4.1:enforce
(enforce-bytecode-version) on project maven-plugin-tools-annotations: Some Enforcer rules
have failed. Look above for specific messages explaining why the rule failed. -> [Help
1]
org.apache.maven.lifecycle.LifecycleExecutionException: Failed to execute goal org.apache.maven.plugins:maven-enforcer-plugin:1.4.1:enforce
(enforce-bytecode-version) on project maven-plugin-tools-annotations: Some Enforcer rules
have failed. Look above for specific messages explaining why the rule failed.
	at org.apache.maven.lifecycle.internal.MojoExecutor.execute(MojoExecutor.java:217)
	at org.apache.maven.lifecycle.internal.MojoExecutor.execute(MojoExecutor.java:153)
	at org.apache.maven.lifecycle.internal.MojoExecutor.execute(MojoExecutor.java:145)
	at org.apache.maven.lifecycle.internal.LifecycleModuleBuilder.buildProject(LifecycleModuleBuilder.java:84)
	at org.apache.maven.lifecycle.internal.LifecycleModuleBuilder.buildProject(LifecycleModuleBuilder.java:59)
	at org.apache.maven.lifecycle.internal.LifecycleStarter.singleThreadedBuild(LifecycleStarter.java:183)
	at org.apache.maven.lifecycle.internal.LifecycleStarter.execute(LifecycleStarter.java:161)
	at org.apache.maven.DefaultMaven.doExecute(DefaultMaven.java:320)
	at org.apache.maven.DefaultMaven.execute(DefaultMaven.java:156)
	at org.jvnet.hudson.maven3.launcher.Maven3Launcher.main(Maven3Launcher.java:117)
	at jdk.internal.reflect.NativeMethodAccessorImpl.invoke0(java.base@9-ea/Native Method)
	at jdk.internal.reflect.NativeMethodAccessorImpl.invoke(java.base@9-ea/NativeMethodAccessorImpl.java:62)
	at jdk.internal.reflect.DelegatingMethodAccessorImpl.invoke(java.base@9-ea/DelegatingMethodAccessorImpl.java:43)
	at java.lang.reflect.Method.invoke(java.base@9-ea/Method.java:535)
	at org.codehaus.plexus.classworlds.launcher.Launcher.launchStandard(Launcher.java:329)
	at org.codehaus.plexus.classworlds.launcher.Launcher.launch(Launcher.java:239)
	at org.jvnet.hudson.maven3.agent.Maven3Main.launch(Maven3Main.java:181)
	at jdk.internal.reflect.NativeMethodAccessorImpl.invoke0(java.base@9-ea/Native Method)
	at jdk.internal.reflect.NativeMethodAccessorImpl.invoke(java.base@9-ea/NativeMethodAccessorImpl.java:62)
	at jdk.internal.reflect.DelegatingMethodAccessorImpl.invoke(java.base@9-ea/DelegatingMethodAccessorImpl.java:43)
	at java.lang.reflect.Method.invoke(java.base@9-ea/Method.java:535)
	at hudson.maven.Maven3Builder.call(Maven3Builder.java:136)
	at hudson.maven.Maven3Builder.call(Maven3Builder.java:71)
	at hudson.remoting.UserRequest.perform(UserRequest.java:153)
	at hudson.remoting.UserRequest.perform(UserRequest.java:50)
	at hudson.remoting.Request$2.run(Request.java:332)
	at hudson.remoting.InterceptingExecutorService$1.call(InterceptingExecutorService.java:68)
	at java.util.concurrent.FutureTask.run(java.base@9-ea/FutureTask.java:264)
	at java.util.concurrent.ThreadPoolExecutor.runWorker(java.base@9-ea/ThreadPoolExecutor.java:1161)
	at java.util.concurrent.ThreadPoolExecutor$Worker.run(java.base@9-ea/ThreadPoolExecutor.java:635)
	at java.lang.Thread.run(java.base@9-ea/Thread.java:843)
Caused by: org.apache.maven.plugin.MojoExecutionException: Some Enforcer rules have failed.
Look above for specific messages explaining why the rule failed.
	at org.apache.maven.plugins.enforcer.EnforceMojo.execute(EnforceMojo.java:237)
	at org.apache.maven.plugin.DefaultBuildPluginManager.executeMojo(DefaultBuildPluginManager.java:101)
	at org.apache.maven.lifecycle.internal.MojoExecutor.execute(MojoExecutor.java:209)
	... 30 more
[ERROR] 
[ERROR] Re-run Maven using the -X switch to enable full debug logging.
[ERROR] 
[ERROR] For more information about the errors and possible solutions, please read the following
articles:
[ERROR] [Help 1] http://cwiki.apache.org/confluence/display/MAVEN/MojoExecutionException
[ERROR] 
[ERROR] After correcting the problems, you can resume the build with the command
[ERROR]   mvn <goals> -rf :maven-plugin-tools-generators
[JENKINS] Archiving <https://builds.apache.org/job/maven-plugin-tools%20Jigsaw/ws/maven-plugin-plugin/pom.xml>
to org.apache.maven.plugins/maven-plugin-plugin/3.6-SNAPSHOT/maven-plugin-plugin-3.6-SNAPSHOT.pom
No prior successful build to compare, so performing full copy of artifacts
[JENKINS] Archiving <https://builds.apache.org/job/maven-plugin-tools%20Jigsaw/ws/maven-plugin-tools-java/pom.xml>
to org.apache.maven.plugin-tools/maven-plugin-tools-java/3.6-SNAPSHOT/maven-plugin-tools-java-3.6-SNAPSHOT.pom
No prior successful build to compare, so performing full copy of artifacts
[JENKINS] Archiving <https://builds.apache.org/job/maven-plugin-tools%20Jigsaw/ws/maven-script/maven-plugin-tools-ant/pom.xml>
to org.apache.maven.plugin-tools/maven-plugin-tools-ant/3.6-SNAPSHOT/maven-plugin-tools-ant-3.6-SNAPSHOT.pom
[JENKINS] Archiving <https://builds.apache.org/job/maven-plugin-tools%20Jigsaw/ws/maven-script/maven-plugin-tools-ant/target/maven-plugin-tools-ant-3.6-SNAPSHOT.jar>
to org.apache.maven.plugin-tools/maven-plugin-tools-ant/3.6-SNAPSHOT/maven-plugin-tools-ant-3.6-SNAPSHOT.jar
No prior successful build to compare, so performing full copy of artifacts
[JENKINS] Archiving <https://builds.apache.org/job/maven-plugin-tools%20Jigsaw/ws/maven-script/pom.xml>
to org.apache.maven.plugin-tools/maven-script/3.6-SNAPSHOT/maven-script-3.6-SNAPSHOT.pom
[JENKINS] Archiving <https://builds.apache.org/job/maven-plugin-tools%20Jigsaw/ws/maven-script/target/maven-script-3.6-SNAPSHOT-site.xml>
to org.apache.maven.plugin-tools/maven-script/3.6-SNAPSHOT/maven-script-3.6-SNAPSHOT-site.xml
No prior successful build to compare, so performing full copy of artifacts
[JENKINS] Archiving <https://builds.apache.org/job/maven-plugin-tools%20Jigsaw/ws/maven-plugin-tools-javadoc/pom.xml>
to org.apache.maven.plugin-tools/maven-plugin-tools-javadoc/3.6-SNAPSHOT/maven-plugin-tools-javadoc-3.6-SNAPSHOT.pom
No prior successful build to compare, so performing full copy of artifacts
[JENKINS] Archiving <https://builds.apache.org/job/maven-plugin-tools%20Jigsaw/ws/pom.xml>
to org.apache.maven.plugin-tools/maven-plugin-tools/3.6-SNAPSHOT/maven-plugin-tools-3.6-SNAPSHOT.pom
[JENKINS] Archiving <https://builds.apache.org/job/maven-plugin-tools%20Jigsaw/ws/target/maven-plugin-tools-3.6-SNAPSHOT-site.xml>
to org.apache.maven.plugin-tools/maven-plugin-tools/3.6-SNAPSHOT/maven-plugin-tools-3.6-SNAPSHOT-site.xml
No prior successful build to compare, so performing full copy of artifacts
[JENKINS] Archiving <https://builds.apache.org/job/maven-plugin-tools%20Jigsaw/ws/maven-plugin-annotations/pom.xml>
to org.apache.maven.plugin-tools/maven-plugin-annotations/3.6-SNAPSHOT/maven-plugin-annotations-3.6-SNAPSHOT.pom
[JENKINS] Archiving <https://builds.apache.org/job/maven-plugin-tools%20Jigsaw/ws/maven-plugin-annotations/target/maven-plugin-annotations-3.6-SNAPSHOT.jar>
to org.apache.maven.plugin-tools/maven-plugin-annotations/3.6-SNAPSHOT/maven-plugin-annotations-3.6-SNAPSHOT.jar
No prior successful build to compare, so performing full copy of artifacts
[JENKINS] Archiving <https://builds.apache.org/job/maven-plugin-tools%20Jigsaw/ws/maven-script/maven-script-ant/pom.xml>
to org.apache.maven.plugin-tools/maven-script-ant/3.6-SNAPSHOT/maven-script-ant-3.6-SNAPSHOT.pom
[JENKINS] Archiving <https://builds.apache.org/job/maven-plugin-tools%20Jigsaw/ws/maven-script/maven-script-ant/target/maven-script-ant-3.6-SNAPSHOT.jar>
to org.apache.maven.plugin-tools/maven-script-ant/3.6-SNAPSHOT/maven-script-ant-3.6-SNAPSHOT.jar
No prior successful build to compare, so performing full copy of artifacts
[JENKINS] Archiving <https://builds.apache.org/job/maven-plugin-tools%20Jigsaw/ws/maven-script/maven-script-beanshell/pom.xml>
to org.apache.maven.plugin-tools/maven-script-beanshell/3.6-SNAPSHOT/maven-script-beanshell-3.6-SNAPSHOT.pom
[JENKINS] Archiving <https://builds.apache.org/job/maven-plugin-tools%20Jigsaw/ws/maven-script/maven-script-beanshell/target/maven-script-beanshell-3.6-SNAPSHOT.jar>
to org.apache.maven.plugin-tools/maven-script-beanshell/3.6-SNAPSHOT/maven-script-beanshell-3.6-SNAPSHOT.jar
No prior successful build to compare, so performing full copy of artifacts
[JENKINS] Archiving <https://builds.apache.org/job/maven-plugin-tools%20Jigsaw/ws/maven-plugin-tools-generators/pom.xml>
to org.apache.maven.plugin-tools/maven-plugin-tools-generators/3.6-SNAPSHOT/maven-plugin-tools-generators-3.6-SNAPSHOT.pom
No prior successful build to compare, so performing full copy of artifacts
[JENKINS] Archiving <https://builds.apache.org/job/maven-plugin-tools%20Jigsaw/ws/maven-plugin-tools-api/pom.xml>
to org.apache.maven.plugin-tools/maven-plugin-tools-api/3.6-SNAPSHOT/maven-plugin-tools-api-3.6-SNAPSHOT.pom
[JENKINS] Archiving <https://builds.apache.org/job/maven-plugin-tools%20Jigsaw/ws/maven-plugin-tools-api/target/maven-plugin-tools-api-3.6-SNAPSHOT.jar>
to org.apache.maven.plugin-tools/maven-plugin-tools-api/3.6-SNAPSHOT/maven-plugin-tools-api-3.6-SNAPSHOT.jar
No prior successful build to compare, so performing full copy of artifacts
[JENKINS] Archiving <https://builds.apache.org/job/maven-plugin-tools%20Jigsaw/ws/maven-script/maven-plugin-tools-beanshell/pom.xml>
to org.apache.maven.plugin-tools/maven-plugin-tools-beanshell/3.6-SNAPSHOT/maven-plugin-tools-beanshell-3.6-SNAPSHOT.pom
[JENKINS] Archiving <https://builds.apache.org/job/maven-plugin-tools%20Jigsaw/ws/maven-script/maven-plugin-tools-beanshell/target/maven-plugin-tools-beanshell-3.6-SNAPSHOT.jar>
to org.apache.maven.plugin-tools/maven-plugin-tools-beanshell/3.6-SNAPSHOT/maven-plugin-tools-beanshell-3.6-SNAPSHOT.jar
No prior successful build to compare, so performing full copy of artifacts
[JENKINS] Archiving <https://builds.apache.org/job/maven-plugin-tools%20Jigsaw/ws/maven-plugin-tools-annotations/pom.xml>
to org.apache.maven.plugin-tools/maven-plugin-tools-annotations/3.6-SNAPSHOT/maven-plugin-tools-annotations-3.6-SNAPSHOT.pom
No prior successful build to compare, so performing full copy of artifacts
[JENKINS] Archiving <https://builds.apache.org/job/maven-plugin-tools%20Jigsaw/ws/maven-script/maven-plugin-tools-model/pom.xml>
to org.apache.maven.plugin-tools/maven-plugin-tools-model/3.6-SNAPSHOT/maven-plugin-tools-model-3.6-SNAPSHOT.pom
[JENKINS] Archiving <https://builds.apache.org/job/maven-plugin-tools%20Jigsaw/ws/maven-script/maven-plugin-tools-model/target/maven-plugin-tools-model-3.6-SNAPSHOT.jar>
to org.apache.maven.plugin-tools/maven-plugin-tools-model/3.6-SNAPSHOT/maven-plugin-tools-model-3.6-SNAPSHOT.jar
No prior successful build to compare, so performing full copy of artifacts
channel stopped

Mime
View raw message