maven-notifications mailing list archives

Site index · List index
Message view « Date » · « Thread »
Top « Date » · « Thread »
From Apache Jenkins Server <jenk...@builds.apache.org>
Subject Build failed in Jenkins: dist-tool-plugin #1518
Date Sun, 30 Oct 2016 09:57:23 GMT
See <https://builds.apache.org/job/dist-tool-plugin/1518/>

------------------------------------------
[...truncated 206 lines...]
[INFO] 
[INFO] --- maven-remote-resources-plugin:1.5:process (process-resource-bundles) @ dist-tool-plugin
---
[INFO] 
[INFO] --- maven-resources-plugin:2.7:resources (default-resources) @ dist-tool-plugin ---
[INFO] Using 'UTF-8' encoding to copy filtered resources.
[INFO] Copying 1 resource
[INFO] Copying 3 resources
[INFO] Copying 3 resources
[INFO] 
[INFO] --- maven-compiler-plugin:3.5.1:compile (default-compile) @ dist-tool-plugin ---
[INFO] Changes detected - recompiling the module!
[INFO] Compiling 21 source files to <https://builds.apache.org/job/dist-tool-plugin/ws/target/classes>
[INFO] <https://builds.apache.org/job/dist-tool-plugin/ws/src/main/java/org/apache/maven/dist/tools/site/CheckSiteResult.java>:
Some input files use or override a deprecated API.
[INFO] <https://builds.apache.org/job/dist-tool-plugin/ws/src/main/java/org/apache/maven/dist/tools/site/CheckSiteResult.java>:
Recompile with -Xlint:deprecation for details.
[INFO] <https://builds.apache.org/job/dist-tool-plugin/ws/src/main/java/org/apache/maven/dist/tools/prerequisites/ListPluginsPrerequisitesMojo.java>:
<https://builds.apache.org/job/dist-tool-plugin/ws/src/main/java/org/apache/maven/dist/tools/prerequisites/ListPluginsPrerequisitesMojo.java>
uses unchecked or unsafe operations.
[INFO] <https://builds.apache.org/job/dist-tool-plugin/ws/src/main/java/org/apache/maven/dist/tools/prerequisites/ListPluginsPrerequisitesMojo.java>:
Recompile with -Xlint:unchecked for details.
[INFO] 
[INFO] --- maven-plugin-plugin:3.4:descriptor (default-descriptor) @ dist-tool-plugin ---
[INFO] Using 'UTF-8' encoding to read mojo metadata.
[INFO] Mojo extractor with id: java-annotations found 7 mojo descriptors.
[INFO] Mojo extractor with id: java-javadoc found 0 mojo descriptors.
[INFO] 
[INFO] <<< maven-javadoc-plugin:2.10.3:test-javadoc < generate-test-sources @
dist-tool-plugin <<<
[INFO] configuring report plugin org.codehaus.mojo:findbugs-maven-plugin:3.0.3
[INFO] configuring report plugin org.codehaus.sonar-plugins:maven-report:0.1
[INFO] configuring report plugin org.apache.maven.dist.tools:dist-tool-plugin:1.0-SNAPSHOT
[INFO] configuring report plugin org.apache.maven.plugins:maven-plugin-plugin:3.4
[INFO] preparing 'report' report requires 'process-classes' forked phase execution
[INFO] 
[INFO] >>> maven-plugin-plugin:3.4:report > process-classes @ dist-tool-plugin
>>>
[INFO] 
[INFO] --- maven-enforcer-plugin:1.4.1:enforce (enforce-bytecode-version) @ dist-tool-plugin
---
[INFO] 
[INFO] --- maven-enforcer-plugin:1.4.1:enforce (ban-known-bad-maven-versions) @ dist-tool-plugin
---
[INFO] 
[INFO] --- apache-rat-plugin:0.11:check (rat-check) @ dist-tool-plugin ---
[INFO] 51 implicit excludes (use -debug for more details).
[INFO] Exclude: DEPENDENCIES
[INFO] Exclude: .repository/**
[INFO] 37 resources included (use -debug for more details)
[INFO] Rat check: Summary of files. Unapproved: 0 unknown: 0 generated: 0 approved: 36 licence.
[INFO] 
[INFO] --- maven-plugin-plugin:3.4:helpmojo (generated-helpmojo) @ dist-tool-plugin ---
[INFO] Using 'UTF-8' encoding to read mojo metadata.
[INFO] Mojo extractor with id: java-annotations found 7 mojo descriptors.
[INFO] Mojo extractor with id: java-javadoc found 0 mojo descriptors.
[INFO] 
[INFO] --- maven-remote-resources-plugin:1.5:process (process-resource-bundles) @ dist-tool-plugin
---
[INFO] 
[INFO] --- maven-resources-plugin:2.7:resources (default-resources) @ dist-tool-plugin ---
[INFO] Using 'UTF-8' encoding to copy filtered resources.
[INFO] Copying 1 resource
[INFO] Copying 3 resources
[INFO] Copying 3 resources
[INFO] 
[INFO] --- maven-compiler-plugin:3.5.1:compile (default-compile) @ dist-tool-plugin ---
[INFO] Changes detected - recompiling the module!
[INFO] Compiling 21 source files to <https://builds.apache.org/job/dist-tool-plugin/ws/target/classes>
[INFO] <https://builds.apache.org/job/dist-tool-plugin/ws/src/main/java/org/apache/maven/dist/tools/site/CheckSiteResult.java>:
Some input files use or override a deprecated API.
[INFO] <https://builds.apache.org/job/dist-tool-plugin/ws/src/main/java/org/apache/maven/dist/tools/site/CheckSiteResult.java>:
Recompile with -Xlint:deprecation for details.
[INFO] <https://builds.apache.org/job/dist-tool-plugin/ws/src/main/java/org/apache/maven/dist/tools/prerequisites/ListPluginsPrerequisitesMojo.java>:
<https://builds.apache.org/job/dist-tool-plugin/ws/src/main/java/org/apache/maven/dist/tools/prerequisites/ListPluginsPrerequisitesMojo.java>
uses unchecked or unsafe operations.
[INFO] <https://builds.apache.org/job/dist-tool-plugin/ws/src/main/java/org/apache/maven/dist/tools/prerequisites/ListPluginsPrerequisitesMojo.java>:
Recompile with -Xlint:unchecked for details.
[INFO] 
[INFO] --- maven-plugin-plugin:3.4:descriptor (default-descriptor) @ dist-tool-plugin ---
[INFO] Using 'UTF-8' encoding to read mojo metadata.
[INFO] Mojo extractor with id: java-annotations found 7 mojo descriptors.
[INFO] Mojo extractor with id: java-javadoc found 0 mojo descriptors.
[INFO] 
[INFO] <<< maven-plugin-plugin:3.4:report < process-classes @ dist-tool-plugin
<<<
[INFO] Fork Value is true
     [java] Warnings generated: 12
[INFO] Done FindBugs Analysis....
[INFO] Relativizing decoration links with respect to localized project URL: https://builds.apache.org/view/M-R/view/Maven/job/dist-tool-plugin/site/
[INFO] Rendering site with org.apache.maven.skins:maven-fluido-skin:jar:1.5 skin.
[INFO] Skipped "About" report (maven-project-info-reports-plugin:2.9:index), file "index.html"
already exists for the English version.
[INFO] Skipped "Surefire Report" report (maven-surefire-report-plugin:2.19.1:report-only),
file "surefire-report.html" already exists for the English version.
[INFO] Rendering 3 Doxia documents: 1 apt, 2 markdown
[INFO] Generating "Summary" report              --- maven-project-info-reports-plugin:2.9:summary
[INFO] Generating "Dependency Information" report --- maven-project-info-reports-plugin:2.9:dependency-info
[INFO] Generating "Team" report                 --- maven-project-info-reports-plugin:2.9:project-team
[INFO] Generating "Source Code Management" report --- maven-project-info-reports-plugin:2.9:scm
[INFO] Generating "Mailing Lists" report        --- maven-project-info-reports-plugin:2.9:mailing-list
[INFO] Generating "Dependency Management" report --- maven-project-info-reports-plugin:2.9:dependency-management
[INFO] Generating "Dependencies" report         --- maven-project-info-reports-plugin:2.9:dependencies
[INFO] Generating "Dependency Convergence" report --- maven-project-info-reports-plugin:2.9:dependency-convergence
[INFO] Generating "CI Management" report        --- maven-project-info-reports-plugin:2.9:cim
[INFO] Generating "Plugin Management" report    --- maven-project-info-reports-plugin:2.9:plugin-management
[INFO] Generating "Plugins" report              --- maven-project-info-reports-plugin:2.9:plugins
[INFO] Generating "Distribution Management" report --- maven-project-info-reports-plugin:2.9:distribution-management
[INFO] Generating "Surefire Report" report      --- maven-surefire-report-plugin:2.19.1:report
[INFO] Generating "Checkstyle" report           --- maven-checkstyle-plugin:2.15:checkstyle
[INFO] Generating "PMD" report                  --- maven-pmd-plugin:3.6:pmd
[INFO] Generating "Source Xref" report          --- maven-jxr-plugin:2.5:jxr
[INFO] Generating "Test Source Xref" report     --- maven-jxr-plugin:2.5:test-jxr
[INFO] Generating "Tag List" report             --- taglist-maven-plugin:2.4:taglist
[INFO] Generating "JavaDocs" report             --- maven-javadoc-plugin:2.10.3:javadoc
[ERROR] Error fetching link: http://jsoup.org/apidocs/package-list. Ignored it.
[ERROR] Error fetching link: http://www.eclipse.org/aether/aether-api/apidocs/package-list.
Ignored it.
[ERROR] Error fetching link: http://www.eclipse.org/aether/aether-util/apidocs/package-list.
Ignored it.
[ERROR] Error fetching link: http://xml.apache.org/commons/components/external/apidocs/package-list.
Ignored it.
[ERROR] Error fetching link: http://selenium.googlecode.com/selenium-firefox-driver/apidocs/package-list.
Ignored it.
[ERROR] Error fetching link: http://junit.org/apidocs/package-list. Ignored it.
[ERROR] Error fetching link: http://hc.apache.org/httpcomponents-client/apidocs/package-list.
Ignored it.
[INFO] Generating "Test JavaDocs" report        --- maven-javadoc-plugin:2.10.3:test-javadoc
[ERROR] Error fetching link: http://jsoup.org/apidocs/package-list. Ignored it.
[ERROR] Error fetching link: http://www.eclipse.org/aether/aether-api/apidocs/package-list.
Ignored it.
[ERROR] Error fetching link: http://www.eclipse.org/aether/aether-util/apidocs/package-list.
Ignored it.
[ERROR] Error fetching link: http://xml.apache.org/commons/components/external/apidocs/package-list.
Ignored it.
[ERROR] Error fetching link: http://selenium.googlecode.com/selenium-firefox-driver/apidocs/package-list.
Ignored it.
[ERROR] Error fetching link: http://junit.org/apidocs/package-list. Ignored it.
[ERROR] Error fetching link: http://hc.apache.org/httpcomponents-client/apidocs/package-list.
Ignored it.
[INFO] Generating "FindBugs" report             --- findbugs-maven-plugin:3.0.3:findbugs
[INFO] Generating "Sonar" report                --- maven-report:0.1:report
[INFO] Generating "Dist Tool> Check Sites" report --- dist-tool-plugin:1.0-SNAPSHOT:check-site
[INFO] Downloading: https://repo.maven.apache.org/maven2/org/apache/maven/doxia/doxia-sitetools/1.7.2/doxia-sitetools-1.7.2.pom
[INFO] Downloaded: https://repo.maven.apache.org/maven2/org/apache/maven/doxia/doxia-sitetools/1.7.2/doxia-sitetools-1.7.2.pom
(14 KB at 83.7 KB/sec)
[INFO] Downloading: https://repo.maven.apache.org/maven2/org/apache/maven/plugins/maven-compiler-plugin/3.6.0/maven-compiler-plugin-3.6.0.pom
[INFO] Downloaded: https://repo.maven.apache.org/maven2/org/apache/maven/plugins/maven-compiler-plugin/3.6.0/maven-compiler-plugin-3.6.0.pom
(11 KB at 610.4 KB/sec)
[INFO] Downloading: https://repo.maven.apache.org/maven2/org/apache/maven/plugins/maven-pmd-plugin/3.7/maven-pmd-plugin-3.7.pom
[INFO] Downloaded: https://repo.maven.apache.org/maven2/org/apache/maven/plugins/maven-pmd-plugin/3.7/maven-pmd-plugin-3.7.pom
(12 KB at 440.7 KB/sec)
[INFO] Downloading: https://repo.maven.apache.org/maven2/org/apache/maven/reporting/maven-reporting-exec/1.3/maven-reporting-exec-1.3.pom
[INFO] Downloaded: https://repo.maven.apache.org/maven2/org/apache/maven/reporting/maven-reporting-exec/1.3/maven-reporting-exec-1.3.pom
(12 KB at 246.0 KB/sec)
[INFO] Generating "Dist Tool> Check Source Release" report --- dist-tool-plugin:1.0-SNAPSHOT:check-source-release
[WARNING] Missing file for doxia-linkcheck in https://repo.maven.apache.org/maven2/org/apache/maven/doxia/doxia-linkcheck/1.2/
[WARNING]  > doxia-linkcheck-1.2-source-release.zip <
[WARNING]  > doxia-linkcheck-1.2-source-release.zip.asc <
[WARNING]  > doxia-linkcheck-1.2-source-release.zip.md5 <
[WARNING] Missing file for doxia-linkcheck in http://www.apache.org/dist/maven/doxia
[WARNING]  > doxia-linkcheck-1.2-source-release.zip <
[WARNING]  > doxia-linkcheck-1.2-source-release.zip.asc <
[WARNING]  > doxia-linkcheck-1.2-source-release.zip.md5 <
[ERROR] Missing file for maven-compiler-plugin in http://www.apache.org/dist/maven/plugins
[ERROR]  > maven-compiler-plugin-3.6.0-source-release.zip <
[ERROR]  > maven-compiler-plugin-3.6.0-source-release.zip.asc <
[ERROR]  > maven-compiler-plugin-3.6.0-source-release.zip.md5 <
[ERROR] Different version than 3.6.0 for maven-compiler-plugin available in http://www.apache.org/dist/maven/plugins
[ERROR]  > maven-compiler-plugin-3.5.1-source-release.zip <
[ERROR]  > maven-compiler-plugin-3.5.1-source-release.zip.asc <
[ERROR]  > maven-compiler-plugin-3.5.1-source-release.zip.md5 <
[WARNING] Missing file for apache-incubator-disclaimer-resource-bundle in https://repo.maven.apache.org/maven2/org/apache/apache-incubator-disclaimer-resource-bundle/1.1/
[WARNING]  > apache-incubator-disclaimer-resource-bundle-1.1-source-release.zip <
[WARNING]  > apache-incubator-disclaimer-resource-bundle-1.1-source-release.zip.asc <
[WARNING]  > apache-incubator-disclaimer-resource-bundle-1.1-source-release.zip.md5 <
[WARNING] Missing file for apache-incubator-disclaimer-resource-bundle in http://www.apache.org/dist/maven/resources
[WARNING]  > apache-incubator-disclaimer-resource-bundle-1.1-source-release.zip <
[WARNING]  > apache-incubator-disclaimer-resource-bundle-1.1-source-release.zip.asc <
[WARNING]  > apache-incubator-disclaimer-resource-bundle-1.1-source-release.zip.md5 <
[WARNING] Missing file for apache-jar-resource-bundle in https://repo.maven.apache.org/maven2/org/apache/apache-jar-resource-bundle/1.4/
[WARNING]  > apache-jar-resource-bundle-1.4-source-release.zip <
[WARNING]  > apache-jar-resource-bundle-1.4-source-release.zip.asc <
[WARNING]  > apache-jar-resource-bundle-1.4-source-release.zip.md5 <
[WARNING] Missing file for apache-jar-resource-bundle in http://www.apache.org/dist/maven/resources
[WARNING]  > apache-jar-resource-bundle-1.4-source-release.zip <
[WARNING]  > apache-jar-resource-bundle-1.4-source-release.zip.asc <
[WARNING]  > apache-jar-resource-bundle-1.4-source-release.zip.md5 <
[WARNING] Missing file for apache-license-header-resource-bundle in https://repo.maven.apache.org/maven2/org/apache/apache-license-header-resource-bundle/1.1/
[WARNING]  > apache-license-header-resource-bundle-1.1-source-release.zip <
[WARNING]  > apache-license-header-resource-bundle-1.1-source-release.zip.asc <
[WARNING]  > apache-license-header-resource-bundle-1.1-source-release.zip.md5 <
[WARNING] Missing file for apache-license-header-resource-bundle in http://www.apache.org/dist/maven/resources
[WARNING]  > apache-license-header-resource-bundle-1.1-source-release.zip <
[WARNING]  > apache-license-header-resource-bundle-1.1-source-release.zip.asc <
[WARNING]  > apache-license-header-resource-bundle-1.1-source-release.zip.md5 <
[INFO] Generating "Dist Tool> Check Index Pages" report --- dist-tool-plugin:1.0-SNAPSHOT:check-index-page
[ERROR] maven-compiler-plugin: found 3.5.1 instead of 3.6.0 in http://maven.apache.org/plugins/
[INFO] Generating "Dist Tool> Check Errors" report --- dist-tool-plugin:1.0-SNAPSHOT:check-errors
[INFO] Generating "Dist Tool> List Plugins Prerequisites" report --- dist-tool-plugin:1.0-SNAPSHOT:list-plugins-prerequisites
[INFO] Generating "Dist Tool> Failure Hack" report --- dist-tool-plugin:1.0-SNAPSHOT:failure-report
[ERROR] check-source-release.log error log not empty:
Missing file for maven-compiler-plugin in http://www.apache.org/dist/maven/plugins
 > maven-compiler-plugin-3.6.0-source-release.zip <
 > maven-compiler-plugin-3.6.0-source-release.zip.asc <
 > maven-compiler-plugin-3.6.0-source-release.zip.md5 <
Different version than 3.6.0 for maven-compiler-plugin available in http://www.apache.org/dist/maven/plugins
 > maven-compiler-plugin-3.5.1-source-release.zip <
 > maven-compiler-plugin-3.5.1-source-release.zip.asc <
 > maven-compiler-plugin-3.5.1-source-release.zip.md5 <

[ERROR] check-index-page.log error log not empty:
maven-compiler-plugin: found 3.5.1 instead of 3.6.0 in http://maven.apache.org/plugins/

[JENKINS] Archiving site from <https://builds.apache.org/job/dist-tool-plugin/ws/target/site>
to /x1/jenkins/jenkins-home/jobs/dist-tool-plugin/site
[INFO] ------------------------------------------------------------------------
[INFO] BUILD FAILURE
[INFO] ------------------------------------------------------------------------
[INFO] Total time: 05:07 min
[INFO] Finished at: 2016-10-30T09:56:55+00:00
[INFO] Final Memory: 88M/815M
[INFO] ------------------------------------------------------------------------
[WARNING] The requested profile "apache.snapshots" could not be activated because it does
not exist.
Waiting for Jenkins to finish collecting data
[ERROR] Failed to execute goal org.apache.maven.plugins:maven-site-plugin:3.5.1:site (default-site)
on project dist-tool-plugin: Error generating dist-tool-plugin:1.0-SNAPSHOT:failure-report:
Dist Tool> Checks found inconsistencies in some released artifacts, see https://builds.apache.org/job/dist-tool-plugin/site/dist-tool-check-errors.html
for more information -> [Help 1]
org.apache.maven.lifecycle.LifecycleExecutionException: Failed to execute goal org.apache.maven.plugins:maven-site-plugin:3.5.1:site
(default-site) on project dist-tool-plugin: Error generating dist-tool-plugin:1.0-SNAPSHOT:failure-report:
Dist Tool> Checks found inconsistencies in some released artifacts, see https://builds.apache.org/job/dist-tool-plugin/site/dist-tool-check-errors.html
for more information
	at org.apache.maven.lifecycle.internal.MojoExecutor.execute(MojoExecutor.java:212)
	at org.apache.maven.lifecycle.internal.MojoExecutor.execute(MojoExecutor.java:153)
	at org.apache.maven.lifecycle.internal.MojoExecutor.execute(MojoExecutor.java:145)
	at org.apache.maven.lifecycle.internal.LifecycleModuleBuilder.buildProject(LifecycleModuleBuilder.java:116)
	at org.apache.maven.lifecycle.internal.LifecycleModuleBuilder.buildProject(LifecycleModuleBuilder.java:80)
	at org.apache.maven.lifecycle.internal.builder.singlethreaded.SingleThreadedBuilder.build(SingleThreadedBuilder.java:51)
	at org.apache.maven.lifecycle.internal.LifecycleStarter.execute(LifecycleStarter.java:128)
	at org.apache.maven.DefaultMaven.doExecute(DefaultMaven.java:307)
	at org.apache.maven.DefaultMaven.doExecute(DefaultMaven.java:193)
	at org.apache.maven.DefaultMaven.execute(DefaultMaven.java:106)
	at org.jvnet.hudson.maven3.launcher.Maven32Launcher.main(Maven32Launcher.java:132)
	at sun.reflect.NativeMethodAccessorImpl.invoke0(Native Method)
	at sun.reflect.NativeMethodAccessorImpl.invoke(NativeMethodAccessorImpl.java:57)
	at sun.reflect.DelegatingMethodAccessorImpl.invoke(DelegatingMethodAccessorImpl.java:43)
	at java.lang.reflect.Method.invoke(Method.java:606)
	at org.codehaus.plexus.classworlds.launcher.Launcher.launchStandard(Launcher.java:330)
	at org.codehaus.plexus.classworlds.launcher.Launcher.launch(Launcher.java:238)
	at jenkins.maven3.agent.Maven32Main.launch(Maven32Main.java:186)
	at sun.reflect.NativeMethodAccessorImpl.invoke0(Native Method)
	at sun.reflect.NativeMethodAccessorImpl.invoke(NativeMethodAccessorImpl.java:57)
	at sun.reflect.DelegatingMethodAccessorImpl.invoke(DelegatingMethodAccessorImpl.java:43)
	at java.lang.reflect.Method.invoke(Method.java:606)
	at hudson.maven.Maven3Builder.call(Maven3Builder.java:136)
	at hudson.maven.Maven3Builder.call(Maven3Builder.java:71)
	at hudson.remoting.UserRequest.perform(UserRequest.java:153)
	at hudson.remoting.UserRequest.perform(UserRequest.java:50)
	at hudson.remoting.Request$2.run(Request.java:332)
	at hudson.remoting.InterceptingExecutorService$1.call(InterceptingExecutorService.java:68)
	at java.util.concurrent.FutureTask.run(FutureTask.java:262)
	at java.util.concurrent.ThreadPoolExecutor.runWorker(ThreadPoolExecutor.java:1145)
	at java.util.concurrent.ThreadPoolExecutor$Worker.run(ThreadPoolExecutor.java:615)
	at java.lang.Thread.run(Thread.java:745)
Caused by: org.apache.maven.plugin.MojoExecutionException: Error generating dist-tool-plugin:1.0-SNAPSHOT:failure-report:
Dist Tool> Checks found inconsistencies in some released artifacts, see https://builds.apache.org/job/dist-tool-plugin/site/dist-tool-check-errors.html
for more information
	at org.apache.maven.plugins.site.render.SiteMojo.execute(SiteMojo.java:140)
	at org.apache.maven.plugin.DefaultBuildPluginManager.executeMojo(DefaultBuildPluginManager.java:134)
	at org.apache.maven.lifecycle.internal.MojoExecutor.execute(MojoExecutor.java:207)
	... 31 more
Caused by: org.apache.maven.doxia.siterenderer.RendererException: Error generating dist-tool-plugin:1.0-SNAPSHOT:failure-report:
Dist Tool> Checks found inconsistencies in some released artifacts, see https://builds.apache.org/job/dist-tool-plugin/site/dist-tool-check-errors.html
for more information
	at org.apache.maven.plugins.site.render.ReportDocumentRenderer.renderDocument(ReportDocumentRenderer.java:242)
	at org.apache.maven.doxia.siterenderer.DefaultSiteRenderer.render(DefaultSiteRenderer.java:329)
	at org.apache.maven.plugins.site.render.SiteMojo.renderLocale(SiteMojo.java:181)
	at org.apache.maven.plugins.site.render.SiteMojo.execute(SiteMojo.java:135)
	... 33 more
Caused by: org.apache.maven.reporting.MavenReportException: Dist Tool> Checks found inconsistencies
in some released artifacts, see https://builds.apache.org/job/dist-tool-plugin/site/dist-tool-check-errors.html
for more information
	at org.apache.maven.dist.tools.DistCheckErrorsMojo.executeReport(DistCheckErrorsMojo.java:112)
	at org.apache.maven.reporting.AbstractMavenReport.generate(AbstractMavenReport.java:255)
	at org.apache.maven.plugins.site.render.ReportDocumentRenderer.renderDocument(ReportDocumentRenderer.java:227)
	... 36 more
[ERROR] 
[ERROR] Re-run Maven using the -X switch to enable full debug logging.
[ERROR] 
[ERROR] For more information about the errors and possible solutions, please read the following
articles:
[ERROR] [Help 1] http://cwiki.apache.org/confluence/display/MAVEN/MojoExecutionException
[JENKINS] Archiving <https://builds.apache.org/job/dist-tool-plugin/ws/pom.xml> to org.apache.maven.dist.tools/dist-tool-plugin/1.0-SNAPSHOT/dist-tool-plugin-1.0-SNAPSHOT.pom
[JENKINS] Archiving <https://builds.apache.org/job/dist-tool-plugin/ws/target/dist-tool-plugin-1.0-SNAPSHOT.jar>
to org.apache.maven.dist.tools/dist-tool-plugin/1.0-SNAPSHOT/dist-tool-plugin-1.0-SNAPSHOT.jar
channel stopped

Mime
View raw message