maven-notifications mailing list archives

Site index · List index
Message view « Date » · « Thread »
Top « Date » · « Thread »
From Apache Jenkins Server <jenk...@builds.apache.org>
Subject Build failed in Jenkins: maven-plugins-ITs-m3.0.4 #1759
Date Tue, 20 Sep 2016 18:02:29 GMT
See <https://builds.apache.org/job/maven-plugins-ITs-m3.0.4/1759/>

------------------------------------------
[...truncated 16619 lines...]
A         maven-stage-plugin/src/test/target-repository/org/apache/maven/maven-script-ant/2.0.3/maven-script-ant-2.0.3-javadoc.jar.asc
A         maven-stage-plugin/src/test/target-repository/org/apache/maven/maven-script-ant/2.0.3/maven-script-ant-2.0.3.pom.sha1
A         maven-stage-plugin/src/test/target-repository/org/apache/maven/maven-script-ant/2.0.4
A         maven-stage-plugin/src/test/target-repository/org/apache/maven/maven-script-ant/2.0.4/maven-script-ant-2.0.4-javadoc.jar.asc
A         maven-stage-plugin/src/test/target-repository/org/apache/maven/maven-script-ant/2.0.4/maven-script-ant-2.0.4.pom.sha1
A         maven-stage-plugin/src/test/target-repository/org/apache/maven/maven-script-ant/2.0.4/maven-script-ant-2.0.4-sources.jar.sha1
A         maven-stage-plugin/src/test/target-repository/org/apache/maven/maven-script-ant/2.0.4/maven-script-ant-2.0.4.pom
A         maven-stage-plugin/src/test/target-repository/org/apache/maven/maven-script-ant/2.0.4/maven-script-ant-2.0.4-sources.jar
A         maven-stage-plugin/src/test/target-repository/org/apache/maven/maven-script-ant/2.0.4/maven-script-ant-2.0.4.jar.md5
A         maven-stage-plugin/src/test/target-repository/org/apache/maven/maven-script-ant/2.0.4/maven-script-ant-2.0.4.pom.asc
A         maven-stage-plugin/src/test/target-repository/org/apache/maven/maven-script-ant/2.0.4/maven-script-ant-2.0.4-sources.jar.asc
A         maven-stage-plugin/src/test/target-repository/org/apache/maven/maven-script-ant/2.0.4/maven-script-ant-2.0.4-javadoc.jar.md5
A         maven-stage-plugin/src/test/target-repository/org/apache/maven/maven-script-ant/2.0.4/maven-script-ant-2.0.4.jar.sha1
A         maven-stage-plugin/src/test/target-repository/org/apache/maven/maven-script-ant/2.0.4/maven-script-ant-2.0.4-javadoc.jar.sha1
A         maven-stage-plugin/src/test/target-repository/org/apache/maven/maven-script-ant/2.0.4/maven-script-ant-2.0.4.jar
A         maven-stage-plugin/src/test/target-repository/org/apache/maven/maven-script-ant/2.0.4/maven-script-ant-2.0.4.pom.md5
A         maven-stage-plugin/src/test/target-repository/org/apache/maven/maven-script-ant/2.0.4/maven-script-ant-2.0.4-javadoc.jar
A         maven-stage-plugin/src/test/target-repository/org/apache/maven/maven-script-ant/2.0.4/maven-script-ant-2.0.4-sources.jar.md5
A         maven-stage-plugin/src/test/target-repository/org/apache/maven/maven-script-ant/2.0.4/maven-script-ant-2.0.4.jar.asc
A         maven-stage-plugin/src/test/target-repository/org/apache/maven/maven-script-ant/2.0.5
A         maven-stage-plugin/src/test/target-repository/org/apache/maven/maven-script-ant/2.0.5/maven-script-ant-2.0.5.pom.asc.md5
A         maven-stage-plugin/src/test/target-repository/org/apache/maven/maven-script-ant/2.0.5/maven-script-ant-2.0.5-javadoc.jar.asc
A         maven-stage-plugin/src/test/target-repository/org/apache/maven/maven-script-ant/2.0.5/maven-script-ant-2.0.5-sources.jar.asc.md5
A         maven-stage-plugin/src/test/target-repository/org/apache/maven/maven-script-ant/2.0.5/maven-script-ant-2.0.5.pom.sha1
A         maven-stage-plugin/src/test/target-repository/org/apache/maven/maven-script-ant/2.0.5/maven-script-ant-2.0.5-sources.jar.sha1
A         maven-stage-plugin/src/test/target-repository/org/apache/maven/maven-script-ant/2.0.5/maven-script-ant-2.0.5.pom
A         maven-stage-plugin/src/test/target-repository/org/apache/maven/maven-script-ant/2.0.5/maven-script-ant-2.0.5-sources.jar
A         maven-stage-plugin/src/test/target-repository/org/apache/maven/maven-script-ant/2.0.5/maven-script-ant-2.0.5.pom.asc
A         maven-stage-plugin/src/test/target-repository/org/apache/maven/maven-script-ant/2.0.5/maven-script-ant-2.0.5-sources.jar.asc
A         maven-stage-plugin/src/test/target-repository/org/apache/maven/maven-script-ant/2.0.5/maven-script-ant-2.0.5-javadoc.jar.asc.md5.sha1
A         maven-stage-plugin/src/test/target-repository/org/apache/maven/maven-script-ant/2.0.5/maven-script-ant-2.0.5-javadoc.jar.asc.sha1.md5
A         maven-stage-plugin/src/test/target-repository/org/apache/maven/maven-script-ant/2.0.5/maven-script-ant-2.0.5.jar.sha1
A         maven-stage-plugin/src/test/target-repository/org/apache/maven/maven-script-ant/2.0.5/maven-script-ant-2.0.5-javadoc.jar.sha1.sha1
A         maven-stage-plugin/src/test/target-repository/org/apache/maven/maven-script-ant/2.0.5/maven-script-ant-2.0.5-javadoc.jar.asc.sha1.sha1
A         maven-stage-plugin/src/test/target-repository/org/apache/maven/maven-script-ant/2.0.5/maven-script-ant-2.0.5-javadoc.jar.asc.sha1
A         maven-stage-plugin/src/test/target-repository/org/apache/maven/maven-script-ant/2.0.5/maven-script-ant-2.0.5-sources.jar.asc.md5.sha1
A         maven-stage-plugin/src/test/target-repository/org/apache/maven/maven-script-ant/2.0.5/maven-script-ant-2.0.5-sources.jar.asc.sha1.md5
A         maven-stage-plugin/src/test/target-repository/org/apache/maven/maven-script-ant/2.0.5/maven-script-ant-2.0.5-sources.jar.sha1.sha1
A         maven-stage-plugin/src/test/target-repository/org/apache/maven/maven-script-ant/2.0.5/maven-script-ant-2.0.5-sources.jar.asc.sha1.sha1
A         maven-stage-plugin/src/test/target-repository/org/apache/maven/maven-script-ant/2.0.5/maven-script-ant-2.0.5-javadoc.jar.md5.md5
A         maven-stage-plugin/src/test/target-repository/org/apache/maven/maven-script-ant/2.0.5/maven-script-ant-2.0.5.pom.asc.sha1
A         maven-stage-plugin/src/test/target-repository/org/apache/maven/maven-script-ant/2.0.5/maven-script-ant-2.0.5-sources.jar.asc.sha1
A         maven-stage-plugin/src/test/target-repository/org/apache/maven/maven-script-ant/2.0.5/maven-script-ant-2.0.5-javadoc.jar.asc.md5.md5
A         maven-stage-plugin/src/test/target-repository/org/apache/maven/maven-script-ant/2.0.5/maven-script-ant-2.0.5-javadoc.jar.sha1.md5
A         maven-stage-plugin/src/test/target-repository/org/apache/maven/maven-script-ant/2.0.5/maven-script-ant-2.0.5-javadoc.jar.md5.sha1
A         maven-stage-plugin/src/test/target-repository/org/apache/maven/maven-script-ant/2.0.5/maven-script-ant-2.0.5.jar.md5
A         maven-stage-plugin/src/test/target-repository/org/apache/maven/maven-script-ant/2.0.5/maven-script-ant-2.0.5.jar.asc.md5
A         maven-stage-plugin/src/test/target-repository/org/apache/maven/maven-script-ant/2.0.5/maven-script-ant-2.0.5-sources.jar.md5.md5
A         maven-stage-plugin/src/test/target-repository/org/apache/maven/maven-script-ant/2.0.5/maven-script-ant-2.0.5-javadoc.jar.md5
A         maven-stage-plugin/src/test/target-repository/org/apache/maven/maven-script-ant/2.0.5/maven-script-ant-2.0.5-sources.jar.asc.md5.md5
A         maven-stage-plugin/src/test/target-repository/org/apache/maven/maven-script-ant/2.0.5/maven-script-ant-2.0.5-javadoc.jar.asc.md5
A         maven-stage-plugin/src/test/target-repository/org/apache/maven/maven-script-ant/2.0.5/maven-script-ant-2.0.5.jar
A         maven-stage-plugin/src/test/target-repository/org/apache/maven/maven-script-ant/2.0.5/maven-script-ant-2.0.5.jar.asc.sha1
A         maven-stage-plugin/src/test/target-repository/org/apache/maven/maven-script-ant/2.0.5/maven-script-ant-2.0.5-sources.jar.sha1.md5
A         maven-stage-plugin/src/test/target-repository/org/apache/maven/maven-script-ant/2.0.5/maven-script-ant-2.0.5-sources.jar.md5.sha1
A         maven-stage-plugin/src/test/target-repository/org/apache/maven/maven-script-ant/2.0.5/maven-script-ant-2.0.5-javadoc.jar.sha1
A         maven-stage-plugin/src/test/target-repository/org/apache/maven/maven-script-ant/2.0.5/maven-script-ant-2.0.5.pom.md5
A         maven-stage-plugin/src/test/target-repository/org/apache/maven/maven-script-ant/2.0.5/maven-script-ant-2.0.5-javadoc.jar
A         maven-stage-plugin/src/test/target-repository/org/apache/maven/maven-script-ant/2.0.5/maven-script-ant-2.0.5-sources.jar.md5
A         maven-stage-plugin/src/test/target-repository/org/apache/maven/maven-script-ant/2.0.5/maven-script-ant-2.0.5.jar.asc
AU        maven-stage-plugin/src/test/target-repository/org/apache/maven/maven-script-ant/maven-metadata.xml
A         maven-stage-plugin/src/test/target-repository/org/apache/maven/maven-script-ant/maven-metadata.xml.md5
A         maven-stage-plugin/src/test/target-repository/org/apache/maven/maven-monitor
A         maven-stage-plugin/src/test/target-repository/org/apache/maven/maven-monitor/2.0.1
A         maven-stage-plugin/src/test/target-repository/org/apache/maven/maven-monitor/2.0.1/maven-monitor-2.0.1-javadoc.jar.sha1
A         maven-stage-plugin/src/test/target-repository/org/apache/maven/maven-monitor/2.0.1/maven-monitor-2.0.1.jar
A         maven-stage-plugin/src/test/target-repository/org/apache/maven/maven-monitor/2.0.1/maven-monitor-2.0.1.pom.md5
A         maven-stage-plugin/src/test/target-repository/org/apache/maven/maven-monitor/2.0.1/maven-monitor-2.0.1-javadoc.jar
A         maven-stage-plugin/src/test/target-repository/org/apache/maven/maven-monitor/2.0.1/maven-monitor-2.0.1-sources.jar.md5
A         maven-stage-plugin/src/test/target-repository/org/apache/maven/maven-monitor/2.0.1/maven-monitor-2.0.1.jar.asc
A         maven-stage-plugin/src/test/target-repository/org/apache/maven/maven-monitor/2.0.1/maven-monitor-2.0.1-javadoc.jar.asc
A         maven-stage-plugin/src/test/target-repository/org/apache/maven/maven-monitor/2.0.1/maven-monitor-2.0.1.pom.sha1
A         maven-stage-plugin/src/test/target-repository/org/apache/maven/maven-monitor/2.0.1/maven-monitor-2.0.1-sources.jar.sha1
A         maven-stage-plugin/src/test/target-repository/org/apache/maven/maven-monitor/2.0.1/maven-monitor-2.0.1.pom
A         maven-stage-plugin/src/test/target-repository/org/apache/maven/maven-monitor/2.0.1/maven-monitor-2.0.1-sources.jar
A         maven-stage-plugin/src/test/target-repository/org/apache/maven/maven-monitor/2.0.1/maven-monitor-2.0.1.jar.md5
A         maven-stage-plugin/src/test/target-repository/org/apache/maven/maven-monitor/2.0.1/maven-monitor-2.0.1.pom.asc
A         maven-stage-plugin/src/test/target-repository/org/apache/maven/maven-monitor/2.0.1/maven-monitor-2.0.1-sources.jar.asc
A         maven-stage-plugin/src/test/target-repository/org/apache/maven/maven-monitor/2.0.1/maven-monitor-2.0.1-javadoc.jar.md5
A         maven-stage-plugin/src/test/target-repository/org/apache/maven/maven-monitor/2.0.1/maven-monitor-2.0.1.jar.sha1
A         maven-stage-plugin/src/test/target-repository/org/apache/maven/maven-monitor/maven-metadata.xml.sha1
A         maven-stage-plugin/src/test/target-repository/org/apache/maven/maven-monitor/2.0.2
A         maven-stage-plugin/src/test/target-repository/org/apache/maven/maven-monitor/2.0.2/maven-monitor-2.0.2-sources.jar.sha1
A         maven-stage-plugin/src/test/target-repository/org/apache/maven/maven-monitor/2.0.2/maven-monitor-2.0.2.pom
A         maven-stage-plugin/src/test/target-repository/org/apache/maven/maven-monitor/2.0.2/maven-monitor-2.0.2-sources.jar
A         maven-stage-plugin/src/test/target-repository/org/apache/maven/maven-monitor/2.0.2/maven-monitor-2.0.2.jar.md5
A         maven-stage-plugin/src/test/target-repository/org/apache/maven/maven-monitor/2.0.2/maven-monitor-2.0.2.pom.asc
A         maven-stage-plugin/src/test/target-repository/org/apache/maven/maven-monitor/2.0.2/maven-monitor-2.0.2-sources.jar.asc
A         maven-stage-plugin/src/test/target-repository/org/apache/maven/maven-monitor/2.0.2/maven-monitor-2.0.2-javadoc.jar.md5
A         maven-stage-plugin/src/test/target-repository/org/apache/maven/maven-monitor/2.0.2/maven-monitor-2.0.2.jar.sha1
A         maven-stage-plugin/src/test/target-repository/org/apache/maven/maven-monitor/2.0.2/maven-monitor-2.0.2-javadoc.jar.sha1
A         maven-stage-plugin/src/test/target-repository/org/apache/maven/maven-monitor/2.0.2/maven-monitor-2.0.2.jar
A         maven-stage-plugin/src/test/target-repository/org/apache/maven/maven-monitor/2.0.2/maven-monitor-2.0.2.pom.md5
A         maven-stage-plugin/src/test/target-repository/org/apache/maven/maven-monitor/2.0.2/maven-monitor-2.0.2-javadoc.jar
A         maven-stage-plugin/src/test/target-repository/org/apache/maven/maven-monitor/2.0.2/maven-monitor-2.0.2-sources.jar.md5
A         maven-stage-plugin/src/test/target-repository/org/apache/maven/maven-monitor/2.0.2/maven-monitor-2.0.2.jar.asc
A         maven-stage-plugin/src/test/target-repository/org/apache/maven/maven-monitor/2.0.2/maven-monitor-2.0.2-javadoc.jar.asc
A         maven-stage-plugin/src/test/target-repository/org/apache/maven/maven-monitor/2.0.2/maven-monitor-2.0.2.pom.sha1
A         maven-stage-plugin/src/test/target-repository/org/apache/maven/maven-monitor/2.0.3
A         maven-stage-plugin/src/test/target-repository/org/apache/maven/maven-monitor/2.0.3/maven-monitor-2.0.3-sources.jar.sha1
A         maven-stage-plugin/src/test/target-repository/org/apache/maven/maven-monitor/2.0.3/maven-monitor-2.0.3.pom
A         maven-stage-plugin/src/test/target-repository/org/apache/maven/maven-monitor/2.0.3/maven-monitor-2.0.3-sources.jar
A         maven-stage-plugin/src/test/target-repository/org/apache/maven/maven-monitor/2.0.3/maven-monitor-2.0.3.jar.md5
A         maven-stage-plugin/src/test/target-repository/org/apache/maven/maven-monitor/2.0.3/maven-monitor-2.0.3.pom.asc
A         maven-stage-plugin/src/test/target-repository/org/apache/maven/maven-monitor/2.0.3/maven-monitor-2.0.3-sources.jar.asc
A         maven-stage-plugin/src/test/target-repository/org/apache/maven/maven-monitor/2.0.3/maven-monitor-2.0.3-javadoc.jar.md5
A         maven-stage-plugin/src/test/target-repository/org/apache/maven/maven-monitor/2.0.3/maven-monitor-2.0.3.jar.sha1
A         maven-stage-plugin/src/test/target-repository/org/apache/maven/maven-monitor/2.0.3/maven-monitor-2.0.3-javadoc.jar.sha1
A         maven-stage-plugin/src/test/target-repository/org/apache/maven/maven-monitor/2.0.3/maven-monitor-2.0.3.jar
A         maven-stage-plugin/src/test/target-repository/org/apache/maven/maven-monitor/2.0.3/maven-monitor-2.0.3.pom.md5
A         maven-stage-plugin/src/test/target-repository/org/apache/maven/maven-monitor/2.0.3/maven-monitor-2.0.3-javadoc.jar
A         maven-stage-plugin/src/test/target-repository/org/apache/maven/maven-monitor/2.0.3/maven-monitor-2.0.3-sources.jar.md5
A         maven-stage-plugin/src/test/target-repository/org/apache/maven/maven-monitor/2.0.3/maven-monitor-2.0.3.jar.asc
A         maven-stage-plugin/src/test/target-repository/org/apache/maven/maven-monitor/2.0.3/maven-monitor-2.0.3-javadoc.jar.asc
A         maven-stage-plugin/src/test/target-repository/org/apache/maven/maven-monitor/2.0.3/maven-monitor-2.0.3.pom.sha1
A         maven-stage-plugin/src/test/target-repository/org/apache/maven/maven-monitor/2.0.4
A         maven-stage-plugin/src/test/target-repository/org/apache/maven/maven-monitor/2.0.4/maven-monitor-2.0.4-javadoc.jar
A         maven-stage-plugin/src/test/target-repository/org/apache/maven/maven-monitor/2.0.4/maven-monitor-2.0.4-sources.jar.md5
A         maven-stage-plugin/src/test/target-repository/org/apache/maven/maven-monitor/2.0.4/maven-monitor-2.0.4.jar.asc
A         maven-stage-plugin/src/test/target-repository/org/apache/maven/maven-monitor/2.0.4/maven-monitor-2.0.4-javadoc.jar.asc
A         maven-stage-plugin/src/test/target-repository/org/apache/maven/maven-monitor/2.0.4/maven-monitor-2.0.4.pom.sha1
A         maven-stage-plugin/src/test/target-repository/org/apache/maven/maven-monitor/2.0.4/maven-monitor-2.0.4-sources.jar.sha1
A         maven-stage-plugin/src/test/target-repository/org/apache/maven/maven-monitor/2.0.4/maven-monitor-2.0.4.pom
A         maven-stage-plugin/src/test/target-repository/org/apache/maven/maven-monitor/2.0.4/maven-monitor-2.0.4-sources.jar
A         maven-stage-plugin/src/test/target-repository/org/apache/maven/maven-monitor/2.0.4/maven-monitor-2.0.4.jar.md5
A         maven-stage-plugin/src/test/target-repository/org/apache/maven/maven-monitor/2.0.4/maven-monitor-2.0.4.pom.asc
A         maven-stage-plugin/src/test/target-repository/org/apache/maven/maven-monitor/2.0.4/maven-monitor-2.0.4-sources.jar.asc
A         maven-stage-plugin/src/test/target-repository/org/apache/maven/maven-monitor/2.0.4/maven-monitor-2.0.4-javadoc.jar.md5
A         maven-stage-plugin/src/test/target-repository/org/apache/maven/maven-monitor/2.0.4/maven-monitor-2.0.4.jar.sha1
A         maven-stage-plugin/src/test/target-repository/org/apache/maven/maven-monitor/2.0.4/maven-monitor-2.0.4-javadoc.jar.sha1
A         maven-stage-plugin/src/test/target-repository/org/apache/maven/maven-monitor/2.0.4/maven-monitor-2.0.4.jar
A         maven-stage-plugin/src/test/target-repository/org/apache/maven/maven-monitor/2.0.4/maven-monitor-2.0.4.pom.md5
A         maven-stage-plugin/src/test/target-repository/org/apache/maven/maven-monitor/2.0.5
A         maven-stage-plugin/src/test/target-repository/org/apache/maven/maven-monitor/2.0.5/maven-monitor-2.0.5.pom
A         maven-stage-plugin/src/test/target-repository/org/apache/maven/maven-monitor/2.0.5/maven-monitor-2.0.5-sources.jar
A         maven-stage-plugin/src/test/target-repository/org/apache/maven/maven-monitor/2.0.5/maven-monitor-2.0.5.pom.asc
A         maven-stage-plugin/src/test/target-repository/org/apache/maven/maven-monitor/2.0.5/maven-monitor-2.0.5-sources.jar.asc
A         maven-stage-plugin/src/test/target-repository/org/apache/maven/maven-monitor/2.0.5/maven-monitor-2.0.5-javadoc.jar.asc.md5.sha1
A         maven-stage-plugin/src/test/target-repository/org/apache/maven/maven-monitor/2.0.5/maven-monitor-2.0.5-javadoc.jar.asc.sha1.md5
A         maven-stage-plugin/src/test/target-repository/org/apache/maven/maven-monitor/2.0.5/maven-monitor-2.0.5.jar.sha1
A         maven-stage-plugin/src/test/target-repository/org/apache/maven/maven-monitor/2.0.5/maven-monitor-2.0.5-javadoc.jar.sha1.sha1
A         maven-stage-plugin/src/test/target-repository/org/apache/maven/maven-monitor/2.0.5/maven-monitor-2.0.5-javadoc.jar.asc.sha1.sha1
A         maven-stage-plugin/src/test/target-repository/org/apache/maven/maven-monitor/2.0.5/maven-monitor-2.0.5-javadoc.jar.asc.sha1
A         maven-stage-plugin/src/test/target-repository/org/apache/maven/maven-monitor/2.0.5/maven-monitor-2.0.5-sources.jar.asc.md5.sha1
A         maven-stage-plugin/src/test/target-repository/org/apache/maven/maven-monitor/2.0.5/maven-monitor-2.0.5-sources.jar.asc.sha1.md5
A         maven-stage-plugin/src/test/target-repository/org/apache/maven/maven-monitor/2.0.5/maven-monitor-2.0.5-sources.jar.sha1.sha1
A         maven-stage-plugin/src/test/target-repository/org/apache/maven/maven-monitor/2.0.5/maven-monitor-2.0.5-sources.jar.asc.sha1.sha1
A         maven-stage-plugin/src/test/target-repository/org/apache/maven/maven-monitor/2.0.5/maven-monitor-2.0.5-javadoc.jar.md5.md5
A         maven-stage-plugin/src/test/target-repository/org/apache/maven/maven-monitor/2.0.5/maven-monitor-2.0.5.pom.asc.sha1
A         maven-stage-plugin/src/test/target-repository/org/apache/maven/maven-monitor/2.0.5/maven-monitor-2.0.5-sources.jar.asc.sha1
A         maven-stage-plugin/src/test/target-repository/org/apache/maven/maven-monitor/2.0.5/maven-monitor-2.0.5-javadoc.jar.asc.md5.md5
A         maven-stage-plugin/src/test/target-repository/org/apache/maven/maven-monitor/2.0.5/maven-monitor-2.0.5.jar.md5
A         maven-stage-plugin/src/test/target-repository/org/apache/maven/maven-monitor/2.0.5/maven-monitor-2.0.5-javadoc.jar.md5.sha1
A         maven-stage-plugin/src/test/target-repository/org/apache/maven/maven-monitor/2.0.5/maven-monitor-2.0.5-javadoc.jar.sha1.md5
A         maven-stage-plugin/src/test/target-repository/org/apache/maven/maven-monitor/2.0.5/maven-monitor-2.0.5-javadoc.jar.md5
ERROR: Failed to check out http://svn.apache.org/repos/asf/maven/plugins/trunk
org.tmatesoft.svn.core.SVNException: svn: E200030: There are unfinished transactions detected
in '<https://builds.apache.org/job/maven-plugins-ITs-m3.0.4/ws/'>
	at org.tmatesoft.svn.core.internal.wc.SVNErrorManager.error(SVNErrorManager.java:64)
	at org.tmatesoft.svn.core.internal.wc.SVNErrorManager.error(SVNErrorManager.java:51)
	at org.tmatesoft.svn.core.internal.wc17.db.SVNWCDbRoot.ensureNoUnfinishedTransactions(SVNWCDbRoot.java:177)
	at org.tmatesoft.svn.core.internal.wc17.db.SVNWCDb.ensureNoUnfinishedTransactions(SVNWCDb.java:224)
	at org.tmatesoft.svn.core.internal.wc17.SVNWCContext.ensureNoUnfinishedTransactions(SVNWCContext.java:5165)
	at org.tmatesoft.svn.core.wc2.SvnOperationFactory.releaseWcContext(SvnOperationFactory.java:1259)
	at org.tmatesoft.svn.core.wc2.SvnOperationFactory.run(SvnOperationFactory.java:1249)
	at org.tmatesoft.svn.core.wc2.SvnOperation.run(SvnOperation.java:294)
	at hudson.scm.subversion.CheckoutUpdater$1.perform(CheckoutUpdater.java:119)
	at hudson.scm.subversion.WorkspaceUpdater$UpdateTask.delegateTo(WorkspaceUpdater.java:162)
	at hudson.scm.subversion.WorkspaceUpdater$UpdateTask.delegateTo(WorkspaceUpdater.java:170)
	at hudson.scm.subversion.UpdateUpdater$TaskImpl.perform(UpdateUpdater.java:183)
	at hudson.scm.subversion.WorkspaceUpdater$UpdateTask.delegateTo(WorkspaceUpdater.java:162)
	at hudson.scm.SubversionSCM$CheckOutTask.perform(SubversionSCM.java:996)
	at hudson.scm.SubversionSCM$CheckOutTask.invoke(SubversionSCM.java:972)
	at hudson.scm.SubversionSCM$CheckOutTask.invoke(SubversionSCM.java:948)
	at hudson.FilePath$FileCallableWrapper.call(FilePath.java:2772)
	at hudson.remoting.UserRequest.perform(UserRequest.java:153)
	at hudson.remoting.UserRequest.perform(UserRequest.java:50)
	at hudson.remoting.Request$2.run(Request.java:332)
	at hudson.remoting.InterceptingExecutorService$1.call(InterceptingExecutorService.java:68)
	at java.util.concurrent.FutureTask.run(FutureTask.java:262)
	at java.util.concurrent.ThreadPoolExecutor.runWorker(ThreadPoolExecutor.java:1145)
	at java.util.concurrent.ThreadPoolExecutor$Worker.run(ThreadPoolExecutor.java:615)
	at java.lang.Thread.run(Thread.java:745)
java.io.IOException: remote file operation failed: <https://builds.apache.org/job/maven-plugins-ITs-m3.0.4/ws/>
at hudson.remoting.Channel@43b1a5f:jenkins-test-f59: java.io.IOException: Failed to check
out http://svn.apache.org/repos/asf/maven/plugins/trunk
	at hudson.FilePath.act(FilePath.java:1014)
	at hudson.FilePath.act(FilePath.java:996)
	at hudson.scm.SubversionSCM.checkout(SubversionSCM.java:897)
	at hudson.scm.SubversionSCM.checkout(SubversionSCM.java:833)
	at hudson.scm.SCM.checkout(SCM.java:485)
	at hudson.model.AbstractProject.checkout(AbstractProject.java:1269)
	at hudson.model.AbstractBuild$AbstractBuildExecution.defaultCheckout(AbstractBuild.java:604)
	at jenkins.scm.SCMCheckoutStrategy.checkout(SCMCheckoutStrategy.java:86)
	at hudson.model.AbstractBuild$AbstractBuildExecution.run(AbstractBuild.java:529)
	at hudson.model.Run.execute(Run.java:1741)
	at hudson.model.FreeStyleBuild.run(FreeStyleBuild.java:43)
	at hudson.model.ResourceController.execute(ResourceController.java:98)
	at hudson.model.Executor.run(Executor.java:410)
Caused by: java.io.IOException: Failed to check out http://svn.apache.org/repos/asf/maven/plugins/trunk
	at hudson.scm.subversion.CheckoutUpdater$1.perform(CheckoutUpdater.java:130)
	at hudson.scm.subversion.WorkspaceUpdater$UpdateTask.delegateTo(WorkspaceUpdater.java:162)
	at hudson.scm.subversion.WorkspaceUpdater$UpdateTask.delegateTo(WorkspaceUpdater.java:170)
	at hudson.scm.subversion.UpdateUpdater$TaskImpl.perform(UpdateUpdater.java:183)
	at hudson.scm.subversion.WorkspaceUpdater$UpdateTask.delegateTo(WorkspaceUpdater.java:162)
	at hudson.scm.SubversionSCM$CheckOutTask.perform(SubversionSCM.java:996)
	at hudson.scm.SubversionSCM$CheckOutTask.invoke(SubversionSCM.java:972)
	at hudson.scm.SubversionSCM$CheckOutTask.invoke(SubversionSCM.java:948)
	at hudson.FilePath$FileCallableWrapper.call(FilePath.java:2772)
	at hudson.remoting.UserRequest.perform(UserRequest.java:153)
	at hudson.remoting.UserRequest.perform(UserRequest.java:50)
	at hudson.remoting.Request$2.run(Request.java:332)
	at hudson.remoting.InterceptingExecutorService$1.call(InterceptingExecutorService.java:68)
	at java.util.concurrent.FutureTask.run(FutureTask.java:262)
	at java.util.concurrent.ThreadPoolExecutor.runWorker(ThreadPoolExecutor.java:1145)
	at java.util.concurrent.ThreadPoolExecutor$Worker.run(ThreadPoolExecutor.java:615)
	at java.lang.Thread.run(Thread.java:745)
	at ......remote call to jenkins-test-f59(Native Method)
	at hudson.remoting.Channel.attachCallSiteStackTrace(Channel.java:1416)
	at hudson.remoting.UserResponse.retrieve(UserRequest.java:253)
	at hudson.remoting.Channel.call(Channel.java:781)
	at hudson.FilePath.act(FilePath.java:1007)
	... 12 more
Caused by: org.tmatesoft.svn.core.SVNException: svn: E200030: There are unfinished transactions
detected in '<https://builds.apache.org/job/maven-plugins-ITs-m3.0.4/ws/'>
	at org.tmatesoft.svn.core.internal.wc.SVNErrorManager.error(SVNErrorManager.java:64)
	at org.tmatesoft.svn.core.internal.wc.SVNErrorManager.error(SVNErrorManager.java:51)
	at org.tmatesoft.svn.core.internal.wc17.db.SVNWCDbRoot.ensureNoUnfinishedTransactions(SVNWCDbRoot.java:177)
	at org.tmatesoft.svn.core.internal.wc17.db.SVNWCDb.ensureNoUnfinishedTransactions(SVNWCDb.java:224)
	at org.tmatesoft.svn.core.internal.wc17.SVNWCContext.ensureNoUnfinishedTransactions(SVNWCContext.java:5165)
	at org.tmatesoft.svn.core.wc2.SvnOperationFactory.releaseWcContext(SvnOperationFactory.java:1259)
	at org.tmatesoft.svn.core.wc2.SvnOperationFactory.run(SvnOperationFactory.java:1249)
	at org.tmatesoft.svn.core.wc2.SvnOperation.run(SvnOperation.java:294)
	at hudson.scm.subversion.CheckoutUpdater$1.perform(CheckoutUpdater.java:119)
	at hudson.scm.subversion.WorkspaceUpdater$UpdateTask.delegateTo(WorkspaceUpdater.java:162)
	at hudson.scm.subversion.WorkspaceUpdater$UpdateTask.delegateTo(WorkspaceUpdater.java:170)
	at hudson.scm.subversion.UpdateUpdater$TaskImpl.perform(UpdateUpdater.java:183)
	at hudson.scm.subversion.WorkspaceUpdater$UpdateTask.delegateTo(WorkspaceUpdater.java:162)
	at hudson.scm.SubversionSCM$CheckOutTask.perform(SubversionSCM.java:996)
	at hudson.scm.SubversionSCM$CheckOutTask.invoke(SubversionSCM.java:972)
	at hudson.scm.SubversionSCM$CheckOutTask.invoke(SubversionSCM.java:948)
	at hudson.FilePath$FileCallableWrapper.call(FilePath.java:2772)
	at hudson.remoting.UserRequest.perform(UserRequest.java:153)
	at hudson.remoting.UserRequest.perform(UserRequest.java:50)
	at hudson.remoting.Request$2.run(Request.java:332)
	at hudson.remoting.InterceptingExecutorService$1.call(InterceptingExecutorService.java:68)
	at java.util.concurrent.FutureTask.run(FutureTask.java:262)
	at java.util.concurrent.ThreadPoolExecutor.runWorker(ThreadPoolExecutor.java:1145)
	at java.util.concurrent.ThreadPoolExecutor$Worker.run(ThreadPoolExecutor.java:615)
	at java.lang.Thread.run(Thread.java:745)
Recording test results
ERROR: Step ‘Publish JUnit test result report’ failed: No test report files were found.
Configuration error?


Mime
View raw message